UI tests for the reference application

Build: #732 failed

Job: Run QA UI Tests failed

Stages & jobs

  1. Ref App UI Testing

Build log

The build generated 909 lines of output. Download or view full build log

18-Nov-2021 02:00:06 Build Reference Application - UI - Run QA UI Tests #732 (REFAPP-UI-FRAMEWORK-732) started building on agent yue.openmrs.org
18-Nov-2021 02:00:06 Remote agent on host yue.openmrs.org
18-Nov-2021 02:00:07 Build working directory is /home/bamboo-agent/bamboo-agent/xml-data/build-dir/REFAPP-UI-FRAMEWORK
18-Nov-2021 02:00:07 Executing build Reference Application - UI - Run QA UI Tests #732 (REFAPP-UI-FRAMEWORK-732)
18-Nov-2021 02:00:07 Starting task 'Checkout uitestframework' of type 'com.atlassian.bamboo.plugins.vcs:task.vcs.checkout'
18-Nov-2021 02:00:07 Build always requires a clean checkout
18-Nov-2021 02:00:07 Cleaning build directory '/home/bamboo-agent/bamboo-agent/xml-data/build-dir/REFAPP-UI-FRAMEWORK'
18-Nov-2021 02:00:07 Checking out into /home/bamboo-agent/bamboo-agent/xml-data/build-dir/REFAPP-UI-FRAMEWORK
18-Nov-2021 02:00:07 Updating source code to revision: 8838c8eeee749c044f9846bcb0a31a7065db1260
18-Nov-2021 02:00:07 Creating local git repository in '/home/bamboo-agent/bamboo-agent/xml-data/build-dir/REFAPP-UI-FRAMEWORK/.git'.
18-Nov-2021 02:00:07 Initialized empty Git repository in /home/bamboo-agent/bamboo-agent/xml-data/build-dir/REFAPP-UI-FRAMEWORK/.git/
18-Nov-2021 02:00:08 Fetching 'refs/heads/master' from 'git://github.com/openmrs/openmrs-contrib-uitestframework.git'.
18-Nov-2021 02:00:13 From git://github.com/openmrs/openmrs-contrib-uitestframework
18-Nov-2021 02:00:13 * [new branch]      master     -> master
18-Nov-2021 02:00:13 * [new tag]         1.0        -> 1.0
18-Nov-2021 02:00:13 * [new tag]         1.1        -> 1.1
18-Nov-2021 02:00:13 * [new tag]         1.2        -> 1.2
18-Nov-2021 02:00:13 * [new tag]         1.3        -> 1.3
18-Nov-2021 02:00:13 * [new tag]         1.4        -> 1.4
18-Nov-2021 02:00:13 * [new tag]         1.5        -> 1.5
18-Nov-2021 02:00:13 * [new tag]         1.5.1      -> 1.5.1
18-Nov-2021 02:00:13 * [new tag]         1.6        -> 1.6
18-Nov-2021 02:00:13 * [new tag]         1.7        -> 1.7
18-Nov-2021 02:00:13 * [new tag]         1.7.1      -> 1.7.1
18-Nov-2021 02:00:13 * [new tag]         1.7.2      -> 1.7.2
18-Nov-2021 02:00:13 * [new tag]         1.8        -> 1.8
18-Nov-2021 02:00:13 * [new tag]         2.0.0      -> 2.0.0
18-Nov-2021 02:00:13 * [new tag]         2.0.1      -> 2.0.1
18-Nov-2021 02:00:13 * [new tag]         2.1.0      -> 2.1.0
18-Nov-2021 02:00:13 * [new tag]         2.2.0      -> 2.2.0
18-Nov-2021 02:00:13 * [new tag]         2.3.0      -> 2.3.0
18-Nov-2021 02:00:13 * [new tag]         2.4.0      -> 2.4.0
18-Nov-2021 02:00:13 Checking out revision 8838c8eeee749c044f9846bcb0a31a7065db1260.
18-Nov-2021 02:00:14 Already on 'master'
18-Nov-2021 02:00:14 Updated source code to revision: 8838c8eeee749c044f9846bcb0a31a7065db1260
18-Nov-2021 02:00:14 Finished task 'Checkout uitestframework' with result: Success
18-Nov-2021 02:00:14 Running pre-build action: VCS Version Collector
18-Nov-2021 02:00:14 Running pre-build action: Sauce OnDemand Build Configurator
18-Nov-2021 02:00:14 Running pre-build action: Run Predator
18-Nov-2021 02:00:14 [PredatorPreBuildAction] Starting predator plugin, pre build agent cleaner
18-Nov-2021 02:00:14 [PredatorPreBuildAction] Running these commands: docker system prune -af; docker ps -q| xargs docker kill; docker ps -qa | xargs docker rm -f
18-Nov-2021 02:00:14 [PredatorPreBuildAction] Running command 'docker system prune -af'
18-Nov-2021 02:00:14 [PredatorPreBuildAction] Command 'docker system prune -af' completed with exit code 0
18-Nov-2021 02:00:14 [PredatorPreBuildAction] Running command 'docker ps -q| xargs docker kill'
18-Nov-2021 02:00:14 [PredatorPreBuildAction] Command 'docker ps -q| xargs docker kill' completed with exit code 125
18-Nov-2021 02:00:14 [PredatorPreBuildAction] Running command 'docker ps -qa | xargs docker rm -f'
18-Nov-2021 02:00:14 [PredatorPreBuildAction] Command 'docker ps -qa | xargs docker rm -f' completed with exit code 125
18-Nov-2021 02:00:14 [PredatorPreBuildAction] Identifying Bamboo agent process (or parent):  3815 java        2110 bamboo-age 3019Mb  943Mb 08:18:02 /usr/lib/jvm/java-8-ope
18-Nov-2021 02:00:14 [PredatorPreBuildAction] Identifying Bamboo agent process (or parent):  2110 wrapper        1 bamboo-age   22Mb    1Mb 01:42:40 /home/bamboo-agent/bamb
18-Nov-2021 02:00:14 [PredatorPreBuildAction] Identifying Bamboo agent process (or parent):     1 systemd        0 root        116Mb    4Mb 00:04:57 /lib/systemd/systemd --
18-Nov-2021 02:00:14 [PredatorPreBuildAction] No processes found for (chromium|chrome|webdriver|mysql|java |mvn )
18-Nov-2021 02:00:14 [PredatorPreBuildAction] Initial free space: 4.6102715 GB
18-Nov-2021 02:00:14 [PredatorPreBuildAction] Deleting folder /home/bamboo-agent/bamboo-agent/xml-data/build-dir/TRAN-TRAN-OWAOE
18-Nov-2021 02:00:14 [PredatorPreBuildAction] Deleting folder /home/bamboo-agent/bamboo-agent/xml-data/build-dir/OCL-OCLAPI2-BO
18-Nov-2021 02:00:14 [PredatorPreBuildAction] Deleting folder /home/bamboo-agent/bamboo-agent/xml-data/build-dir/OCL-OCLAPI20-BO
18-Nov-2021 02:00:15 [PredatorPreBuildAction] Deleting 0 snapshot folders from /home/bamboo-agent/.m2/repository
18-Nov-2021 02:00:15 [PredatorPreBuildAction] Maven snapshot disk freed: 0 GB
18-Nov-2021 02:00:15 [PredatorPreBuildAction] 0 empty artifacts were found and deleted by Predator
18-Nov-2021 02:00:15 [PredatorPreBuildAction] Maven stable disk freed: 0.0 GB, deleted 0 files
18-Nov-2021 02:00:15 [PredatorPreBuildAction] File /home/bamboo-agent/.npmrc does not exist.
18-Nov-2021 02:00:15 [PredatorPreBuildAction] File /home/bamboo-agent/.docker/config.json does not exist.
18-Nov-2021 02:00:15 [PredatorPreBuildAction] File /home/bamboo-agent/.OpenMRS/liquibaseUpdateLogs.txt does not exist.
18-Nov-2021 02:00:15 [PredatorPreBuildAction] Final free space: 4.612625 GB
18-Nov-2021 02:00:15 [PredatorPreBuildAction] Done
18-Nov-2021 02:00:16 Starting task 'Build uitestframework' of type 'com.atlassian.bamboo.plugins.maven:task.builder.mvn3'
18-Nov-2021 02:00:16
Beginning to execute external process for build 'Reference Application - UI - Run QA UI Tests #732 (REFAPP-UI-FRAMEWORK-732)'
... running command line:
/usr/share/apache-maven-3.3.9/bin/mvn --batch-mode -Djava.io.tmpdir=/home/bamboo-agent/bamboo-agent/.agent_tmp/REFAPP-UI-FRAMEWORK clean install
... in: /home/bamboo-agent/bamboo-agent/xml-data/build-dir/REFAPP-UI-FRAMEWORK
... using extra environment variables:
bamboo_planRepository_1_branch=master
bamboo_capability_system_builder_grailsBuilder_Grails_2_3_7=/opt/grails
bamboo_planRepository_2_branch=master
bamboo_planRepository_1_branchDisplayName=master
bamboo_repository_revision_number=8cc617441ffe92f20e26f39ad582aeb62a7183f0
MAVEN2_HOME=/usr/share/apache-maven-3.3.9
bamboo_saucelabs_username=rkorytkowski
bamboo_repository_207388681_previous_revision_number=8cc617441ffe92f20e26f39ad582aeb62a7183f0
bamboo_buildKey=REFAPP-UI-FRAMEWORK
bamboo_DISPLAY=10
bamboo_maven_release_version=2.8.0
bamboo_planRepository_2_branchDisplayName=master
bamboo_repository_207388681_name=Distribution
bamboo_shortJobName=Run QA UI Tests
bamboo_buildResultsUrl=https://ci.openmrs.org/browse/REFAPP-UI-FRAMEWORK-732
bamboo_planRepository_repositoryUrl=git://github.com/openmrs/openmrs-distro-referenceapplication.git
bamboo_agentId=189792258
bamboo_maven_development_version=
bamboo_capability_system_jdk_JDK_8=/usr/lib/jvm/java-8-openjdk-amd64
bamboo_planRepository_revision=8cc617441ffe92f20e26f39ad582aeb62a7183f0
bamboo_planRepository_previousRevision=8cc617441ffe92f20e26f39ad582aeb62a7183f0
bamboo_capability_system_jdk_JDK_1_8_0_265=/usr/lib/jvm/java-1.8.0-openjdk-amd64/
bamboo_repository_branch_name=master
bamboo_dockerhub_username=openmrsci
bamboo_refapp_distro_scm=git@github.com:openmrs/openmrs-distro-referenceapplication.git
bamboo_repository_207388681_branch_name=master
JAVA_HOME=/usr/lib/jvm/java-1.8.0-openjdk-amd64/
bamboo_repository_207388680_branch_name=master
bamboo_repository_207388681_git_username=
bamboo_planRepository_branch=master
bamboo_repository_207388681_revision_number=8cc617441ffe92f20e26f39ad582aeb62a7183f0
bamboo_capability_system_jdk_JDK_1_8_0_275=/usr/lib/jvm/java-1.8.0-openjdk-amd64/
bamboo_capability_system_jdk_JDK_1_8_0_272=/usr/lib/jvm/java-1.8.0-openjdk-amd64/
bamboo_capability_system_jdk_JDK_11=/usr/lib/jvm/java-11-openjdk-amd64
bamboo_planRepository_1_type=gitv2
bamboo_planRepository_branchName=master
bamboo_saucelabs_password=********
bamboo_capability_system_jdk_JDK=/usr/lib/jvm/java-1.8.0-openjdk-amd64/
bamboo_mavenBuildGoals=clean install
bamboo_hg_cache_directory=/home/bamboo-agent/bamboo-agent/xml-data/build-dir/_hg-repositories-cache
bamboo_planRepository_1_username=
bamboo_planRepository_type=gitv2
bamboo_git_cache_directory=/home/bamboo-agent/bamboo-agent/xml-data/build-dir/_git-repositories-cache
bamboo_planRepository_2_branchName=master
useMavenReturnCode=false
bamboo_capability_system_builder_node_Node_js=/usr/bin/node
bamboo_travis_password=********
bamboo_capability_system_builder_mvn3_Maven_3=/usr/share/apache-maven-3.3.9
bamboo_tmp_directory=/home/bamboo-agent/bamboo-agent/temp
bamboo_planKey=REFAPP-UI
bamboo_capability_system_builder_command_nvm=nvm
bamboo_planRepository_username=
bamboo_capability_system_jdk_JDK_1_8_0_282=/usr/lib/jvm/java-1.8.0-openjdk-amd64/
bamboo_planRepository_1_branchName=master
bamboo_dockerhub_password=********
bamboo_resultsUrl=https://ci.openmrs.org/browse/REFAPP-UI-FRAMEWORK-732
bamboo_capability_system_builder_command_transifex=/usr/bin/tx
bamboo_jdbc_password=********
bamboo_build_working_directory=/home/bamboo-agent/bamboo-agent/xml-data/build-dir/REFAPP-UI-FRAMEWORK
bamboo_planRepository_1_name=Distribution
bamboo_capability_system_jdk_JDK_1_8_0_292=/usr/lib/jvm/java-1.8.0-openjdk-amd64/
bamboo_preparing_refapp_distro_release=false
bamboo_shortPlanName=UI
bamboo_planRepository_2_username=
bamboo_planRepository_name=Distribution
bamboo_docs_aws_secret_key=********
bamboo_buildNumber=732
bamboo_repository_207388680_git_username=
bamboo_repository_207388681_git_repositoryUrl=git://github.com/openmrs/openmrs-distro-referenceapplication.git
bamboo_planName=Reference Application - UI
bamboo_shortPlanKey=UI
bamboo_shortJobKey=FRAMEWORK
bamboo_planRepository_2_name=UI Test Framework
bamboo_buildTimeStamp=2021-11-18T02:00:05.362Z
bamboo_repository_previous_revision_number=8cc617441ffe92f20e26f39ad582aeb62a7183f0
M2_HOME=/usr/share/apache-maven-3.3.9
bamboo_refapp_bamboo_build_number=
bamboo_repository_git_branch=master
bamboo_buildResultKey=REFAPP-UI-FRAMEWORK-732
bamboo_docs_aws_access_key=AKIAI7KMDL5KP2673G7A
bamboo_buildPlanName=Reference Application - UI - Run QA UI Tests
bamboo_openMRSVersion=2.1.3
bamboo_planRepository_1_revision=8cc617441ffe92f20e26f39ad582aeb62a7183f0
bamboo_repository_207388680_git_repositoryUrl=git://github.com/openmrs/openmrs-contrib-uitestframework.git
bamboo_repository_name=UI Test Framework
bamboo_capability_system_jdk_openjdk_8_jdk=/usr/lib/jvm/java-8-openjdk-amd64
bamboo_planRepository_2_previousRevision=8838c8eeee749c044f9846bcb0a31a7065db1260
bamboo_transifex_password=********
bamboo_repository_207388680_name=UI Test Framework
bamboo_capability_system_jdk_openjdk_11_jdk=/usr/lib/jvm/java-11-openjdk-amd64
bamboo_repository_207388680_previous_revision_number=8838c8eeee749c044f9846bcb0a31a7065db1260
bamboo_buildFailed=false
bamboo_capability_system_builder_grailsBuilder_Grails_2=/opt/grails
bamboo_capability_system_docker_executable=/usr/bin/docker
bamboo_capability_system_builder_command_Bash=/bin/bash
bamboo_agentWorkingDirectory=/home/bamboo-agent/bamboo-agent/xml-data/build-dir
bamboo_planRepository_2_revision=8838c8eeee749c044f9846bcb0a31a7065db1260
bamboo_capability_system_git_executable=/usr/bin/git
bamboo_repository_git_username=
bamboo_planRepository_1_previousRevision=8cc617441ffe92f20e26f39ad582aeb62a7183f0
bamboo_planRepository_branchDisplayName=master
bamboo_planRepository_2_type=gitv2
bamboo_plan_storageTag=plan-207093778
bamboo_repository_207388680_git_branch=master
bamboo_planRepository_2_repositoryUrl=git://github.com/openmrs/openmrs-contrib-uitestframework.git
bamboo_repository_git_repositoryUrl=git://github.com/openmrs/openmrs-distro-referenceapplication.git
bamboo_transifex_username=api
bamboo_refapp_distro_dev_branch=master
bamboo_working_directory=/home/bamboo-agent/bamboo-agent/xml-data/build-dir/REFAPP-UI-FRAMEWORK
bamboo_planRepository_1_repositoryUrl=git://github.com/openmrs/openmrs-distro-referenceapplication.git
bamboo_capability_system_jdk_JDK_1_8=/usr/lib/jvm/java-1.8.0-openjdk-amd64/
bamboo_repository_207388681_git_branch=master
bamboo_repository_207388680_revision_number=8838c8eeee749c044f9846bcb0a31a7065db1260
PATH=/usr/lib/jvm/java-1.8.0-openjdk-amd64//bin:/home/bamboo-agent/.nvm/versions/node/v10.22.1/bin:/home/bamboo-agent/bin:/home/bamboo-agent/.local/bin:/usr/local/sbin:/usr/local/bin:/usr/sbin:/usr/bin:/sbin:/bin:/usr/games:/usr/local/games:/snap/bin:/opt/puppetlabs/bin
18-Nov-2021 02:00:17 [INFO] Scanning for projects...
18-Nov-2021 02:00:17 [WARNING]
18-Nov-2021 02:00:17 [WARNING] Some problems were encountered while building the effective model for org.openmrs.contrib:uitestframework:jar:2.5.0-SNAPSHOT
18-Nov-2021 02:00:17 [WARNING] 'build.plugins.plugin.version' for org.apache.maven.plugins:maven-compiler-plugin is missing. @ line 125, column 21
18-Nov-2021 02:00:17 [WARNING]
18-Nov-2021 02:00:17 [WARNING] It is highly recommended to fix these problems because they threaten the stability of your build.
18-Nov-2021 02:00:17 [WARNING]
18-Nov-2021 02:00:17 [WARNING] For this reason, future Maven versions might no longer support building such malformed projects.
18-Nov-2021 02:00:17 [WARNING]
18-Nov-2021 02:00:17 [INFO]                                                                         
18-Nov-2021 02:00:17 [INFO] ------------------------------------------------------------------------
18-Nov-2021 02:00:17 [INFO] Building UI Test Framework 2.5.0-SNAPSHOT
18-Nov-2021 02:00:17 [INFO] ------------------------------------------------------------------------
18-Nov-2021 02:00:19 [INFO] Downloading: http://mavenrepo.openmrs.org/nexus/content/repositories/public/org/javassist/javassist/3.25.0-GA/javassist-3.25.0-GA.jar
18-Nov-2021 02:00:21 [INFO] Downloaded: http://mavenrepo.openmrs.org/nexus/content/repositories/public/org/javassist/javassist/3.25.0-GA/javassist-3.25.0-GA.jar (762 KB at 313.2 KB/sec)
18-Nov-2021 02:00:21 [INFO]
18-Nov-2021 02:00:21 [INFO] --- maven-clean-plugin:2.5:clean (default-clean) @ uitestframework ---
18-Nov-2021 02:00:21 [INFO]
18-Nov-2021 02:00:21 [INFO] --- maven-resources-plugin:2.6:resources (default-resources) @ uitestframework ---
18-Nov-2021 02:00:22 [WARNING] Using platform encoding (UTF-8 actually) to copy filtered resources, i.e. build is platform dependent!
18-Nov-2021 02:00:22 [INFO] Copying 5 resources
18-Nov-2021 02:00:22 [INFO]
18-Nov-2021 02:00:22 [INFO] --- maven-compiler-plugin:3.1:compile (default-compile) @ uitestframework ---
18-Nov-2021 02:00:22 [INFO] Changes detected - recompiling the module!
18-Nov-2021 02:00:22 [WARNING] File encoding has not been set, using platform encoding UTF-8, i.e. build is platform dependent!
18-Nov-2021 02:00:22 [INFO] Compiling 9 source files to /home/bamboo-agent/bamboo-agent/xml-data/build-dir/REFAPP-UI-FRAMEWORK/target/classes
18-Nov-2021 02:00:25 [WARNING] /home/bamboo-agent/bamboo-agent/xml-data/build-dir/REFAPP-UI-FRAMEWORK/src/main/java/org/openmrs/uitestframework/page/Page.java: Some input files use or override a deprecated API.
18-Nov-2021 02:00:25 [WARNING] /home/bamboo-agent/bamboo-agent/xml-data/build-dir/REFAPP-UI-FRAMEWORK/src/main/java/org/openmrs/uitestframework/page/Page.java: Recompile with -Xlint:deprecation for details.
18-Nov-2021 02:00:25 [INFO]
18-Nov-2021 02:00:25 [INFO] --- maven-resources-plugin:2.6:testResources (default-testResources) @ uitestframework ---
18-Nov-2021 02:00:25 [WARNING] Using platform encoding (UTF-8 actually) to copy filtered resources, i.e. build is platform dependent!
18-Nov-2021 02:00:25 [INFO] skip non existing resourceDirectory /home/bamboo-agent/bamboo-agent/xml-data/build-dir/REFAPP-UI-FRAMEWORK/src/test/resources
18-Nov-2021 02:00:25 [INFO]
18-Nov-2021 02:00:25 [INFO] --- maven-compiler-plugin:3.1:testCompile (default-testCompile) @ uitestframework ---
18-Nov-2021 02:00:25 [INFO] No sources to compile
18-Nov-2021 02:00:25 [INFO]
18-Nov-2021 02:00:25 [INFO] --- maven-surefire-plugin:2.12.4:test (default-test) @ uitestframework ---
18-Nov-2021 02:00:25 [INFO] No tests to run.
18-Nov-2021 02:00:25 [INFO]
18-Nov-2021 02:00:25 [INFO] --- maven-jar-plugin:2.4:jar (default-jar) @ uitestframework ---
18-Nov-2021 02:00:25 [INFO] Building jar: /home/bamboo-agent/bamboo-agent/xml-data/build-dir/REFAPP-UI-FRAMEWORK/target/uitestframework-2.5.0-SNAPSHOT.jar
18-Nov-2021 02:00:27 [INFO]
18-Nov-2021 02:00:27 [INFO] --- maven-install-plugin:2.4:install (default-install) @ uitestframework ---
18-Nov-2021 02:00:27 [INFO] Installing /home/bamboo-agent/bamboo-agent/xml-data/build-dir/REFAPP-UI-FRAMEWORK/target/uitestframework-2.5.0-SNAPSHOT.jar to /home/bamboo-agent/.m2/repository/org/openmrs/contrib/uitestframework/2.5.0-SNAPSHOT/uitestframework-2.5.0-SNAPSHOT.jar
18-Nov-2021 02:00:27 [INFO] Installing /home/bamboo-agent/bamboo-agent/xml-data/build-dir/REFAPP-UI-FRAMEWORK/pom.xml to /home/bamboo-agent/.m2/repository/org/openmrs/contrib/uitestframework/2.5.0-SNAPSHOT/uitestframework-2.5.0-SNAPSHOT.pom
18-Nov-2021 02:00:27 [INFO] ------------------------------------------------------------------------
18-Nov-2021 02:00:27 [INFO] BUILD SUCCESS
18-Nov-2021 02:00:27 [INFO] ------------------------------------------------------------------------
18-Nov-2021 02:00:27 [INFO] Total time: 9.849 s
18-Nov-2021 02:00:27 [INFO] Finished at: 2021-11-18T02:00:27+00:00
18-Nov-2021 02:00:27 [INFO] Final Memory: 29M/243M
18-Nov-2021 02:00:27 [INFO] ------------------------------------------------------------------------
18-Nov-2021 02:00:27 Finished task 'Build uitestframework' with result: Success
18-Nov-2021 02:00:27 Starting task 'Checkout distribution' of type 'com.atlassian.bamboo.plugins.vcs:task.vcs.checkout'
18-Nov-2021 02:00:27 Build always requires a clean checkout
18-Nov-2021 02:00:27 Cleaning build directory '/home/bamboo-agent/bamboo-agent/xml-data/build-dir/REFAPP-UI-FRAMEWORK'
18-Nov-2021 02:00:28 Checking out into /home/bamboo-agent/bamboo-agent/xml-data/build-dir/REFAPP-UI-FRAMEWORK
18-Nov-2021 02:00:28 Updating source code to revision: 8cc617441ffe92f20e26f39ad582aeb62a7183f0
18-Nov-2021 02:00:28 Creating local git repository in '/home/bamboo-agent/bamboo-agent/xml-data/build-dir/REFAPP-UI-FRAMEWORK/.git'.
18-Nov-2021 02:00:28 Initialized empty Git repository in /home/bamboo-agent/bamboo-agent/xml-data/build-dir/REFAPP-UI-FRAMEWORK/.git/
18-Nov-2021 02:00:28 Fetching 'refs/heads/master' from 'git://github.com/openmrs/openmrs-distro-referenceapplication.git'.
18-Nov-2021 02:00:31 From git://github.com/openmrs/openmrs-distro-referenceapplication
18-Nov-2021 02:00:31 * [new branch]      master     -> master
18-Nov-2021 02:00:31 * [new tag]         2.0.1769   -> 2.0.1769
18-Nov-2021 02:00:31 * [new tag]         2.1        -> 2.1
18-Nov-2021 02:00:31 * [new tag]         2.10.0     -> 2.10.0
18-Nov-2021 02:00:31 * [new tag]         2.11.0     -> 2.11.0
18-Nov-2021 02:00:31 * [new tag]         2.12.0     -> 2.12.0
18-Nov-2021 02:00:31 * [new tag]         2.2        -> 2.2
18-Nov-2021 02:00:31 * [new tag]         2.3        -> 2.3
18-Nov-2021 02:00:31 * [new tag]         2.4        -> 2.4
18-Nov-2021 02:00:31 * [new tag]         2.5        -> 2.5
18-Nov-2021 02:00:31 * [new tag]         2.6.0      -> 2.6.0
18-Nov-2021 02:00:31 * [new tag]         2.7.0      -> 2.7.0
18-Nov-2021 02:00:31 * [new tag]         2.8.0      -> 2.8.0
18-Nov-2021 02:00:31 * [new tag]         2.8.1      -> 2.8.1
18-Nov-2021 02:00:31 * [new tag]         2.9.0      -> 2.9.0
18-Nov-2021 02:00:31 * [new tag]         latest     -> latest
18-Nov-2021 02:00:31 Checking out revision 8cc617441ffe92f20e26f39ad582aeb62a7183f0.
18-Nov-2021 02:00:31 Already on 'master'
18-Nov-2021 02:00:31 Updated source code to revision: 8cc617441ffe92f20e26f39ad582aeb62a7183f0
18-Nov-2021 02:00:31 Finished task 'Checkout distribution' with result: Success
18-Nov-2021 02:00:31 Skipping execution of task 'deploy docker db and web containers' as it is disabled
18-Nov-2021 02:00:31 Starting task 'ensure refapp instance is app and prepare for testing' of type 'com.atlassian.bamboo.plugins.scripttask:task.builder.script'
18-Nov-2021 02:00:31
Beginning to execute external process for build 'Reference Application - UI - Run QA UI Tests #732 (REFAPP-UI-FRAMEWORK-732)'
... running command line:
/home/bamboo-agent/bamboo-agent/temp/REFAPP-UI-FRAMEWORK-732-ScriptBuildTask-8544150703792931463.sh
... in: /home/bamboo-agent/bamboo-agent/xml-data/build-dir/REFAPP-UI-FRAMEWORK
... using extra environment variables:
bamboo_planRepository_1_branch=master
bamboo_capability_system_builder_grailsBuilder_Grails_2_3_7=/opt/grails
bamboo_planRepository_2_branch=master
bamboo_planRepository_1_branchDisplayName=master
bamboo_repository_revision_number=8cc617441ffe92f20e26f39ad582aeb62a7183f0
bamboo_saucelabs_username=rkorytkowski
bamboo_repository_207388681_previous_revision_number=8cc617441ffe92f20e26f39ad582aeb62a7183f0
bamboo_buildKey=REFAPP-UI-FRAMEWORK
bamboo_DISPLAY=10
bamboo_maven_release_version=2.8.0
bamboo_planRepository_2_branchDisplayName=master
bamboo_repository_207388681_name=Distribution
bamboo_shortJobName=Run QA UI Tests
bamboo_buildResultsUrl=https://ci.openmrs.org/browse/REFAPP-UI-FRAMEWORK-732
bamboo_planRepository_repositoryUrl=git://github.com/openmrs/openmrs-distro-referenceapplication.git
bamboo_agentId=189792258
bamboo_maven_development_version=
bamboo_capability_system_jdk_JDK_8=/usr/lib/jvm/java-8-openjdk-amd64
bamboo_planRepository_revision=8cc617441ffe92f20e26f39ad582aeb62a7183f0
bamboo_planRepository_previousRevision=8cc617441ffe92f20e26f39ad582aeb62a7183f0
bamboo_capability_system_jdk_JDK_1_8_0_265=/usr/lib/jvm/java-1.8.0-openjdk-amd64/
bamboo_repository_branch_name=master
bamboo_dockerhub_username=openmrsci
bamboo_refapp_distro_scm=git@github.com:openmrs/openmrs-distro-referenceapplication.git
bamboo_repository_207388681_branch_name=master
bamboo_repository_207388680_branch_name=master
bamboo_repository_207388681_git_username=
bamboo_planRepository_branch=master
bamboo_repository_207388681_revision_number=8cc617441ffe92f20e26f39ad582aeb62a7183f0
bamboo_capability_system_jdk_JDK_1_8_0_275=/usr/lib/jvm/java-1.8.0-openjdk-amd64/
bamboo_capability_system_jdk_JDK_1_8_0_272=/usr/lib/jvm/java-1.8.0-openjdk-amd64/
bamboo_capability_system_jdk_JDK_11=/usr/lib/jvm/java-11-openjdk-amd64
bamboo_planRepository_1_type=gitv2
bamboo_planRepository_branchName=master
bamboo_saucelabs_password=********
bamboo_capability_system_jdk_JDK=/usr/lib/jvm/java-1.8.0-openjdk-amd64/
bamboo_mavenBuildGoals=clean install
bamboo_hg_cache_directory=/home/bamboo-agent/bamboo-agent/xml-data/build-dir/_hg-repositories-cache
bamboo_planRepository_1_username=
bamboo_planRepository_type=gitv2
bamboo_git_cache_directory=/home/bamboo-agent/bamboo-agent/xml-data/build-dir/_git-repositories-cache
bamboo_planRepository_2_branchName=master
bamboo_capability_system_builder_node_Node_js=/usr/bin/node
bamboo_build_commandline_com_atlassian_bamboo_plugins_maven_task_builder_mvn3_2=/usr/share/apache-maven-3.3.9/bin/mvn --batch-mode -Djava.io.tmpdir=/home/bamboo-agent/bamboo-agent/.agent_tmp/REFAPP-UI-FRAMEWORK clean install
bamboo_travis_password=********
bamboo_capability_system_builder_mvn3_Maven_3=/usr/share/apache-maven-3.3.9
bamboo_tmp_directory=/home/bamboo-agent/bamboo-agent/temp
bamboo_planKey=REFAPP-UI
bamboo_capability_system_builder_command_nvm=nvm
bamboo_planRepository_username=
bamboo_capability_system_jdk_JDK_1_8_0_282=/usr/lib/jvm/java-1.8.0-openjdk-amd64/
bamboo_planRepository_1_branchName=master
bamboo_dockerhub_password=********
bamboo_resultsUrl=https://ci.openmrs.org/browse/REFAPP-UI-FRAMEWORK-732
bamboo_capability_system_builder_command_transifex=/usr/bin/tx
bamboo_jdbc_password=********
bamboo_build_working_directory=/home/bamboo-agent/bamboo-agent/xml-data/build-dir/REFAPP-UI-FRAMEWORK
bamboo_planRepository_1_name=Distribution
bamboo_capability_system_jdk_JDK_1_8_0_292=/usr/lib/jvm/java-1.8.0-openjdk-amd64/
bamboo_preparing_refapp_distro_release=false
bamboo_shortPlanName=UI
bamboo_planRepository_2_username=
bamboo_planRepository_name=Distribution
bamboo_docs_aws_secret_key=********
bamboo_buildNumber=732
bamboo_repository_207388680_git_username=
bamboo_repository_207388681_git_repositoryUrl=git://github.com/openmrs/openmrs-distro-referenceapplication.git
bamboo_planName=Reference Application - UI
bamboo_shortPlanKey=UI
bamboo_shortJobKey=FRAMEWORK
bamboo_planRepository_2_name=UI Test Framework
bamboo_buildTimeStamp=2021-11-18T02:00:05.362Z
bamboo_repository_previous_revision_number=8cc617441ffe92f20e26f39ad582aeb62a7183f0
bamboo_refapp_bamboo_build_number=
bamboo_repository_git_branch=master
bamboo_buildResultKey=REFAPP-UI-FRAMEWORK-732
bamboo_docs_aws_access_key=AKIAI7KMDL5KP2673G7A
bamboo_buildPlanName=Reference Application - UI - Run QA UI Tests
bamboo_openMRSVersion=2.1.3
bamboo_planRepository_1_revision=8cc617441ffe92f20e26f39ad582aeb62a7183f0
bamboo_repository_207388680_git_repositoryUrl=git://github.com/openmrs/openmrs-contrib-uitestframework.git
bamboo_repository_name=UI Test Framework
bamboo_capability_system_jdk_openjdk_8_jdk=/usr/lib/jvm/java-8-openjdk-amd64
bamboo_planRepository_2_previousRevision=8838c8eeee749c044f9846bcb0a31a7065db1260
bamboo_transifex_password=********
bamboo_repository_207388680_name=UI Test Framework
bamboo_capability_system_jdk_openjdk_11_jdk=/usr/lib/jvm/java-11-openjdk-amd64
bamboo_repository_207388680_previous_revision_number=8838c8eeee749c044f9846bcb0a31a7065db1260
bamboo_buildFailed=false
bamboo_capability_system_builder_grailsBuilder_Grails_2=/opt/grails
bamboo_capability_system_docker_executable=/usr/bin/docker
bamboo_capability_system_builder_command_Bash=/bin/bash
bamboo_agentWorkingDirectory=/home/bamboo-agent/bamboo-agent/xml-data/build-dir
bamboo_planRepository_2_revision=8838c8eeee749c044f9846bcb0a31a7065db1260
bamboo_capability_system_git_executable=/usr/bin/git
bamboo_repository_git_username=
bamboo_planRepository_1_previousRevision=8cc617441ffe92f20e26f39ad582aeb62a7183f0
bamboo_planRepository_branchDisplayName=master
bamboo_planRepository_2_type=gitv2
bamboo_plan_storageTag=plan-207093778
bamboo_repository_207388680_git_branch=master
bamboo_planRepository_2_repositoryUrl=git://github.com/openmrs/openmrs-contrib-uitestframework.git
bamboo_repository_git_repositoryUrl=git://github.com/openmrs/openmrs-distro-referenceapplication.git
bamboo_transifex_username=api
bamboo_refapp_distro_dev_branch=master
bamboo_working_directory=/home/bamboo-agent/bamboo-agent/xml-data/build-dir/REFAPP-UI-FRAMEWORK
bamboo_planRepository_1_repositoryUrl=git://github.com/openmrs/openmrs-distro-referenceapplication.git
bamboo_capability_system_jdk_JDK_1_8=/usr/lib/jvm/java-1.8.0-openjdk-amd64/
bamboo_repository_207388681_git_branch=master
bamboo_repository_207388680_revision_number=8838c8eeee749c044f9846bcb0a31a7065db1260
18-Nov-2021 02:00:31 Finished task 'ensure refapp instance is app and prepare for testing' with result: Success
18-Nov-2021 02:00:31 Starting task 'Build distribution' of type 'com.atlassian.bamboo.plugins.maven:task.builder.mvn3'
18-Nov-2021 02:00:31
Beginning to execute external process for build 'Reference Application - UI - Run QA UI Tests #732 (REFAPP-UI-FRAMEWORK-732)'
... running command line:
/usr/share/apache-maven-3.3.9/bin/mvn --batch-mode -Djava.io.tmpdir=/home/bamboo-agent/bamboo-agent/.agent_tmp/REFAPP-UI-FRAMEWORK clean install -DskipTests=false -e
... in: /home/bamboo-agent/bamboo-agent/xml-data/build-dir/REFAPP-UI-FRAMEWORK
... using extra environment variables:
bamboo_planRepository_1_branch=master
bamboo_capability_system_builder_grailsBuilder_Grails_2_3_7=/opt/grails
bamboo_planRepository_2_branch=master
bamboo_planRepository_1_branchDisplayName=master
bamboo_repository_revision_number=8cc617441ffe92f20e26f39ad582aeb62a7183f0
MAVEN2_HOME=/usr/share/apache-maven-3.3.9
bamboo_saucelabs_username=rkorytkowski
bamboo_repository_207388681_previous_revision_number=8cc617441ffe92f20e26f39ad582aeb62a7183f0
bamboo_buildKey=REFAPP-UI-FRAMEWORK
bamboo_DISPLAY=10
bamboo_maven_release_version=2.8.0
bamboo_planRepository_2_branchDisplayName=master
bamboo_repository_207388681_name=Distribution
bamboo_shortJobName=Run QA UI Tests
bamboo_buildResultsUrl=https://ci.openmrs.org/browse/REFAPP-UI-FRAMEWORK-732
bamboo_planRepository_repositoryUrl=git://github.com/openmrs/openmrs-distro-referenceapplication.git
bamboo_agentId=189792258
bamboo_maven_development_version=
bamboo_capability_system_jdk_JDK_8=/usr/lib/jvm/java-8-openjdk-amd64
bamboo_planRepository_revision=8cc617441ffe92f20e26f39ad582aeb62a7183f0
bamboo_planRepository_previousRevision=8cc617441ffe92f20e26f39ad582aeb62a7183f0
bamboo_capability_system_jdk_JDK_1_8_0_265=/usr/lib/jvm/java-1.8.0-openjdk-amd64/
bamboo_repository_branch_name=master
bamboo_dockerhub_username=openmrsci
bamboo_refapp_distro_scm=git@github.com:openmrs/openmrs-distro-referenceapplication.git
bamboo_repository_207388681_branch_name=master
JAVA_HOME=/usr/lib/jvm/java-1.8.0-openjdk-amd64/
bamboo_repository_207388680_branch_name=master
bamboo_repository_207388681_git_username=
bamboo_planRepository_branch=master
bamboo_repository_207388681_revision_number=8cc617441ffe92f20e26f39ad582aeb62a7183f0
bamboo_capability_system_jdk_JDK_1_8_0_275=/usr/lib/jvm/java-1.8.0-openjdk-amd64/
bamboo_capability_system_jdk_JDK_1_8_0_272=/usr/lib/jvm/java-1.8.0-openjdk-amd64/
bamboo_capability_system_jdk_JDK_11=/usr/lib/jvm/java-11-openjdk-amd64
bamboo_planRepository_1_type=gitv2
bamboo_planRepository_branchName=master
bamboo_saucelabs_password=********
bamboo_capability_system_jdk_JDK=/usr/lib/jvm/java-1.8.0-openjdk-amd64/
bamboo_mavenBuildGoals=clean install
bamboo_hg_cache_directory=/home/bamboo-agent/bamboo-agent/xml-data/build-dir/_hg-repositories-cache
bamboo_planRepository_1_username=
bamboo_planRepository_type=gitv2
bamboo_git_cache_directory=/home/bamboo-agent/bamboo-agent/xml-data/build-dir/_git-repositories-cache
bamboo_planRepository_2_branchName=master
useMavenReturnCode=false
bamboo_capability_system_builder_node_Node_js=/usr/bin/node
bamboo_build_commandline_com_atlassian_bamboo_plugins_maven_task_builder_mvn3_2=/usr/share/apache-maven-3.3.9/bin/mvn --batch-mode -Djava.io.tmpdir=/home/bamboo-agent/bamboo-agent/.agent_tmp/REFAPP-UI-FRAMEWORK clean install
bamboo_travis_password=********
bamboo_capability_system_builder_mvn3_Maven_3=/usr/share/apache-maven-3.3.9
bamboo_tmp_directory=/home/bamboo-agent/bamboo-agent/temp
bamboo_planKey=REFAPP-UI
bamboo_capability_system_builder_command_nvm=nvm
bamboo_planRepository_username=
bamboo_capability_system_jdk_JDK_1_8_0_282=/usr/lib/jvm/java-1.8.0-openjdk-amd64/
bamboo_planRepository_1_branchName=master
bamboo_dockerhub_password=********
bamboo_resultsUrl=https://ci.openmrs.org/browse/REFAPP-UI-FRAMEWORK-732
bamboo_capability_system_builder_command_transifex=/usr/bin/tx
bamboo_jdbc_password=********
bamboo_build_working_directory=/home/bamboo-agent/bamboo-agent/xml-data/build-dir/REFAPP-UI-FRAMEWORK
bamboo_planRepository_1_name=Distribution
bamboo_capability_system_jdk_JDK_1_8_0_292=/usr/lib/jvm/java-1.8.0-openjdk-amd64/
bamboo_preparing_refapp_distro_release=false
bamboo_shortPlanName=UI
bamboo_planRepository_2_username=
bamboo_planRepository_name=Distribution
bamboo_docs_aws_secret_key=********
bamboo_buildNumber=732
bamboo_repository_207388680_git_username=
bamboo_repository_207388681_git_repositoryUrl=git://github.com/openmrs/openmrs-distro-referenceapplication.git
bamboo_planName=Reference Application - UI
bamboo_build_commandline_com_atlassian_bamboo_plugins_scripttask_task_builder_script_6=/home/bamboo-agent/bamboo-agent/temp/REFAPP-UI-FRAMEWORK-732-ScriptBuildTask-8544150703792931463.sh
bamboo_shortPlanKey=UI
bamboo_shortJobKey=FRAMEWORK
bamboo_planRepository_2_name=UI Test Framework
bamboo_buildTimeStamp=2021-11-18T02:00:05.362Z
bamboo_repository_previous_revision_number=8cc617441ffe92f20e26f39ad582aeb62a7183f0
M2_HOME=/usr/share/apache-maven-3.3.9
bamboo_refapp_bamboo_build_number=
bamboo_repository_git_branch=master
bamboo_buildResultKey=REFAPP-UI-FRAMEWORK-732
bamboo_docs_aws_access_key=AKIAI7KMDL5KP2673G7A
bamboo_buildPlanName=Reference Application - UI - Run QA UI Tests
bamboo_openMRSVersion=2.1.3
bamboo_planRepository_1_revision=8cc617441ffe92f20e26f39ad582aeb62a7183f0
bamboo_repository_207388680_git_repositoryUrl=git://github.com/openmrs/openmrs-contrib-uitestframework.git
bamboo_repository_name=UI Test Framework
bamboo_capability_system_jdk_openjdk_8_jdk=/usr/lib/jvm/java-8-openjdk-amd64
bamboo_planRepository_2_previousRevision=8838c8eeee749c044f9846bcb0a31a7065db1260
bamboo_transifex_password=********
bamboo_repository_207388680_name=UI Test Framework
bamboo_capability_system_jdk_openjdk_11_jdk=/usr/lib/jvm/java-11-openjdk-amd64
bamboo_repository_207388680_previous_revision_number=8838c8eeee749c044f9846bcb0a31a7065db1260
bamboo_buildFailed=false
bamboo_capability_system_builder_grailsBuilder_Grails_2=/opt/grails
bamboo_capability_system_docker_executable=/usr/bin/docker
bamboo_capability_system_builder_command_Bash=/bin/bash
bamboo_agentWorkingDirectory=/home/bamboo-agent/bamboo-agent/xml-data/build-dir
bamboo_planRepository_2_revision=8838c8eeee749c044f9846bcb0a31a7065db1260
bamboo_capability_system_git_executable=/usr/bin/git
bamboo_repository_git_username=
bamboo_planRepository_1_previousRevision=8cc617441ffe92f20e26f39ad582aeb62a7183f0
bamboo_planRepository_branchDisplayName=master
bamboo_planRepository_2_type=gitv2
bamboo_plan_storageTag=plan-207093778
bamboo_repository_207388680_git_branch=master
bamboo_planRepository_2_repositoryUrl=git://github.com/openmrs/openmrs-contrib-uitestframework.git
bamboo_repository_git_repositoryUrl=git://github.com/openmrs/openmrs-distro-referenceapplication.git
bamboo_transifex_username=api
bamboo_refapp_distro_dev_branch=master
bamboo_working_directory=/home/bamboo-agent/bamboo-agent/xml-data/build-dir/REFAPP-UI-FRAMEWORK
bamboo_planRepository_1_repositoryUrl=git://github.com/openmrs/openmrs-distro-referenceapplication.git
bamboo_capability_system_jdk_JDK_1_8=/usr/lib/jvm/java-1.8.0-openjdk-amd64/
bamboo_repository_207388681_git_branch=master
bamboo_repository_207388680_revision_number=8838c8eeee749c044f9846bcb0a31a7065db1260
PATH=/usr/lib/jvm/java-1.8.0-openjdk-amd64//bin:/home/bamboo-agent/.nvm/versions/node/v10.22.1/bin:/home/bamboo-agent/bin:/home/bamboo-agent/.local/bin:/usr/local/sbin:/usr/local/bin:/usr/sbin:/usr/bin:/sbin:/bin:/usr/games:/usr/local/games:/snap/bin:/opt/puppetlabs/bin
18-Nov-2021 02:00:32 [INFO] Error stacktraces are turned on.
18-Nov-2021 02:00:33 [INFO] Scanning for projects...
18-Nov-2021 02:00:33 [WARNING]
18-Nov-2021 02:00:33 [WARNING] Some problems were encountered while building the effective model for org.openmrs.distro:referenceapplication-ui-tests:jar:2.13.0-SNAPSHOT
18-Nov-2021 02:00:33 [WARNING] 'build.plugins.plugin.version' for org.apache.maven.plugins:maven-deploy-plugin is missing. @ line 88, column 21
18-Nov-2021 02:00:33 [WARNING]
18-Nov-2021 02:00:33 [WARNING] It is highly recommended to fix these problems because they threaten the stability of your build.
18-Nov-2021 02:00:33 [WARNING]
18-Nov-2021 02:00:33 [WARNING] For this reason, future Maven versions might no longer support building such malformed projects.
18-Nov-2021 02:00:33 [WARNING]
18-Nov-2021 02:00:33 [INFO] ------------------------------------------------------------------------
18-Nov-2021 02:00:33 [INFO] Reactor Build Order:
18-Nov-2021 02:00:33 [INFO]
18-Nov-2021 02:00:33 [INFO] Reference Application Distribution
18-Nov-2021 02:00:33 [INFO] Reference Application Distribution Package
18-Nov-2021 02:00:33 [INFO] Reference Application Distribution UI Tests
18-Nov-2021 02:00:33 [INFO]                                                                         
18-Nov-2021 02:00:33 [INFO] ------------------------------------------------------------------------
18-Nov-2021 02:00:33 [INFO] Building Reference Application Distribution 2.13.0-SNAPSHOT
18-Nov-2021 02:00:33 [INFO] ------------------------------------------------------------------------
18-Nov-2021 02:00:33 [INFO]
18-Nov-2021 02:00:33 [INFO] --- maven-clean-plugin:2.5:clean (default-clean) @ referenceapplication ---
18-Nov-2021 02:00:33 [INFO]
18-Nov-2021 02:00:33 [INFO] --- maven-install-plugin:2.4:install (default-install) @ referenceapplication ---
18-Nov-2021 02:00:33 [INFO] Installing /home/bamboo-agent/bamboo-agent/xml-data/build-dir/REFAPP-UI-FRAMEWORK/pom.xml to /home/bamboo-agent/.m2/repository/org/openmrs/distro/referenceapplication/2.13.0-SNAPSHOT/referenceapplication-2.13.0-SNAPSHOT.pom
18-Nov-2021 02:00:33 [INFO]                                                                         
18-Nov-2021 02:00:33 [INFO] ------------------------------------------------------------------------
18-Nov-2021 02:00:33 [INFO] Building Reference Application Distribution Package 2.13.0-SNAPSHOT
18-Nov-2021 02:00:33 [INFO] ------------------------------------------------------------------------
18-Nov-2021 02:00:34 [INFO]
18-Nov-2021 02:00:34 [INFO] --- maven-clean-plugin:2.5:clean (default-clean) @ referenceapplication-package ---
18-Nov-2021 02:00:34 [INFO]
18-Nov-2021 02:00:34 [INFO] --- maven-resources-plugin:2.6:resources (default-resources) @ referenceapplication-package ---
18-Nov-2021 02:00:34 [INFO] Using 'UTF-8' encoding to copy filtered resources.
18-Nov-2021 02:00:34 [INFO] Copying 1 resource
18-Nov-2021 02:00:34 [INFO] Copying 2 resources
18-Nov-2021 02:00:34 [INFO] skip non existing resourceDirectory /home/bamboo-agent/bamboo-agent/xml-data/build-dir/REFAPP-UI-FRAMEWORK/package/src/main/webapp
18-Nov-2021 02:00:34 [INFO]
18-Nov-2021 02:00:34 [INFO] --- openmrs-sdk-maven-plugin:4.0.0:build-distro (build-distro) @ referenceapplication-package ---
18-Nov-2021 02:00:34
18-Nov-2021 02:00:34 Downloading modules...
18-Nov-2021 02:00:34
18-Nov-2021 02:00:35 [INFO] Configured Artifact: org.openmrs.web:openmrs-webapp:2.4.1:war
18-Nov-2021 02:00:35 [INFO] Copying openmrs-webapp-2.4.1.war to /home/bamboo-agent/bamboo-agent/xml-data/build-dir/REFAPP-UI-FRAMEWORK/package/target/distro/web/openmrs-2.4.1.war
18-Nov-2021 02:00:35 file:/home/bamboo-agent/bamboo-agent/xml-data/build-dir/REFAPP-UI-FRAMEWORK/package/target/distro/web/openmrs-2.4.1.war
18-Nov-2021 02:00:35 target:/home/bamboo-agent/bamboo-agent/xml-data/build-dir/REFAPP-UI-FRAMEWORK/package/target/distro/web
18-Nov-2021 02:00:35 [INFO] Configured Artifact: org.openmrs.module:addresshierarchy-omod:2.14.2:jar
18-Nov-2021 02:00:35 [INFO] Configured Artifact: org.openmrs.module:legacyui-omod:1.10.0-SNAPSHOT:jar
18-Nov-2021 02:00:35 [INFO] Downloading: http://mavenrepo.openmrs.org/nexus/content/repositories/public/org/openmrs/module/legacyui-omod/1.10.0-SNAPSHOT/maven-metadata.xml
18-Nov-2021 02:00:36 [INFO] Downloaded: http://mavenrepo.openmrs.org/nexus/content/repositories/public/org/openmrs/module/legacyui-omod/1.10.0-SNAPSHOT/maven-metadata.xml (997 B at 0.9 KB/sec)
18-Nov-2021 02:00:36 [INFO] Downloading: http://mavenrepo.openmrs.org/nexus/content/repositories/public/org/openmrs/module/legacyui-omod/1.10.0-SNAPSHOT/legacyui-omod-1.10.0-20211111.144841-2.jar
18-Nov-2021 02:00:38 [INFO] Downloaded: http://mavenrepo.openmrs.org/nexus/content/repositories/public/org/openmrs/module/legacyui-omod/1.10.0-SNAPSHOT/legacyui-omod-1.10.0-20211111.144841-2.jar (3869 KB at 2055.4 KB/sec)
18-Nov-2021 02:00:38 [INFO] Configured Artifact: org.openmrs.module:openconceptlab-omod:1.2.9:jar
18-Nov-2021 02:00:38 [INFO] Configured Artifact: org.openmrs.module:metadatadeploy-omod:1.13.0:jar
18-Nov-2021 02:00:38 [INFO] Configured Artifact: org.openmrs.module:reportingrest-omod:1.12.0:jar
18-Nov-2021 02:00:38 [INFO] Configured Artifact: org.openmrs.module:owa-omod:1.13.0:jar
18-Nov-2021 02:00:38 [INFO] Configured Artifact: org.openmrs.module:fhir2-omod:1.3.0:jar
18-Nov-2021 02:00:38 [INFO] Configured Artifact: org.openmrs.module:serialization.xstream-omod:0.2.15:omod
18-Nov-2021 02:00:38 [INFO] Configured Artifact: org.openmrs.module:registrationapp-omod:1.24.0:jar
18-Nov-2021 02:00:38 [INFO] Configured Artifact: org.openmrs:event-omod:2.10.0:jar
18-Nov-2021 02:00:38 [INFO] Configured Artifact: org.openmrs.module:uilibrary-omod:2.0.7:jar
18-Nov-2021 02:00:38 [INFO] Configured Artifact: org.openmrs.module:htmlwidgets-omod:1.10.0:jar
18-Nov-2021 02:00:38 [INFO] Configured Artifact: org.openmrs.module:dataexchange-omod:1.3.7:jar
18-Nov-2021 02:00:38 [INFO] Configured Artifact: org.openmrs.module:appui-omod:1.15.0:jar
18-Nov-2021 02:00:38 [INFO] Configured Artifact: org.openmrs.module:allergyui-omod:1.8.4:jar
18-Nov-2021 02:00:38 [INFO] Configured Artifact: org.openmrs.module:providermanagement-omod:2.13.0:jar
18-Nov-2021 02:00:38 [INFO] Configured Artifact: org.openmrs.module:appointmentschedulingui-omod:1.12.0:jar
18-Nov-2021 02:00:38 [INFO] Configured Artifact: org.openmrs.module:attachments-omod:2.5.0:jar
18-Nov-2021 02:00:38 [INFO] Configured Artifact: org.openmrs.module:formentryapp-omod:1.4.2:jar
18-Nov-2021 02:00:38 [INFO] Configured Artifact: org.openmrs.module:idgen-omod:4.7.0:jar
18-Nov-2021 02:00:38 [INFO] Configured Artifact: org.openmrs.module:metadatamapping-omod:1.4.0:jar
18-Nov-2021 02:00:38 [INFO] Configured Artifact: org.openmrs.module:htmlformentryui-omod:2.2.0-SNAPSHOT:jar
18-Nov-2021 02:00:38 [INFO] Downloading: http://mavenrepo.openmrs.org/nexus/content/repositories/public/org/openmrs/module/htmlformentryui-omod/2.2.0-SNAPSHOT/maven-metadata.xml
18-Nov-2021 02:00:39 [INFO] Downloaded: http://mavenrepo.openmrs.org/nexus/content/repositories/public/org/openmrs/module/htmlformentryui-omod/2.2.0-SNAPSHOT/maven-metadata.xml (1004 B at 3.4 KB/sec)
18-Nov-2021 02:00:39 [INFO] Downloading: http://mavenrepo.openmrs.org/nexus/content/repositories/public/org/openmrs/module/htmlformentryui-omod/2.2.0-SNAPSHOT/htmlformentryui-omod-2.2.0-20211118.001705-16.jar
18-Nov-2021 02:00:40 [INFO] Downloaded: http://mavenrepo.openmrs.org/nexus/content/repositories/public/org/openmrs/module/htmlformentryui-omod/2.2.0-SNAPSHOT/htmlformentryui-omod-2.2.0-20211118.001705-16.jar (1431 KB at 1744.1 KB/sec)
18-Nov-2021 02:00:40 [INFO] Configured Artifact: org.openmrs.module:referencedemodata-omod:1.4.7:jar
18-Nov-2021 02:00:40 [INFO] Configured Artifact: org.openmrs.module:emrapi-omod:1.32.0:jar
18-Nov-2021 02:00:40 [INFO] Configured Artifact: org.openmrs.module:referenceapplication-omod:2.13.0-SNAPSHOT:jar
18-Nov-2021 02:00:40 [INFO] Downloading: http://mavenrepo.openmrs.org/nexus/content/repositories/public/org/openmrs/module/referenceapplication-omod/2.13.0-SNAPSHOT/maven-metadata.xml
18-Nov-2021 02:00:40 [INFO] Downloaded: http://mavenrepo.openmrs.org/nexus/content/repositories/public/org/openmrs/module/referenceapplication-omod/2.13.0-SNAPSHOT/maven-metadata.xml (799 B at 2.7 KB/sec)
18-Nov-2021 02:00:40 [INFO] Downloading: http://mavenrepo.openmrs.org/nexus/content/repositories/public/org/openmrs/module/referenceapplication-omod/2.13.0-SNAPSHOT/referenceapplication-omod-2.13.0-20211118.002013-38.jar
18-Nov-2021 02:00:41 [INFO] Downloaded: http://mavenrepo.openmrs.org/nexus/content/repositories/public/org/openmrs/module/referenceapplication-omod/2.13.0-SNAPSHOT/referenceapplication-omod-2.13.0-20211118.002013-38.jar (1902 KB at 2213.1 KB/sec)
18-Nov-2021 02:00:41 [INFO] Configured Artifact: org.openmrs.module:htmlformentry-omod:4.3.0-SNAPSHOT:jar
18-Nov-2021 02:00:41 [INFO] Downloading: http://mavenrepo.openmrs.org/nexus/content/repositories/public/org/openmrs/module/htmlformentry-omod/4.3.0-SNAPSHOT/maven-metadata.xml
18-Nov-2021 02:00:41 [INFO] Downloaded: http://mavenrepo.openmrs.org/nexus/content/repositories/public/org/openmrs/module/htmlformentry-omod/4.3.0-SNAPSHOT/maven-metadata.xml (998 B at 3.1 KB/sec)
18-Nov-2021 02:00:41 [INFO] Downloading: http://mavenrepo.openmrs.org/nexus/content/repositories/public/org/openmrs/module/htmlformentry-omod/4.3.0-SNAPSHOT/htmlformentry-omod-4.3.0-20211117.191258-2.jar
18-Nov-2021 02:00:42 [INFO] Downloaded: http://mavenrepo.openmrs.org/nexus/content/repositories/public/org/openmrs/module/htmlformentry-omod/4.3.0-SNAPSHOT/htmlformentry-omod-4.3.0-20211117.191258-2.jar (2357 KB at 2775.9 KB/sec)
18-Nov-2021 02:00:42 [INFO] Configured Artifact: org.openmrs.module:appframework-omod:2.16.0:jar
18-Nov-2021 02:00:42 [INFO] Configured Artifact: org.openmrs.module:referencemetadata-omod:2.12.0:jar
18-Nov-2021 02:00:42 [INFO] Configured Artifact: org.openmrs.module:reportingui-omod:1.8.0:jar
18-Nov-2021 02:00:42 [INFO] Configured Artifact: org.openmrs.module:coreapps-omod:1.35.0:jar
18-Nov-2021 02:00:42 [INFO] Configured Artifact: org.openmrs.module:reportingcompatibility-omod:2.0.8:jar
18-Nov-2021 02:00:42 [INFO] Configured Artifact: org.openmrs.module:reporting-omod:1.23.0:jar
18-Nov-2021 02:00:42 [INFO] Configured Artifact: org.openmrs.module:adminui-omod:1.6.0:jar
18-Nov-2021 02:00:42 [INFO] Configured Artifact: org.openmrs.module:registrationcore-omod:1.11.0:jar
18-Nov-2021 02:00:42 [INFO] Configured Artifact: org.openmrs.module:appointmentscheduling-omod:1.17.0-SNAPSHOT:jar
18-Nov-2021 02:00:42 [INFO] Downloading: http://mavenrepo.openmrs.org/nexus/content/repositories/public/org/openmrs/module/appointmentscheduling-omod/1.17.0-SNAPSHOT/maven-metadata.xml
18-Nov-2021 02:00:42 [INFO] Downloaded: http://mavenrepo.openmrs.org/nexus/content/repositories/public/org/openmrs/module/appointmentscheduling-omod/1.17.0-SNAPSHOT/maven-metadata.xml (797 B at 2.7 KB/sec)
18-Nov-2021 02:00:42 [INFO] Downloading: http://mavenrepo.openmrs.org/nexus/content/repositories/public/org/openmrs/module/appointmentscheduling-omod/1.17.0-SNAPSHOT/appointmentscheduling-omod-1.17.0-20211104.173619-2.jar
18-Nov-2021 02:00:43 [INFO] Downloaded: http://mavenrepo.openmrs.org/nexus/content/repositories/public/org/openmrs/module/appointmentscheduling-omod/1.17.0-SNAPSHOT/appointmentscheduling-omod-1.17.0-20211104.173619-2.jar (1539 KB at 2026.9 KB/sec)
18-Nov-2021 02:00:43 [INFO] Configured Artifact: org.openmrs.module:atlas-omod:2.2.5:omod
18-Nov-2021 02:00:43 [INFO] Configured Artifact: org.openmrs.module:calculation-omod:1.3.0:jar
18-Nov-2021 02:00:43 [INFO] Configured Artifact: org.openmrs.module:webservices.rest-omod:2.32.0:jar
18-Nov-2021 02:00:43 [INFO] Configured Artifact: org.openmrs.module:spa-omod:1.0.8:jar
18-Nov-2021 02:00:43 [INFO] Configured Artifact: org.openmrs.module:uicommons-omod:2.19.0:jar
18-Nov-2021 02:00:43 [INFO] Configured Artifact: org.openmrs.module:uiframework-omod:3.23.0-SNAPSHOT:jar
18-Nov-2021 02:00:43 [INFO] Downloading: http://mavenrepo.openmrs.org/nexus/content/repositories/public/org/openmrs/module/uiframework-omod/3.23.0-SNAPSHOT/maven-metadata.xml
18-Nov-2021 02:00:43 [INFO] Downloaded: http://mavenrepo.openmrs.org/nexus/content/repositories/public/org/openmrs/module/uiframework-omod/3.23.0-SNAPSHOT/maven-metadata.xml (1000 B at 3.5 KB/sec)
18-Nov-2021 02:00:43 [INFO] Downloading: http://mavenrepo.openmrs.org/nexus/content/repositories/public/org/openmrs/module/uiframework-omod/3.23.0-SNAPSHOT/uiframework-omod-3.23.0-20211104.111012-6.jar
18-Nov-2021 02:00:44 [INFO] Downloaded: http://mavenrepo.openmrs.org/nexus/content/repositories/public/org/openmrs/module/uiframework-omod/3.23.0-SNAPSHOT/uiframework-omod-3.23.0-20211104.111012-6.jar (2667 KB at 3252.0 KB/sec)
18-Nov-2021 02:00:44 [INFO] Configured Artifact: org.openmrs.module:metadatasharing-omod:1.8.0:jar
18-Nov-2021 02:00:44 [INFO] Copying addresshierarchy-omod-2.14.2.jar to /home/bamboo-agent/bamboo-agent/xml-data/build-dir/REFAPP-UI-FRAMEWORK/package/target/distro/web/modules/addresshierarchy-2.14.2.omod
18-Nov-2021 02:00:44 [INFO] Copying legacyui-omod-1.10.0-SNAPSHOT.jar to /home/bamboo-agent/bamboo-agent/xml-data/build-dir/REFAPP-UI-FRAMEWORK/package/target/distro/web/modules/legacyui-1.10.0-SNAPSHOT.omod
18-Nov-2021 02:00:44 [INFO] Copying openconceptlab-omod-1.2.9.jar to /home/bamboo-agent/bamboo-agent/xml-data/build-dir/REFAPP-UI-FRAMEWORK/package/target/distro/web/modules/openconceptlab-1.2.9.omod
18-Nov-2021 02:00:44 [INFO] Copying metadatadeploy-omod-1.13.0.jar to /home/bamboo-agent/bamboo-agent/xml-data/build-dir/REFAPP-UI-FRAMEWORK/package/target/distro/web/modules/metadatadeploy-1.13.0.omod
18-Nov-2021 02:00:44 [INFO] Copying reportingrest-omod-1.12.0.jar to /home/bamboo-agent/bamboo-agent/xml-data/build-dir/REFAPP-UI-FRAMEWORK/package/target/distro/web/modules/reportingrest-1.12.0.omod
18-Nov-2021 02:00:44 [INFO] Copying owa-omod-1.13.0.jar to /home/bamboo-agent/bamboo-agent/xml-data/build-dir/REFAPP-UI-FRAMEWORK/package/target/distro/web/modules/owa-1.13.0.omod
18-Nov-2021 02:00:44 [INFO] Copying fhir2-omod-1.3.0.jar to /home/bamboo-agent/bamboo-agent/xml-data/build-dir/REFAPP-UI-FRAMEWORK/package/target/distro/web/modules/fhir2-1.3.0.omod
18-Nov-2021 02:00:44 [INFO] Copying serialization.xstream-omod-0.2.15.omod to /home/bamboo-agent/bamboo-agent/xml-data/build-dir/REFAPP-UI-FRAMEWORK/package/target/distro/web/modules/serialization.xstream-0.2.15.omod
18-Nov-2021 02:00:44 [INFO] Copying registrationapp-omod-1.24.0.jar to /home/bamboo-agent/bamboo-agent/xml-data/build-dir/REFAPP-UI-FRAMEWORK/package/target/distro/web/modules/registrationapp-1.24.0.omod
18-Nov-2021 02:00:44 [INFO] Copying event-omod-2.10.0.jar to /home/bamboo-agent/bamboo-agent/xml-data/build-dir/REFAPP-UI-FRAMEWORK/package/target/distro/web/modules/event-2.10.0.omod
18-Nov-2021 02:00:44 [INFO] Copying uilibrary-omod-2.0.7.jar to /home/bamboo-agent/bamboo-agent/xml-data/build-dir/REFAPP-UI-FRAMEWORK/package/target/distro/web/modules/uilibrary-2.0.7.omod
18-Nov-2021 02:00:44 [INFO] Copying htmlwidgets-omod-1.10.0.jar to /home/bamboo-agent/bamboo-agent/xml-data/build-dir/REFAPP-UI-FRAMEWORK/package/target/distro/web/modules/htmlwidgets-1.10.0.omod
18-Nov-2021 02:00:44 [INFO] Copying dataexchange-omod-1.3.7.jar to /home/bamboo-agent/bamboo-agent/xml-data/build-dir/REFAPP-UI-FRAMEWORK/package/target/distro/web/modules/dataexchange-1.3.7.omod
18-Nov-2021 02:00:44 [INFO] Copying appui-omod-1.15.0.jar to /home/bamboo-agent/bamboo-agent/xml-data/build-dir/REFAPP-UI-FRAMEWORK/package/target/distro/web/modules/appui-1.15.0.omod
18-Nov-2021 02:00:44 [INFO] Copying allergyui-omod-1.8.4.jar to /home/bamboo-agent/bamboo-agent/xml-data/build-dir/REFAPP-UI-FRAMEWORK/package/target/distro/web/modules/allergyui-1.8.4.omod
18-Nov-2021 02:00:44 [INFO] Copying providermanagement-omod-2.13.0.jar to /home/bamboo-agent/bamboo-agent/xml-data/build-dir/REFAPP-UI-FRAMEWORK/package/target/distro/web/modules/providermanagement-2.13.0.omod
18-Nov-2021 02:00:44 [INFO] Copying appointmentschedulingui-omod-1.12.0.jar to /home/bamboo-agent/bamboo-agent/xml-data/build-dir/REFAPP-UI-FRAMEWORK/package/target/distro/web/modules/appointmentschedulingui-1.12.0.omod
18-Nov-2021 02:00:44 [INFO] Copying attachments-omod-2.5.0.jar to /home/bamboo-agent/bamboo-agent/xml-data/build-dir/REFAPP-UI-FRAMEWORK/package/target/distro/web/modules/attachments-2.5.0.omod
18-Nov-2021 02:00:44 [INFO] Copying formentryapp-omod-1.4.2.jar to /home/bamboo-agent/bamboo-agent/xml-data/build-dir/REFAPP-UI-FRAMEWORK/package/target/distro/web/modules/formentryapp-1.4.2.omod
18-Nov-2021 02:00:44 [INFO] Copying idgen-omod-4.7.0.jar to /home/bamboo-agent/bamboo-agent/xml-data/build-dir/REFAPP-UI-FRAMEWORK/package/target/distro/web/modules/idgen-4.7.0.omod
18-Nov-2021 02:00:44 [INFO] Copying metadatamapping-omod-1.4.0.jar to /home/bamboo-agent/bamboo-agent/xml-data/build-dir/REFAPP-UI-FRAMEWORK/package/target/distro/web/modules/metadatamapping-1.4.0.omod
18-Nov-2021 02:00:44 [INFO] Copying htmlformentryui-omod-2.2.0-SNAPSHOT.jar to /home/bamboo-agent/bamboo-agent/xml-data/build-dir/REFAPP-UI-FRAMEWORK/package/target/distro/web/modules/htmlformentryui-2.2.0-SNAPSHOT.omod
18-Nov-2021 02:00:44 [INFO] Copying referencedemodata-omod-1.4.7.jar to /home/bamboo-agent/bamboo-agent/xml-data/build-dir/REFAPP-UI-FRAMEWORK/package/target/distro/web/modules/referencedemodata-1.4.7.omod
18-Nov-2021 02:00:44 [INFO] Copying emrapi-omod-1.32.0.jar to /home/bamboo-agent/bamboo-agent/xml-data/build-dir/REFAPP-UI-FRAMEWORK/package/target/distro/web/modules/emrapi-1.32.0.omod
18-Nov-2021 02:00:44 [INFO] Copying referenceapplication-omod-2.13.0-SNAPSHOT.jar to /home/bamboo-agent/bamboo-agent/xml-data/build-dir/REFAPP-UI-FRAMEWORK/package/target/distro/web/modules/referenceapplication-2.13.0-SNAPSHOT.omod
18-Nov-2021 02:00:44 [INFO] Copying htmlformentry-omod-4.3.0-SNAPSHOT.jar to /home/bamboo-agent/bamboo-agent/xml-data/build-dir/REFAPP-UI-FRAMEWORK/package/target/distro/web/modules/htmlformentry-4.3.0-SNAPSHOT.omod
18-Nov-2021 02:00:44 [INFO] Copying appframework-omod-2.16.0.jar to /home/bamboo-agent/bamboo-agent/xml-data/build-dir/REFAPP-UI-FRAMEWORK/package/target/distro/web/modules/appframework-2.16.0.omod
18-Nov-2021 02:00:44 [INFO] Copying referencemetadata-omod-2.12.0.jar to /home/bamboo-agent/bamboo-agent/xml-data/build-dir/REFAPP-UI-FRAMEWORK/package/target/distro/web/modules/referencemetadata-2.12.0.omod
18-Nov-2021 02:00:44 [INFO] Copying reportingui-omod-1.8.0.jar to /home/bamboo-agent/bamboo-agent/xml-data/build-dir/REFAPP-UI-FRAMEWORK/package/target/distro/web/modules/reportingui-1.8.0.omod
18-Nov-2021 02:00:44 [INFO] Copying coreapps-omod-1.35.0.jar to /home/bamboo-agent/bamboo-agent/xml-data/build-dir/REFAPP-UI-FRAMEWORK/package/target/distro/web/modules/coreapps-1.35.0.omod
18-Nov-2021 02:00:44 [INFO] Copying reportingcompatibility-omod-2.0.8.jar to /home/bamboo-agent/bamboo-agent/xml-data/build-dir/REFAPP-UI-FRAMEWORK/package/target/distro/web/modules/reportingcompatibility-2.0.8.omod
18-Nov-2021 02:00:44 [INFO] Copying reporting-omod-1.23.0.jar to /home/bamboo-agent/bamboo-agent/xml-data/build-dir/REFAPP-UI-FRAMEWORK/package/target/distro/web/modules/reporting-1.23.0.omod
18-Nov-2021 02:00:44 [INFO] Copying adminui-omod-1.6.0.jar to /home/bamboo-agent/bamboo-agent/xml-data/build-dir/REFAPP-UI-FRAMEWORK/package/target/distro/web/modules/adminui-1.6.0.omod
18-Nov-2021 02:00:44 [INFO] Copying registrationcore-omod-1.11.0.jar to /home/bamboo-agent/bamboo-agent/xml-data/build-dir/REFAPP-UI-FRAMEWORK/package/target/distro/web/modules/registrationcore-1.11.0.omod
18-Nov-2021 02:00:44 [INFO] Copying appointmentscheduling-omod-1.17.0-SNAPSHOT.jar to /home/bamboo-agent/bamboo-agent/xml-data/build-dir/REFAPP-UI-FRAMEWORK/package/target/distro/web/modules/appointmentscheduling-1.17.0-SNAPSHOT.omod
18-Nov-2021 02:00:44 [INFO] Copying atlas-omod-2.2.5.omod to /home/bamboo-agent/bamboo-agent/xml-data/build-dir/REFAPP-UI-FRAMEWORK/package/target/distro/web/modules/atlas-2.2.5.omod
18-Nov-2021 02:00:44 [INFO] Copying calculation-omod-1.3.0.jar to /home/bamboo-agent/bamboo-agent/xml-data/build-dir/REFAPP-UI-FRAMEWORK/package/target/distro/web/modules/calculation-1.3.0.omod
18-Nov-2021 02:00:44 [INFO] Copying webservices.rest-omod-2.32.0.jar to /home/bamboo-agent/bamboo-agent/xml-data/build-dir/REFAPP-UI-FRAMEWORK/package/target/distro/web/modules/webservices.rest-2.32.0.omod
18-Nov-2021 02:00:44 [INFO] Copying spa-omod-1.0.8.jar to /home/bamboo-agent/bamboo-agent/xml-data/build-dir/REFAPP-UI-FRAMEWORK/package/target/distro/web/modules/spa-1.0.8.omod
18-Nov-2021 02:00:44 [INFO] Copying uicommons-omod-2.19.0.jar to /home/bamboo-agent/bamboo-agent/xml-data/build-dir/REFAPP-UI-FRAMEWORK/package/target/distro/web/modules/uicommons-2.19.0.omod
18-Nov-2021 02:00:44 [INFO] Copying uiframework-omod-3.23.0-SNAPSHOT.jar to /home/bamboo-agent/bamboo-agent/xml-data/build-dir/REFAPP-UI-FRAMEWORK/package/target/distro/web/modules/uiframework-3.23.0-SNAPSHOT.omod
18-Nov-2021 02:00:44 [INFO] Copying metadatasharing-omod-1.8.0.jar to /home/bamboo-agent/bamboo-agent/xml-data/build-dir/REFAPP-UI-FRAMEWORK/package/target/distro/web/modules/metadatasharing-1.8.0.omod
18-Nov-2021 02:00:44
18-Nov-2021 02:00:44 Downloading OWAs...
18-Nov-2021 02:00:44
18-Nov-2021 02:00:44
18-Nov-2021 02:00:44 Downloading OWA: org.openmrs.owa:openmrs-owa-sysadmin:1.2
18-Nov-2021 02:00:44 [INFO] Configured Artifact: org.openmrs.owa:sysadmin:1.2:zip
18-Nov-2021 02:00:44 [INFO] Copying sysadmin-1.2.zip to /home/bamboo-agent/bamboo-agent/xml-data/build-dir/REFAPP-UI-FRAMEWORK/package/target/distro/web/owa/sysadmin-1.2.zip
18-Nov-2021 02:00:44
18-Nov-2021 02:00:44 Creating Docker Compose configuration...
18-Nov-2021 02:00:44
18-Nov-2021 02:00:46
18-Nov-2021 02:00:46 The 'referenceapplication' distribution created! To start up the server run 'docker-compose up' from /home/bamboo-agent/bamboo-agent/xml-data/build-dir/REFAPP-UI-FRAMEWORK/package/target/distro
18-Nov-2021 02:00:46
18-Nov-2021 02:00:46 [INFO]
18-Nov-2021 02:00:46 [INFO] --- openmrs-sdk-maven-plugin:4.0.0:build-distro (build-bundled-distro) @ referenceapplication-package ---
18-Nov-2021 02:00:46
18-Nov-2021 02:00:46 Downloading modules...
18-Nov-2021 02:00:46
18-Nov-2021 02:00:46 [INFO] Configured Artifact: org.openmrs.web:openmrs-webapp:2.4.1:war
18-Nov-2021 02:00:46 [INFO] Copying openmrs-webapp-2.4.1.war to /home/bamboo-agent/bamboo-agent/xml-data/build-dir/REFAPP-UI-FRAMEWORK/package/target/bundled-distro/web/openmrs-2.4.1.war
18-Nov-2021 02:00:46 file:/home/bamboo-agent/bamboo-agent/xml-data/build-dir/REFAPP-UI-FRAMEWORK/package/target/bundled-distro/web/openmrs-2.4.1.war
18-Nov-2021 02:00:46 target:/home/bamboo-agent/bamboo-agent/xml-data/build-dir/REFAPP-UI-FRAMEWORK/package/target/bundled-distro/web
18-Nov-2021 02:00:46 [INFO] Configured Artifact: org.openmrs.module:addresshierarchy-omod:2.14.2:jar
18-Nov-2021 02:00:46 [INFO] Configured Artifact: org.openmrs.module:legacyui-omod:1.10.0-SNAPSHOT:jar
18-Nov-2021 02:00:46 [INFO] Configured Artifact: org.openmrs.module:openconceptlab-omod:1.2.9:jar
18-Nov-2021 02:00:46 [INFO] Configured Artifact: org.openmrs.module:metadatadeploy-omod:1.13.0:jar
18-Nov-2021 02:00:46 [INFO] Configured Artifact: org.openmrs.module:reportingrest-omod:1.12.0:jar
18-Nov-2021 02:00:46 [INFO] Configured Artifact: org.openmrs.module:owa-omod:1.13.0:jar
18-Nov-2021 02:00:46 [INFO] Configured Artifact: org.openmrs.module:fhir2-omod:1.3.0:jar
18-Nov-2021 02:00:46 [INFO] Configured Artifact: org.openmrs.module:serialization.xstream-omod:0.2.15:omod
18-Nov-2021 02:00:46 [INFO] Configured Artifact: org.openmrs.module:registrationapp-omod:1.24.0:jar
18-Nov-2021 02:00:46 [INFO] Configured Artifact: org.openmrs:event-omod:2.10.0:jar
18-Nov-2021 02:00:46 [INFO] Configured Artifact: org.openmrs.module:uilibrary-omod:2.0.7:jar
18-Nov-2021 02:00:46 [INFO] Configured Artifact: org.openmrs.module:htmlwidgets-omod:1.10.0:jar
18-Nov-2021 02:00:46 [INFO] Configured Artifact: org.openmrs.module:dataexchange-omod:1.3.7:jar
18-Nov-2021 02:00:46 [INFO] Configured Artifact: org.openmrs.module:appui-omod:1.15.0:jar
18-Nov-2021 02:00:46 [INFO] Configured Artifact: org.openmrs.module:allergyui-omod:1.8.4:jar
18-Nov-2021 02:00:46 [INFO] Configured Artifact: org.openmrs.module:providermanagement-omod:2.13.0:jar
18-Nov-2021 02:00:46 [INFO] Configured Artifact: org.openmrs.module:appointmentschedulingui-omod:1.12.0:jar
18-Nov-2021 02:00:46 [INFO] Configured Artifact: org.openmrs.module:attachments-omod:2.5.0:jar
18-Nov-2021 02:00:46 [INFO] Configured Artifact: org.openmrs.module:formentryapp-omod:1.4.2:jar
18-Nov-2021 02:00:46 [INFO] Configured Artifact: org.openmrs.module:idgen-omod:4.7.0:jar
18-Nov-2021 02:00:46 [INFO] Configured Artifact: org.openmrs.module:metadatamapping-omod:1.4.0:jar
18-Nov-2021 02:00:46 [INFO] Configured Artifact: org.openmrs.module:htmlformentryui-omod:2.2.0-SNAPSHOT:jar
18-Nov-2021 02:00:46 [INFO] Configured Artifact: org.openmrs.module:referencedemodata-omod:1.4.7:jar
18-Nov-2021 02:00:46 [INFO] Configured Artifact: org.openmrs.module:emrapi-omod:1.32.0:jar
18-Nov-2021 02:00:46 [INFO] Configured Artifact: org.openmrs.module:referenceapplication-omod:2.13.0-SNAPSHOT:jar
18-Nov-2021 02:00:46 [INFO] Configured Artifact: org.openmrs.module:htmlformentry-omod:4.3.0-SNAPSHOT:jar
18-Nov-2021 02:00:46 [INFO] Configured Artifact: org.openmrs.module:appframework-omod:2.16.0:jar
18-Nov-2021 02:00:46 [INFO] Configured Artifact: org.openmrs.module:referencemetadata-omod:2.12.0:jar
18-Nov-2021 02:00:46 [INFO] Configured Artifact: org.openmrs.module:reportingui-omod:1.8.0:jar
18-Nov-2021 02:00:46 [INFO] Configured Artifact: org.openmrs.module:coreapps-omod:1.35.0:jar
18-Nov-2021 02:00:46 [INFO] Configured Artifact: org.openmrs.module:reportingcompatibility-omod:2.0.8:jar
18-Nov-2021 02:00:46 [INFO] Configured Artifact: org.openmrs.module:reporting-omod:1.23.0:jar
18-Nov-2021 02:00:46 [INFO] Configured Artifact: org.openmrs.module:adminui-omod:1.6.0:jar
18-Nov-2021 02:00:46 [INFO] Configured Artifact: org.openmrs.module:registrationcore-omod:1.11.0:jar
18-Nov-2021 02:00:46 [INFO] Configured Artifact: org.openmrs.module:appointmentscheduling-omod:1.17.0-SNAPSHOT:jar
18-Nov-2021 02:00:46 [INFO] Configured Artifact: org.openmrs.module:atlas-omod:2.2.5:omod
18-Nov-2021 02:00:46 [INFO] Configured Artifact: org.openmrs.module:calculation-omod:1.3.0:jar
18-Nov-2021 02:00:46 [INFO] Configured Artifact: org.openmrs.module:webservices.rest-omod:2.32.0:jar
18-Nov-2021 02:00:46 [INFO] Configured Artifact: org.openmrs.module:spa-omod:1.0.8:jar
18-Nov-2021 02:00:46 [INFO] Configured Artifact: org.openmrs.module:uicommons-omod:2.19.0:jar
18-Nov-2021 02:00:46 [INFO] Configured Artifact: org.openmrs.module:uiframework-omod:3.23.0-SNAPSHOT:jar
18-Nov-2021 02:00:46 [INFO] Configured Artifact: org.openmrs.module:metadatasharing-omod:1.8.0:jar
18-Nov-2021 02:00:46 [INFO] Copying addresshierarchy-omod-2.14.2.jar to /home/bamboo-agent/bamboo-agent/xml-data/build-dir/REFAPP-UI-FRAMEWORK/package/target/bundled-distro/web/WEB-INF/bundledModules/addresshierarchy-2.14.2.omod
18-Nov-2021 02:00:46 [INFO] Copying legacyui-omod-1.10.0-SNAPSHOT.jar to /home/bamboo-agent/bamboo-agent/xml-data/build-dir/REFAPP-UI-FRAMEWORK/package/target/bundled-distro/web/WEB-INF/bundledModules/legacyui-1.10.0-SNAPSHOT.omod
18-Nov-2021 02:00:46 [INFO] Copying openconceptlab-omod-1.2.9.jar to /home/bamboo-agent/bamboo-agent/xml-data/build-dir/REFAPP-UI-FRAMEWORK/package/target/bundled-distro/web/WEB-INF/bundledModules/openconceptlab-1.2.9.omod
18-Nov-2021 02:00:46 [INFO] Copying metadatadeploy-omod-1.13.0.jar to /home/bamboo-agent/bamboo-agent/xml-data/build-dir/REFAPP-UI-FRAMEWORK/package/target/bundled-distro/web/WEB-INF/bundledModules/metadatadeploy-1.13.0.omod
18-Nov-2021 02:00:46 [INFO] Copying reportingrest-omod-1.12.0.jar to /home/bamboo-agent/bamboo-agent/xml-data/build-dir/REFAPP-UI-FRAMEWORK/package/target/bundled-distro/web/WEB-INF/bundledModules/reportingrest-1.12.0.omod
18-Nov-2021 02:00:46 [INFO] Copying owa-omod-1.13.0.jar to /home/bamboo-agent/bamboo-agent/xml-data/build-dir/REFAPP-UI-FRAMEWORK/package/target/bundled-distro/web/WEB-INF/bundledModules/owa-1.13.0.omod
18-Nov-2021 02:00:46 [INFO] Copying fhir2-omod-1.3.0.jar to /home/bamboo-agent/bamboo-agent/xml-data/build-dir/REFAPP-UI-FRAMEWORK/package/target/bundled-distro/web/WEB-INF/bundledModules/fhir2-1.3.0.omod
18-Nov-2021 02:00:46 [INFO] Copying serialization.xstream-omod-0.2.15.omod to /home/bamboo-agent/bamboo-agent/xml-data/build-dir/REFAPP-UI-FRAMEWORK/package/target/bundled-distro/web/WEB-INF/bundledModules/serialization.xstream-0.2.15.omod
18-Nov-2021 02:00:46 [INFO] Copying registrationapp-omod-1.24.0.jar to /home/bamboo-agent/bamboo-agent/xml-data/build-dir/REFAPP-UI-FRAMEWORK/package/target/bundled-distro/web/WEB-INF/bundledModules/registrationapp-1.24.0.omod
18-Nov-2021 02:00:46 [INFO] Copying event-omod-2.10.0.jar to /home/bamboo-agent/bamboo-agent/xml-data/build-dir/REFAPP-UI-FRAMEWORK/package/target/bundled-distro/web/WEB-INF/bundledModules/event-2.10.0.omod
18-Nov-2021 02:00:46 [INFO] Copying uilibrary-omod-2.0.7.jar to /home/bamboo-agent/bamboo-agent/xml-data/build-dir/REFAPP-UI-FRAMEWORK/package/target/bundled-distro/web/WEB-INF/bundledModules/uilibrary-2.0.7.omod
18-Nov-2021 02:00:46 [INFO] Copying htmlwidgets-omod-1.10.0.jar to /home/bamboo-agent/bamboo-agent/xml-data/build-dir/REFAPP-UI-FRAMEWORK/package/target/bundled-distro/web/WEB-INF/bundledModules/htmlwidgets-1.10.0.omod
18-Nov-2021 02:00:46 [INFO] Copying dataexchange-omod-1.3.7.jar to /home/bamboo-agent/bamboo-agent/xml-data/build-dir/REFAPP-UI-FRAMEWORK/package/target/bundled-distro/web/WEB-INF/bundledModules/dataexchange-1.3.7.omod
18-Nov-2021 02:00:46 [INFO] Copying appui-omod-1.15.0.jar to /home/bamboo-agent/bamboo-agent/xml-data/build-dir/REFAPP-UI-FRAMEWORK/package/target/bundled-distro/web/WEB-INF/bundledModules/appui-1.15.0.omod
18-Nov-2021 02:00:46 [INFO] Copying allergyui-omod-1.8.4.jar to /home/bamboo-agent/bamboo-agent/xml-data/build-dir/REFAPP-UI-FRAMEWORK/package/target/bundled-distro/web/WEB-INF/bundledModules/allergyui-1.8.4.omod
18-Nov-2021 02:00:46 [INFO] Copying providermanagement-omod-2.13.0.jar to /home/bamboo-agent/bamboo-agent/xml-data/build-dir/REFAPP-UI-FRAMEWORK/package/target/bundled-distro/web/WEB-INF/bundledModules/providermanagement-2.13.0.omod
18-Nov-2021 02:00:46 [INFO] Copying appointmentschedulingui-omod-1.12.0.jar to /home/bamboo-agent/bamboo-agent/xml-data/build-dir/REFAPP-UI-FRAMEWORK/package/target/bundled-distro/web/WEB-INF/bundledModules/appointmentschedulingui-1.12.0.omod
18-Nov-2021 02:00:46 [INFO] Copying attachments-omod-2.5.0.jar to /home/bamboo-agent/bamboo-agent/xml-data/build-dir/REFAPP-UI-FRAMEWORK/package/target/bundled-distro/web/WEB-INF/bundledModules/attachments-2.5.0.omod
18-Nov-2021 02:00:46 [INFO] Copying formentryapp-omod-1.4.2.jar to /home/bamboo-agent/bamboo-agent/xml-data/build-dir/REFAPP-UI-FRAMEWORK/package/target/bundled-distro/web/WEB-INF/bundledModules/formentryapp-1.4.2.omod
18-Nov-2021 02:00:46 [INFO] Copying idgen-omod-4.7.0.jar to /home/bamboo-agent/bamboo-agent/xml-data/build-dir/REFAPP-UI-FRAMEWORK/package/target/bundled-distro/web/WEB-INF/bundledModules/idgen-4.7.0.omod
18-Nov-2021 02:00:46 [INFO] Copying metadatamapping-omod-1.4.0.jar to /home/bamboo-agent/bamboo-agent/xml-data/build-dir/REFAPP-UI-FRAMEWORK/package/target/bundled-distro/web/WEB-INF/bundledModules/metadatamapping-1.4.0.omod
18-Nov-2021 02:00:46 [INFO] Copying htmlformentryui-omod-2.2.0-SNAPSHOT.jar to /home/bamboo-agent/bamboo-agent/xml-data/build-dir/REFAPP-UI-FRAMEWORK/package/target/bundled-distro/web/WEB-INF/bundledModules/htmlformentryui-2.2.0-SNAPSHOT.omod
18-Nov-2021 02:00:46 [INFO] Copying referencedemodata-omod-1.4.7.jar to /home/bamboo-agent/bamboo-agent/xml-data/build-dir/REFAPP-UI-FRAMEWORK/package/target/bundled-distro/web/WEB-INF/bundledModules/referencedemodata-1.4.7.omod
18-Nov-2021 02:00:46 [INFO] Copying emrapi-omod-1.32.0.jar to /home/bamboo-agent/bamboo-agent/xml-data/build-dir/REFAPP-UI-FRAMEWORK/package/target/bundled-distro/web/WEB-INF/bundledModules/emrapi-1.32.0.omod
18-Nov-2021 02:00:46 [INFO] Copying referenceapplication-omod-2.13.0-SNAPSHOT.jar to /home/bamboo-agent/bamboo-agent/xml-data/build-dir/REFAPP-UI-FRAMEWORK/package/target/bundled-distro/web/WEB-INF/bundledModules/referenceapplication-2.13.0-SNAPSHOT.omod
18-Nov-2021 02:00:46 [INFO] Copying htmlformentry-omod-4.3.0-SNAPSHOT.jar to /home/bamboo-agent/bamboo-agent/xml-data/build-dir/REFAPP-UI-FRAMEWORK/package/target/bundled-distro/web/WEB-INF/bundledModules/htmlformentry-4.3.0-SNAPSHOT.omod
18-Nov-2021 02:00:46 [INFO] Copying appframework-omod-2.16.0.jar to /home/bamboo-agent/bamboo-agent/xml-data/build-dir/REFAPP-UI-FRAMEWORK/package/target/bundled-distro/web/WEB-INF/bundledModules/appframework-2.16.0.omod
18-Nov-2021 02:00:46 [INFO] Copying referencemetadata-omod-2.12.0.jar to /home/bamboo-agent/bamboo-agent/xml-data/build-dir/REFAPP-UI-FRAMEWORK/package/target/bundled-distro/web/WEB-INF/bundledModules/referencemetadata-2.12.0.omod
18-Nov-2021 02:00:46 [INFO] Copying reportingui-omod-1.8.0.jar to /home/bamboo-agent/bamboo-agent/xml-data/build-dir/REFAPP-UI-FRAMEWORK/package/target/bundled-distro/web/WEB-INF/bundledModules/reportingui-1.8.0.omod
18-Nov-2021 02:00:46 [INFO] Copying coreapps-omod-1.35.0.jar to /home/bamboo-agent/bamboo-agent/xml-data/build-dir/REFAPP-UI-FRAMEWORK/package/target/bundled-distro/web/WEB-INF/bundledModules/coreapps-1.35.0.omod
18-Nov-2021 02:00:46 [INFO] Copying reportingcompatibility-omod-2.0.8.jar to /home/bamboo-agent/bamboo-agent/xml-data/build-dir/REFAPP-UI-FRAMEWORK/package/target/bundled-distro/web/WEB-INF/bundledModules/reportingcompatibility-2.0.8.omod
18-Nov-2021 02:00:46 [INFO] Copying reporting-omod-1.23.0.jar to /home/bamboo-agent/bamboo-agent/xml-data/build-dir/REFAPP-UI-FRAMEWORK/package/target/bundled-distro/web/WEB-INF/bundledModules/reporting-1.23.0.omod
18-Nov-2021 02:00:46 [INFO] Copying adminui-omod-1.6.0.jar to /home/bamboo-agent/bamboo-agent/xml-data/build-dir/REFAPP-UI-FRAMEWORK/package/target/bundled-distro/web/WEB-INF/bundledModules/adminui-1.6.0.omod
18-Nov-2021 02:00:46 [INFO] Copying registrationcore-omod-1.11.0.jar to /home/bamboo-agent/bamboo-agent/xml-data/build-dir/REFAPP-UI-FRAMEWORK/package/target/bundled-distro/web/WEB-INF/bundledModules/registrationcore-1.11.0.omod
18-Nov-2021 02:00:46 [INFO] Copying appointmentscheduling-omod-1.17.0-SNAPSHOT.jar to /home/bamboo-agent/bamboo-agent/xml-data/build-dir/REFAPP-UI-FRAMEWORK/package/target/bundled-distro/web/WEB-INF/bundledModules/appointmentscheduling-1.17.0-SNAPSHOT.omod
18-Nov-2021 02:00:46 [INFO] Copying atlas-omod-2.2.5.omod to /home/bamboo-agent/bamboo-agent/xml-data/build-dir/REFAPP-UI-FRAMEWORK/package/target/bundled-distro/web/WEB-INF/bundledModules/atlas-2.2.5.omod
18-Nov-2021 02:00:46 [INFO] Copying calculation-omod-1.3.0.jar to /home/bamboo-agent/bamboo-agent/xml-data/build-dir/REFAPP-UI-FRAMEWORK/package/target/bundled-distro/web/WEB-INF/bundledModules/calculation-1.3.0.omod
18-Nov-2021 02:00:46 [INFO] Copying webservices.rest-omod-2.32.0.jar to /home/bamboo-agent/bamboo-agent/xml-data/build-dir/REFAPP-UI-FRAMEWORK/package/target/bundled-distro/web/WEB-INF/bundledModules/webservices.rest-2.32.0.omod
18-Nov-2021 02:00:46 [INFO] Copying spa-omod-1.0.8.jar to /home/bamboo-agent/bamboo-agent/xml-data/build-dir/REFAPP-UI-FRAMEWORK/package/target/bundled-distro/web/WEB-INF/bundledModules/spa-1.0.8.omod
18-Nov-2021 02:00:46 [INFO] Copying uicommons-omod-2.19.0.jar to /home/bamboo-agent/bamboo-agent/xml-data/build-dir/REFAPP-UI-FRAMEWORK/package/target/bundled-distro/web/WEB-INF/bundledModules/uicommons-2.19.0.omod
18-Nov-2021 02:00:46 [INFO] Copying uiframework-omod-3.23.0-SNAPSHOT.jar to /home/bamboo-agent/bamboo-agent/xml-data/build-dir/REFAPP-UI-FRAMEWORK/package/target/bundled-distro/web/WEB-INF/bundledModules/uiframework-3.23.0-SNAPSHOT.omod
18-Nov-2021 02:00:46 [INFO] Copying metadatasharing-omod-1.8.0.jar to /home/bamboo-agent/bamboo-agent/xml-data/build-dir/REFAPP-UI-FRAMEWORK/package/target/bundled-distro/web/WEB-INF/bundledModules/metadatasharing-1.8.0.omod
18-Nov-2021 02:00:46
18-Nov-2021 02:00:46 Downloading OWAs...
18-Nov-2021 02:00:46
18-Nov-2021 02:00:46
18-Nov-2021 02:00:46 Downloading OWA: org.openmrs.owa:openmrs-owa-sysadmin:1.2
18-Nov-2021 02:00:46 [INFO] Configured Artifact: org.openmrs.owa:sysadmin:1.2:zip
18-Nov-2021 02:00:46 [INFO] Copying sysadmin-1.2.zip to /home/bamboo-agent/bamboo-agent/xml-data/build-dir/REFAPP-UI-FRAMEWORK/package/target/bundled-distro/web/WEB-INF/bundledOwas/sysadmin-1.2.zip
18-Nov-2021 02:00:48
18-Nov-2021 02:00:48 Creating Docker Compose configuration...
18-Nov-2021 02:00:48
18-Nov-2021 02:00:49
18-Nov-2021 02:00:49 The 'referenceapplication' distribution created! To start up the server run 'docker-compose up' from /home/bamboo-agent/bamboo-agent/xml-data/build-dir/REFAPP-UI-FRAMEWORK/package/target/bundled-distro
18-Nov-2021 02:00:49
18-Nov-2021 02:00:49 [INFO]
18-Nov-2021 02:00:49 [INFO] --- maven-compiler-plugin:3.1:compile (default-compile) @ referenceapplication-package ---
18-Nov-2021 02:00:49 [INFO] No sources to compile
18-Nov-2021 02:00:49 [INFO]
18-Nov-2021 02:00:49 [INFO] --- maven-resources-plugin:2.6:testResources (default-testResources) @ referenceapplication-package ---
18-Nov-2021 02:00:49 [INFO] Using 'UTF-8' encoding to copy filtered resources.
18-Nov-2021 02:00:49 [INFO] skip non existing resourceDirectory /home/bamboo-agent/bamboo-agent/xml-data/build-dir/REFAPP-UI-FRAMEWORK/package/src/test/resources
18-Nov-2021 02:00:49 [INFO] skip non existing resourceDirectory /home/bamboo-agent/bamboo-agent/xml-data/build-dir/REFAPP-UI-FRAMEWORK/package/src/test/resources
18-Nov-2021 02:00:49 [INFO]
18-Nov-2021 02:00:49 [INFO] --- maven-compiler-plugin:3.1:testCompile (default-testCompile) @ referenceapplication-package ---
18-Nov-2021 02:00:49 [INFO] No sources to compile
18-Nov-2021 02:00:49 [INFO]
18-Nov-2021 02:00:49 [INFO] --- maven-surefire-plugin:2.12:test (default-test) @ referenceapplication-package ---
18-Nov-2021 02:00:50 [INFO] No tests to run.
18-Nov-2021 02:00:50 [INFO] Surefire report directory: /home/bamboo-agent/bamboo-agent/xml-data/build-dir/REFAPP-UI-FRAMEWORK/package/target/surefire-reports
18-Nov-2021 02:00:50
18-Nov-2021 02:00:50 -------------------------------------------------------
18-Nov-2021 02:00:50 T E S T S
18-Nov-2021 02:00:50 -------------------------------------------------------
18-Nov-2021 02:00:51
18-Nov-2021 02:00:51 Results :
18-Nov-2021 02:00:51
18-Nov-2021 02:00:51 Tests run: 0, Failures: 0, Errors: 0, Skipped: 0
18-Nov-2021 02:00:51
18-Nov-2021 02:00:51 [INFO]
18-Nov-2021 02:00:51 [INFO] --- maven-jar-plugin:2.4:jar (default-jar) @ referenceapplication-package ---
18-Nov-2021 02:00:51 [INFO] Building jar: /home/bamboo-agent/bamboo-agent/xml-data/build-dir/REFAPP-UI-FRAMEWORK/package/target/referenceapplication-package-2.13.0-SNAPSHOT.jar
18-Nov-2021 02:00:51 [INFO]
18-Nov-2021 02:00:51 [INFO] --- maven-assembly-plugin:2.3:single (make-assembly) @ referenceapplication-package ---
18-Nov-2021 02:00:51 [INFO] Reading assembly descriptor: /home/bamboo-agent/bamboo-agent/xml-data/build-dir/REFAPP-UI-FRAMEWORK/package/src/main/assembly/assembly.xml
18-Nov-2021 02:00:51 [INFO] Building zip: /home/bamboo-agent/bamboo-agent/xml-data/build-dir/REFAPP-UI-FRAMEWORK/package/target/referenceapplication-package-2.13.0-SNAPSHOT-addons.zip
18-Nov-2021 02:00:55 [INFO]
18-Nov-2021 02:00:55 [INFO] --- build-helper-maven-plugin:3.0.0:attach-artifact (attach-artifacts) @ referenceapplication-package ---
18-Nov-2021 02:00:56 [INFO]
18-Nov-2021 02:00:56 [INFO] --- maven-jar-plugin:2.4:test-jar (default) @ referenceapplication-package ---
18-Nov-2021 02:00:56 [WARNING] JAR will be empty - no content was marked for inclusion!
18-Nov-2021 02:00:56 [INFO] Building jar: /home/bamboo-agent/bamboo-agent/xml-data/build-dir/REFAPP-UI-FRAMEWORK/package/target/referenceapplication-package-2.13.0-SNAPSHOT-tests.jar
18-Nov-2021 02:00:56 [INFO]
18-Nov-2021 02:00:56 [INFO] --- maven-install-plugin:2.4:install (default-install) @ referenceapplication-package ---
18-Nov-2021 02:00:56 [INFO] Installing /home/bamboo-agent/bamboo-agent/xml-data/build-dir/REFAPP-UI-FRAMEWORK/package/target/referenceapplication-package-2.13.0-SNAPSHOT.jar to /home/bamboo-agent/.m2/repository/org/openmrs/distro/referenceapplication-package/2.13.0-SNAPSHOT/referenceapplication-package-2.13.0-SNAPSHOT.jar
18-Nov-2021 02:00:56 [INFO] Installing /home/bamboo-agent/bamboo-agent/xml-data/build-dir/REFAPP-UI-FRAMEWORK/package/pom.xml to /home/bamboo-agent/.m2/repository/org/openmrs/distro/referenceapplication-package/2.13.0-SNAPSHOT/referenceapplication-package-2.13.0-SNAPSHOT.pom
18-Nov-2021 02:00:56 [INFO] Installing /home/bamboo-agent/bamboo-agent/xml-data/build-dir/REFAPP-UI-FRAMEWORK/package/target/referenceapplication-package-2.13.0-SNAPSHOT-addons.zip to /home/bamboo-agent/.m2/repository/org/openmrs/distro/referenceapplication-package/2.13.0-SNAPSHOT/referenceapplication-package-2.13.0-SNAPSHOT-addons.zip
18-Nov-2021 02:00:56 [INFO] Installing /home/bamboo-agent/bamboo-agent/xml-data/build-dir/REFAPP-UI-FRAMEWORK/package/target/bundled-distro/web/openmrs.war to /home/bamboo-agent/.m2/repository/org/openmrs/distro/referenceapplication-package/2.13.0-SNAPSHOT/referenceapplication-package-2.13.0-SNAPSHOT.war
18-Nov-2021 02:00:56 [INFO] Installing /home/bamboo-agent/bamboo-agent/xml-data/build-dir/REFAPP-UI-FRAMEWORK/package/target/referenceapplication-package-2.13.0-SNAPSHOT-tests.jar to /home/bamboo-agent/.m2/repository/org/openmrs/distro/referenceapplication-package/2.13.0-SNAPSHOT/referenceapplication-package-2.13.0-SNAPSHOT-tests.jar
18-Nov-2021 02:00:56 [INFO]                                                                         
18-Nov-2021 02:00:56 [INFO] ------------------------------------------------------------------------
18-Nov-2021 02:00:56 [INFO] Building Reference Application Distribution UI Tests 2.13.0-SNAPSHOT
18-Nov-2021 02:00:56 [INFO] ------------------------------------------------------------------------
18-Nov-2021 02:00:57 [INFO]
18-Nov-2021 02:00:57 [INFO] --- maven-clean-plugin:2.5:clean (default-clean) @ referenceapplication-ui-tests ---
18-Nov-2021 02:00:57 [INFO]
18-Nov-2021 02:00:57 [INFO] --- maven-resources-plugin:2.6:resources (default-resources) @ referenceapplication-ui-tests ---
18-Nov-2021 02:00:57 [INFO] Using 'UTF-8' encoding to copy filtered resources.
18-Nov-2021 02:00:57 [INFO] skip non existing resourceDirectory /home/bamboo-agent/bamboo-agent/xml-data/build-dir/REFAPP-UI-FRAMEWORK/ui-tests/src/main/resources
18-Nov-2021 02:00:57 [INFO]
18-Nov-2021 02:00:57 [INFO] --- maven-compiler-plugin:3.1:compile (default-compile) @ referenceapplication-ui-tests ---
18-Nov-2021 02:00:57 [INFO] No sources to compile
18-Nov-2021 02:00:57 [INFO]
18-Nov-2021 02:00:57 [INFO] --- maven-resources-plugin:2.6:testResources (default-testResources) @ referenceapplication-ui-tests ---
18-Nov-2021 02:00:57 [INFO] Using 'UTF-8' encoding to copy filtered resources.
18-Nov-2021 02:00:57 [INFO] Copying 2 resources
18-Nov-2021 02:00:57 [INFO] Copying 2 resources
18-Nov-2021 02:00:57 [INFO]
18-Nov-2021 02:00:57 [INFO] --- maven-compiler-plugin:3.1:testCompile (default-testCompile) @ referenceapplication-ui-tests ---
18-Nov-2021 02:00:57 [INFO] Changes detected - recompiling the module!
18-Nov-2021 02:00:57 [INFO] Compiling 120 source files to /home/bamboo-agent/bamboo-agent/xml-data/build-dir/REFAPP-UI-FRAMEWORK/ui-tests/target/test-classes
18-Nov-2021 02:01:00 [WARNING] /home/bamboo-agent/bamboo-agent/xml-data/build-dir/REFAPP-UI-FRAMEWORK/ui-tests/src/test/java/org/openmrs/reference/AddDeleteLocationTest.java: Some input files use or override a deprecated API.
18-Nov-2021 02:01:00 [WARNING] /home/bamboo-agent/bamboo-agent/xml-data/build-dir/REFAPP-UI-FRAMEWORK/ui-tests/src/test/java/org/openmrs/reference/AddDeleteLocationTest.java: Recompile with -Xlint:deprecation for details.
18-Nov-2021 02:01:00 [WARNING] /home/bamboo-agent/bamboo-agent/xml-data/build-dir/REFAPP-UI-FRAMEWORK/ui-tests/src/test/java/org/openmrs/reference/AddRolesToUserTest.java: /home/bamboo-agent/bamboo-agent/xml-data/build-dir/REFAPP-UI-FRAMEWORK/ui-tests/src/test/java/org/openmrs/reference/AddRolesToUserTest.java uses unchecked or unsafe operations.
18-Nov-2021 02:01:00 [WARNING] /home/bamboo-agent/bamboo-agent/xml-data/build-dir/REFAPP-UI-FRAMEWORK/ui-tests/src/test/java/org/openmrs/reference/AddRolesToUserTest.java: Recompile with -Xlint:unchecked for details.
18-Nov-2021 02:01:00 [INFO]
18-Nov-2021 02:01:00 [INFO] --- maven-antrun-plugin:1.8:run (make-mac-chromedriver-executable) @ referenceapplication-ui-tests ---
18-Nov-2021 02:01:00 [INFO] Executing tasks
18-Nov-2021 02:01:00
18-Nov-2021 02:01:00 main:
18-Nov-2021 02:01:00 [INFO] An Ant BuildException has occured: /home/bamboo-agent/bamboo-agent/xml-data/build-dir/REFAPP-UI-FRAMEWORK/ui-tests/target/test-classes/chromedriver/mac does not exist.
18-Nov-2021 02:01:00 around Ant part ...<chmod file="target/test-classes/chromedriver/mac/chromedriver" perm="755"/>... @ 4:79 in /home/bamboo-agent/bamboo-agent/xml-data/build-dir/REFAPP-UI-FRAMEWORK/ui-tests/target/antrun/build-main.xml
18-Nov-2021 02:01:00 /home/bamboo-agent/bamboo-agent/xml-data/build-dir/REFAPP-UI-FRAMEWORK/ui-tests/target/antrun/build-main.xml:4: /home/bamboo-agent/bamboo-agent/xml-data/build-dir/REFAPP-UI-FRAMEWORK/ui-tests/target/test-classes/chromedriver/mac does not exist.
18-Nov-2021 02:01:00         at org.apache.tools.ant.types.AbstractFileSet.getDirectoryScanner(AbstractFileSet.java:484)
18-Nov-2021 02:01:00         at org.apache.tools.ant.taskdefs.ExecuteOn.runExec(ExecuteOn.java:369)
18-Nov-2021 02:01:00         at org.apache.tools.ant.taskdefs.ExecTask.execute(ExecTask.java:495)
18-Nov-2021 02:01:00         at org.apache.tools.ant.taskdefs.Chmod.execute(Chmod.java:181)
18-Nov-2021 02:01:00         at org.apache.tools.ant.UnknownElement.execute(UnknownElement.java:292)
18-Nov-2021 02:01:00         at sun.reflect.NativeMethodAccessorImpl.invoke0(Native Method)
18-Nov-2021 02:01:00         at sun.reflect.NativeMethodAccessorImpl.invoke(NativeMethodAccessorImpl.java:62)
18-Nov-2021 02:01:00         at sun.reflect.DelegatingMethodAccessorImpl.invoke(DelegatingMethodAccessorImpl.java:43)
18-Nov-2021 02:01:00         at java.lang.reflect.Method.invoke(Method.java:498)
18-Nov-2021 02:01:00         at org.apache.tools.ant.dispatch.DispatchUtils.execute(DispatchUtils.java:106)
18-Nov-2021 02:01:00         at org.apache.tools.ant.Task.perform(Task.java:348)
18-Nov-2021 02:01:00         at org.apache.tools.ant.Target.execute(Target.java:435)
18-Nov-2021 02:01:00         at org.apache.tools.ant.Target.performTasks(Target.java:456)
18-Nov-2021 02:01:00         at org.apache.tools.ant.Project.executeSortedTargets(Project.java:1393)
18-Nov-2021 02:01:00         at org.apache.tools.ant.Project.executeTarget(Project.java:1364)
18-Nov-2021 02:01:00         at org.apache.maven.plugin.antrun.AntRunMojo.execute(AntRunMojo.java:313)
18-Nov-2021 02:01:00         at org.apache.maven.plugin.DefaultBuildPluginManager.executeMojo(DefaultBuildPluginManager.java:134)
18-Nov-2021 02:01:00         at org.apache.maven.lifecycle.internal.MojoExecutor.execute(MojoExecutor.java:207)
18-Nov-2021 02:01:00         at org.apache.maven.lifecycle.internal.MojoExecutor.execute(MojoExecutor.java:153)
18-Nov-2021 02:01:00         at org.apache.maven.lifecycle.internal.MojoExecutor.execute(MojoExecutor.java:145)
18-Nov-2021 02:01:00         at org.apache.maven.lifecycle.internal.LifecycleModuleBuilder.buildProject(LifecycleModuleBuilder.java:116)
18-Nov-2021 02:01:00         at org.apache.maven.lifecycle.internal.LifecycleModuleBuilder.buildProject(LifecycleModuleBuilder.java:80)
18-Nov-2021 02:01:00         at org.apache.maven.lifecycle.internal.builder.singlethreaded.SingleThreadedBuilder.build(SingleThreadedBuilder.java:51)
18-Nov-2021 02:01:00         at org.apache.maven.lifecycle.internal.LifecycleStarter.execute(LifecycleStarter.java:128)
18-Nov-2021 02:01:00         at org.apache.maven.DefaultMaven.doExecute(DefaultMaven.java:307)
18-Nov-2021 02:01:00         at org.apache.maven.DefaultMaven.doExecute(DefaultMaven.java:193)
18-Nov-2021 02:01:00         at org.apache.maven.DefaultMaven.execute(DefaultMaven.java:106)
18-Nov-2021 02:01:00         at org.apache.maven.cli.MavenCli.execute(MavenCli.java:863)
18-Nov-2021 02:01:00         at org.apache.maven.cli.MavenCli.doMain(MavenCli.java:288)
18-Nov-2021 02:01:00         at org.apache.maven.cli.MavenCli.main(MavenCli.java:199)
18-Nov-2021 02:01:00         at sun.reflect.NativeMethodAccessorImpl.invoke0(Native Method)
18-Nov-2021 02:01:00         at sun.reflect.NativeMethodAccessorImpl.invoke(NativeMethodAccessorImpl.java:62)
18-Nov-2021 02:01:00         at sun.reflect.DelegatingMethodAccessorImpl.invoke(DelegatingMethodAccessorImpl.java:43)
18-Nov-2021 02:01:00         at java.lang.reflect.Method.invoke(Method.java:498)
18-Nov-2021 02:01:00         at org.codehaus.plexus.classworlds.launcher.Launcher.launchEnhanced(Launcher.java:289)
18-Nov-2021 02:01:00         at org.codehaus.plexus.classworlds.launcher.Launcher.launch(Launcher.java:229)
18-Nov-2021 02:01:00         at org.codehaus.plexus.classworlds.launcher.Launcher.mainWithExitCode(Launcher.java:415)
18-Nov-2021 02:01:00         at org.codehaus.plexus.classworlds.launcher.Launcher.main(Launcher.java:356)
18-Nov-2021 02:01:00 [INFO]
18-Nov-2021 02:01:00 [INFO] --- maven-antrun-plugin:1.8:run (make-linux-chromedriver-executable) @ referenceapplication-ui-tests ---
18-Nov-2021 02:01:01 [INFO] Executing tasks
18-Nov-2021 02:01:01
18-Nov-2021 02:01:01 main:
18-Nov-2021 02:01:01 [INFO] Executed tasks
18-Nov-2021 02:01:01 [INFO]
18-Nov-2021 02:01:01 [INFO] --- maven-antrun-plugin:1.8:run (make-mac-firefoxdriver-executable) @ referenceapplication-ui-tests ---
18-Nov-2021 02:01:01 [INFO] Executing tasks
18-Nov-2021 02:01:01
18-Nov-2021 02:01:01 main:
18-Nov-2021 02:01:01 [INFO] An Ant BuildException has occured: /home/bamboo-agent/bamboo-agent/xml-data/build-dir/REFAPP-UI-FRAMEWORK/ui-tests/target/test-classes/firefoxdriver/mac does not exist.
18-Nov-2021 02:01:01 around Ant part ...<chmod file="target/test-classes/firefoxdriver/mac/geckodriver" perm="755"/>... @ 4:79 in /home/bamboo-agent/bamboo-agent/xml-data/build-dir/REFAPP-UI-FRAMEWORK/ui-tests/target/antrun/build-main.xml
18-Nov-2021 02:01:01 /home/bamboo-agent/bamboo-agent/xml-data/build-dir/REFAPP-UI-FRAMEWORK/ui-tests/target/antrun/build-main.xml:4: /home/bamboo-agent/bamboo-agent/xml-data/build-dir/REFAPP-UI-FRAMEWORK/ui-tests/target/test-classes/firefoxdriver/mac does not exist.
18-Nov-2021 02:01:01         at org.apache.tools.ant.types.AbstractFileSet.getDirectoryScanner(AbstractFileSet.java:484)
18-Nov-2021 02:01:01         at org.apache.tools.ant.taskdefs.ExecuteOn.runExec(ExecuteOn.java:369)
18-Nov-2021 02:01:01         at org.apache.tools.ant.taskdefs.ExecTask.execute(ExecTask.java:495)
18-Nov-2021 02:01:01         at org.apache.tools.ant.taskdefs.Chmod.execute(Chmod.java:181)
18-Nov-2021 02:01:01         at org.apache.tools.ant.UnknownElement.execute(UnknownElement.java:292)
18-Nov-2021 02:01:01         at sun.reflect.NativeMethodAccessorImpl.invoke0(Native Method)
18-Nov-2021 02:01:01         at sun.reflect.NativeMethodAccessorImpl.invoke(NativeMethodAccessorImpl.java:62)
18-Nov-2021 02:01:01         at sun.reflect.DelegatingMethodAccessorImpl.invoke(DelegatingMethodAccessorImpl.java:43)
18-Nov-2021 02:01:01         at java.lang.reflect.Method.invoke(Method.java:498)
18-Nov-2021 02:01:01         at org.apache.tools.ant.dispatch.DispatchUtils.execute(DispatchUtils.java:106)
18-Nov-2021 02:01:01         at org.apache.tools.ant.Task.perform(Task.java:348)
18-Nov-2021 02:01:01         at org.apache.tools.ant.Target.execute(Target.java:435)
18-Nov-2021 02:01:01         at org.apache.tools.ant.Target.performTasks(Target.java:456)
18-Nov-2021 02:01:01         at org.apache.tools.ant.Project.executeSortedTargets(Project.java:1393)
18-Nov-2021 02:01:01         at org.apache.tools.ant.Project.executeTarget(Project.java:1364)
18-Nov-2021 02:01:01         at org.apache.maven.plugin.antrun.AntRunMojo.execute(AntRunMojo.java:313)
18-Nov-2021 02:01:01         at org.apache.maven.plugin.DefaultBuildPluginManager.executeMojo(DefaultBuildPluginManager.java:134)
18-Nov-2021 02:01:01         at org.apache.maven.lifecycle.internal.MojoExecutor.execute(MojoExecutor.java:207)
18-Nov-2021 02:01:01         at org.apache.maven.lifecycle.internal.MojoExecutor.execute(MojoExecutor.java:153)
18-Nov-2021 02:01:01         at org.apache.maven.lifecycle.internal.MojoExecutor.execute(MojoExecutor.java:145)
18-Nov-2021 02:01:01         at org.apache.maven.lifecycle.internal.LifecycleModuleBuilder.buildProject(LifecycleModuleBuilder.java:116)
18-Nov-2021 02:01:01         at org.apache.maven.lifecycle.internal.LifecycleModuleBuilder.buildProject(LifecycleModuleBuilder.java:80)
18-Nov-2021 02:01:01         at org.apache.maven.lifecycle.internal.builder.singlethreaded.SingleThreadedBuilder.build(SingleThreadedBuilder.java:51)
18-Nov-2021 02:01:01         at org.apache.maven.lifecycle.internal.LifecycleStarter.execute(LifecycleStarter.java:128)
18-Nov-2021 02:01:01         at org.apache.maven.DefaultMaven.doExecute(DefaultMaven.java:307)
18-Nov-2021 02:01:01         at org.apache.maven.DefaultMaven.doExecute(DefaultMaven.java:193)
18-Nov-2021 02:01:01         at org.apache.maven.DefaultMaven.execute(DefaultMaven.java:106)
18-Nov-2021 02:01:01         at org.apache.maven.cli.MavenCli.execute(MavenCli.java:863)
18-Nov-2021 02:01:01         at org.apache.maven.cli.MavenCli.doMain(MavenCli.java:288)
18-Nov-2021 02:01:01         at org.apache.maven.cli.MavenCli.main(MavenCli.java:199)
18-Nov-2021 02:01:01         at sun.reflect.NativeMethodAccessorImpl.invoke0(Native Method)
18-Nov-2021 02:01:01         at sun.reflect.NativeMethodAccessorImpl.invoke(NativeMethodAccessorImpl.java:62)
18-Nov-2021 02:01:01         at sun.reflect.DelegatingMethodAccessorImpl.invoke(DelegatingMethodAccessorImpl.java:43)
18-Nov-2021 02:01:01         at java.lang.reflect.Method.invoke(Method.java:498)
18-Nov-2021 02:01:01         at org.codehaus.plexus.classworlds.launcher.Launcher.launchEnhanced(Launcher.java:289)
18-Nov-2021 02:01:01         at org.codehaus.plexus.classworlds.launcher.Launcher.launch(Launcher.java:229)
18-Nov-2021 02:01:01         at org.codehaus.plexus.classworlds.launcher.Launcher.mainWithExitCode(Launcher.java:415)
18-Nov-2021 02:01:01         at org.codehaus.plexus.classworlds.launcher.Launcher.main(Launcher.java:356)
18-Nov-2021 02:01:01 [INFO]
18-Nov-2021 02:01:01 [INFO] --- maven-antrun-plugin:1.8:run (make-linux-firefoxdriver-executable) @ referenceapplication-ui-tests ---
18-Nov-2021 02:01:01 [INFO] Executing tasks
18-Nov-2021 02:01:01
18-Nov-2021 02:01:01 main:
18-Nov-2021 02:01:01 [INFO] Executed tasks
18-Nov-2021 02:01:01 [INFO]
18-Nov-2021 02:01:01 [INFO] --- maven-surefire-plugin:2.12:test (default-test) @ referenceapplication-ui-tests ---
18-Nov-2021 02:01:01 [INFO] Surefire report directory: /home/bamboo-agent/bamboo-agent/xml-data/build-dir/REFAPP-UI-FRAMEWORK/ui-tests/target/surefire-reports
18-Nov-2021 02:01:01
18-Nov-2021 02:01:01 -------------------------------------------------------
18-Nov-2021 02:01:01 T E S T S
18-Nov-2021 02:01:01 -------------------------------------------------------
18-Nov-2021 02:01:01 Running org.openmrs.reference.UnidentifiedPatientKeyboardTest
18-Nov-2021 02:01:02 Running locally...
18-Nov-2021 02:01:07 Starting ChromeDriver 90.0.4430.24 (4c6d850f087da467d926e8eddb76550aed655991-refs/branch-heads/4430@{#429}) on port 2555
18-Nov-2021 02:01:07 Only local connections are allowed.
18-Nov-2021 02:01:07 Please see https://chromedriver.chromium.org/security-considerations for suggestions on keeping ChromeDriver safe.
18-Nov-2021 02:01:07 ChromeDriver was started successfully.
18-Nov-2021 02:01:23 Nov 18, 2021 2:01:23 AM org.openqa.selenium.remote.ProtocolHandshake createSession
18-Nov-2021 02:01:23 INFO: Detected dialect: W3C
18-Nov-2021 02:03:30 Failed to login in UnidentifiedPatientKeyboardTest.unidentifiedPatientKeyboardTest, trying again...
18-Nov-2021 02:05:31 Failed to login in UnidentifiedPatientKeyboardTest.unidentifiedPatientKeyboardTest, trying again...
18-Nov-2021 02:07:32 Failed to login in UnidentifiedPatientKeyboardTest.unidentifiedPatientKeyboardTest, trying again...
18-Nov-2021 02:09:32 Failed to login in UnidentifiedPatientKeyboardTest.unidentifiedPatientKeyboardTest, trying again...
18-Nov-2021 02:11:33 Test killed due to server failure in UnidentifiedPatientKeyboardTest.unidentifiedPatientKeyboardTest
18-Nov-2021 02:11:33 org.openqa.selenium.TimeoutException: Expected condition failed: waiting for org.openmrs.uitestframework.page.Page$1@5a0fd285 (tried for 120 second(s) with 500 milliseconds interval)
18-Nov-2021 02:11:33 Build info: version: '4.0.0-alpha-6', revision: '5f43a29cfc'
18-Nov-2021 02:11:33 System info: host: 'yue', ip: '127.0.0.1', os.name: 'Linux', os.arch: 'amd64', os.version: '4.4.0-210-generic', java.version: '1.8.0_292'
18-Nov-2021 02:11:33 Driver info: org.openqa.selenium.chrome.ChromeDriver
18-Nov-2021 02:11:33 Capabilities {acceptInsecureCerts: false, browserName: chrome, browserVersion: 90.0.4430.72, chrome: {chromedriverVersion: 90.0.4430.24 (4c6d850f087da..., userDataDir: /tmp/.com.google.Chrome.R2S7db}, goog:chromeOptions: {debuggerAddress: localhost:45424}, javascriptEnabled: true, networkConnectionEnabled: false, pageLoadStrategy: normal, platform: LINUX, platformName: LINUX, proxy: Proxy(), setWindowRect: true, strictFileInteractability: false, timeouts: {implicit: 0, pageLoad: 300000, script: 30000}, unhandledPromptBehavior: dismiss and notify, webauthn:extension:largeBlob: true, webauthn:virtualAuthenticators: true}
18-Nov-2021 02:11:33 Session ID: e22fa4bdf929ac80838ec5e9849f8c84
18-Nov-2021 02:11:33         at org.openqa.selenium.support.ui.WebDriverWait.timeoutException(WebDriverWait.java:138)
18-Nov-2021 02:11:33         at org.openqa.selenium.support.ui.FluentWait.lambda$checkConditionInLoop$2(FluentWait.java:255)
18-Nov-2021 02:11:33         at java.util.concurrent.CompletableFuture$AsyncSupply.run(CompletableFuture.java:1604)
18-Nov-2021 02:11:33         at java.lang.Thread.run(Thread.java:748)
18-Nov-2021 02:11:33 Tests run: 3, Failures: 1, Errors: 2, Skipped: 0, Time elapsed: 631.481 sec <<< FAILURE!
18-Nov-2021 02:11:33 Running org.openmrs.reference.DeleteAllergyTest
18-Nov-2021 02:11:33 Tests run: 1, Failures: 1, Errors: 0, Skipped: 0, Time elapsed: 0.003 sec <<< FAILURE!
18-Nov-2021 02:11:33 Running org.openmrs.reference.SearchActiveVisitsTest
18-Nov-2021 02:11:33 Tests run: 1, Failures: 1, Errors: 0, Skipped: 0, Time elapsed: 0.001 sec <<< FAILURE!
18-Nov-2021 02:11:33 Running org.openmrs.reference.AddVisitTypeTest
18-Nov-2021 02:11:33 Tests run: 1, Failures: 1, Errors: 0, Skipped: 0, Time elapsed: 0 sec <<< FAILURE!
18-Nov-2021 02:11:33 Running org.openmrs.reference.FindPatientRecordTest
18-Nov-2021 02:11:33 Tests run: 1, Failures: 1, Errors: 0, Skipped: 0, Time elapsed: 0.004 sec <<< FAILURE!
18-Nov-2021 02:11:33 Running org.openmrs.reference.EditPersonTest
18-Nov-2021 02:11:33 Tests run: 2, Failures: 1, Errors: 1, Skipped: 0, Time elapsed: 0.106 sec <<< FAILURE!
18-Nov-2021 02:11:33 Running org.openmrs.reference.RetireLocationTest
18-Nov-2021 02:11:33 Tests run: 2, Failures: 1, Errors: 1, Skipped: 0, Time elapsed: 0.105 sec <<< FAILURE!
18-Nov-2021 02:11:33 Running org.openmrs.reference.XSSOnPhoneNumberFieldTest
18-Nov-2021 02:11:33 Tests run: 1, Failures: 1, Errors: 0, Skipped: 0, Time elapsed: 0.007 sec <<< FAILURE!
18-Nov-2021 02:11:33 Running org.openmrs.reference.TransferToWardServiceTest
18-Nov-2021 02:11:33 Tests run: 1, Failures: 1, Errors: 0, Skipped: 0, Time elapsed: 0.002 sec <<< FAILURE!
18-Nov-2021 02:11:33 Running org.openmrs.reference.EditVisitTypeTest
18-Nov-2021 02:11:33 Tests run: 2, Failures: 1, Errors: 1, Skipped: 0, Time elapsed: 0.049 sec <<< FAILURE!
18-Nov-2021 02:11:33 Running org.openmrs.reference.ComeBackToApplicationAfterLogoutTest
18-Nov-2021 02:11:33 Tests run: 1, Failures: 1, Errors: 0, Skipped: 0, Time elapsed: 0.001 sec <<< FAILURE!
18-Nov-2021 02:11:33 Running org.openmrs.reference.EditDemographicTest
18-Nov-2021 02:11:33 Tests run: 1, Failures: 1, Errors: 0, Skipped: 0, Time elapsed: 0.003 sec <<< FAILURE!
18-Nov-2021 02:11:33 Running org.openmrs.reference.DeleteVisitTypeTest
18-Nov-2021 02:11:33 Tests run: 2, Failures: 1, Errors: 1, Skipped: 0, Time elapsed: 0.064 sec <<< FAILURE!
18-Nov-2021 02:11:33 Running org.openmrs.reference.FormTest
18-Nov-2021 02:11:33 Tests run: 8, Failures: 4, Errors: 4, Skipped: 0, Time elapsed: 0.008 sec <<< FAILURE!
18-Nov-2021 02:11:33 Running org.openmrs.reference.RegisterUnidentifiedPatientTest
18-Nov-2021 02:11:33 Tests run: 2, Failures: 1, Errors: 1, Skipped: 0, Time elapsed: 0.001 sec <<< FAILURE!
18-Nov-2021 02:11:33 Running org.openmrs.reference.AddPatientAppointmentTest
18-Nov-2021 02:11:33 Tests run: 1, Failures: 1, Errors: 0, Skipped: 0, Time elapsed: 0.001 sec <<< FAILURE!
18-Nov-2021 02:11:33 Running org.openmrs.reference.AdmitExitInpatientTest
18-Nov-2021 02:11:33 Tests run: 1, Failures: 1, Errors: 0, Skipped: 0, Time elapsed: 0.006 sec <<< FAILURE!
18-Nov-2021 02:11:33 Running org.openmrs.reference.DeleteRequestAppointmentTest
18-Nov-2021 02:11:34 Tests run: 1, Failures: 1, Errors: 0, Skipped: 0, Time elapsed: 0.251 sec <<< FAILURE!
18-Nov-2021 02:11:34 Running org.openmrs.reference.EditAllergyTest
18-Nov-2021 02:11:34 Tests run: 1, Failures: 1, Errors: 0, Skipped: 0, Time elapsed: 0 sec <<< FAILURE!
18-Nov-2021 02:11:34 Running org.openmrs.reference.VisitNoteTest
18-Nov-2021 02:11:34 Tests run: 1, Failures: 1, Errors: 0, Skipped: 0, Time elapsed: 0 sec <<< FAILURE!
18-Nov-2021 02:11:34 Running org.openmrs.reference.CreatePersonTest
18-Nov-2021 02:11:34 Tests run: 1, Failures: 1, Errors: 0, Skipped: 0, Time elapsed: 0 sec <<< FAILURE!
18-Nov-2021 02:11:34 Running org.openmrs.reference.FindPatientByNameTest
18-Nov-2021 02:11:34 Tests run: 2, Failures: 1, Errors: 1, Skipped: 0, Time elapsed: 0.001 sec <<< FAILURE!
18-Nov-2021 02:11:34 Running org.openmrs.reference.AddUserTest
18-Nov-2021 02:11:34 Tests run: 1, Failures: 1, Errors: 0, Skipped: 0, Time elapsed: 0.003 sec <<< FAILURE!
18-Nov-2021 02:11:34 Running org.openmrs.reference.AddProviderTest
18-Nov-2021 02:11:34 Tests run: 2, Failures: 1, Errors: 1, Skipped: 0, Time elapsed: 0.001 sec <<< FAILURE!
18-Nov-2021 02:11:34 Running org.openmrs.reference.AddPastVisitTest
18-Nov-2021 02:11:34 Tests run: 1, Failures: 1, Errors: 0, Skipped: 0, Time elapsed: 0.001 sec <<< FAILURE!
18-Nov-2021 02:11:34 Running org.openmrs.reference.RecordMergeIssueTest
18-Nov-2021 02:11:34 Tests run: 2, Failures: 1, Errors: 1, Skipped: 0, Time elapsed: 0.01 sec <<< FAILURE!
18-Nov-2021 02:11:34 Running org.openmrs.reference.CaptureVitalsTest
18-Nov-2021 02:11:34 Tests run: 1, Failures: 1, Errors: 0, Skipped: 0, Time elapsed: 0.001 sec <<< FAILURE!
18-Nov-2021 02:11:34 Running org.openmrs.reference.NamePatientAccentedLetterTest
18-Nov-2021 02:11:34 Tests run: 2, Failures: 1, Errors: 1, Skipped: 0, Time elapsed: 0 sec <<< FAILURE!
18-Nov-2021 02:11:34 Running org.openmrs.reference.RetirePersonTest
18-Nov-2021 02:11:34 Tests run: 2, Failures: 1, Errors: 1, Skipped: 0, Time elapsed: 0.001 sec <<< FAILURE!
18-Nov-2021 02:11:34 Running org.openmrs.reference.EndVisitTest
18-Nov-2021 02:11:34 Tests run: 1, Failures: 1, Errors: 0, Skipped: 0, Time elapsed: 0.001 sec <<< FAILURE!
18-Nov-2021 02:11:34 Running org.openmrs.reference.DeleteAppointmentBlockTest
18-Nov-2021 02:11:34 Tests run: 1, Failures: 1, Errors: 0, Skipped: 0, Time elapsed: 0.003 sec <<< FAILURE!
18-Nov-2021 02:11:34 Running org.openmrs.reference.BookRequestAppointmentTest
18-Nov-2021 02:11:34 Tests run: 1, Failures: 1, Errors: 0, Skipped: 0, Time elapsed: 0.005 sec <<< FAILURE!
18-Nov-2021 02:11:34 Running org.openmrs.reference.AddDeleteServiceTest
18-Nov-2021 02:11:34 Tests run: 1, Failures: 1, Errors: 0, Skipped: 0, Time elapsed: 0 sec <<< FAILURE!
18-Nov-2021 02:11:34 Running org.openmrs.reference.AddEditAppointmentBlockTest
18-Nov-2021 02:11:34 Tests run: 1, Failures: 1, Errors: 0, Skipped: 0, Time elapsed: 0 sec <<< FAILURE!
18-Nov-2021 02:11:34 Running org.openmrs.reference.RetireProviderTest
18-Nov-2021 02:11:34 Tests run: 2, Failures: 1, Errors: 1, Skipped: 0, Time elapsed: 0.006 sec <<< FAILURE!
18-Nov-2021 02:11:34 Running org.openmrs.reference.MergePatientTest
18-Nov-2021 02:11:34 Tests run: 1, Failures: 1, Errors: 0, Skipped: 0, Time elapsed: 0.002 sec <<< FAILURE!
18-Nov-2021 02:11:34 Running org.openmrs.reference.AddDeleteLocationTest
18-Nov-2021 02:11:34 Tests run: 2, Failures: 1, Errors: 1, Skipped: 0, Time elapsed: 0.041 sec <<< FAILURE!
18-Nov-2021 02:11:34 Running org.openmrs.reference.DuplicatePatientRegisterTest
18-Nov-2021 02:11:34 Tests run: 2, Failures: 1, Errors: 1, Skipped: 0, Time elapsed: 0.004 sec <<< FAILURE!
18-Nov-2021 02:11:34 Running org.openmrs.reference.UsingBackButtonInMergePatientTest
18-Nov-2021 02:11:34 Tests run: 2, Failures: 1, Errors: 1, Skipped: 0, Time elapsed: 0.001 sec <<< FAILURE!
18-Nov-2021 02:11:34 Running org.openmrs.reference.AddDiagnosisToVisitNoteTest
18-Nov-2021 02:11:34 Tests run: 1, Failures: 1, Errors: 0, Skipped: 0, Time elapsed: 0.008 sec <<< FAILURE!
18-Nov-2021 02:11:34 Running org.openmrs.reference.MergeVisitsTest
18-Nov-2021 02:11:34 Tests run: 2, Failures: 1, Errors: 1, Skipped: 0, Time elapsed: 0.002 sec <<< FAILURE!
18-Nov-2021 02:11:34 Running org.openmrs.reference.CheckModulesTest
18-Nov-2021 02:11:34 Tests run: 1, Failures: 1, Errors: 0, Skipped: 0, Time elapsed: 0.002 sec <<< FAILURE!
18-Nov-2021 02:11:34 Running org.openmrs.reference.EditServiceTest
18-Nov-2021 02:11:34 Tests run: 1, Failures: 1, Errors: 0, Skipped: 0, Time elapsed: 0 sec <<< FAILURE!
18-Nov-2021 02:11:34 Running org.openmrs.reference.AddNewAllergyTest
18-Nov-2021 02:11:34 Tests run: 1, Failures: 1, Errors: 0, Skipped: 0, Time elapsed: 0.004 sec <<< FAILURE!
18-Nov-2021 02:11:34 Running org.openmrs.reference.LoginTest
18-Nov-2021 02:11:34 Tests run: 5, Failures: 5, Errors: 0, Skipped: 0, Time elapsed: 0.011 sec <<< FAILURE!
18-Nov-2021 02:11:34 Running org.openmrs.reference.DeleteProviderTest
18-Nov-2021 02:11:34 Tests run: 2, Failures: 1, Errors: 1, Skipped: 0, Time elapsed: 0.031 sec <<< FAILURE!
18-Nov-2021 02:11:34 Running org.openmrs.reference.RegisterPatientTest
18-Nov-2021 02:11:34 Tests run: 2, Failures: 1, Errors: 1, Skipped: 0, Time elapsed: 0.002 sec <<< FAILURE!
18-Nov-2021 02:11:34 Running org.openmrs.reference.ContactInfoTest
18-Nov-2021 02:11:34 Tests run: 1, Failures: 1, Errors: 0, Skipped: 0, Time elapsed: 0 sec <<< FAILURE!
18-Nov-2021 02:11:34 Running org.openmrs.reference.StartVisitTest
18-Nov-2021 02:11:34 Tests run: 1, Failures: 1, Errors: 0, Skipped: 0, Time elapsed: 0 sec <<< FAILURE!
18-Nov-2021 02:11:34 Running org.openmrs.reference.DeletePersonTest
18-Nov-2021 02:11:34 Tests run: 2, Failures: 1, Errors: 1, Skipped: 0, Time elapsed: 0.037 sec <<< FAILURE!
18-Nov-2021 02:11:34 Running org.openmrs.reference.EditProviderTest
18-Nov-2021 02:11:34 Tests run: 2, Failures: 1, Errors: 1, Skipped: 0, Time elapsed: 0.049 sec <<< FAILURE!
18-Nov-2021 02:11:34 Running org.openmrs.reference.RetireVisitTypeTest
18-Nov-2021 02:11:34 Tests run: 2, Failures: 1, Errors: 1, Skipped: 0, Time elapsed: 0.035 sec <<< FAILURE!
18-Nov-2021 02:11:34
18-Nov-2021 02:11:34 Results :
18-Nov-2021 02:11:34
18-Nov-2021 02:11:34 Failed tests:   unidentifiedPatientKeyboardTest(org.openmrs.reference.UnidentifiedPatientKeyboardTest): Test killed due to server failure
18-Nov-2021 02:11:34   deleteAllergyTest(org.openmrs.reference.DeleteAllergyTest): Test killed due to server failure
18-Nov-2021 02:11:34   searchActiveVisitsTest(org.openmrs.reference.SearchActiveVisitsTest): Test killed due to server failure
18-Nov-2021 02:11:34   addVisitTypeTest(org.openmrs.reference.AddVisitTypeTest): Test killed due to server failure
18-Nov-2021 02:11:34   findPatientRecordTest(org.openmrs.reference.FindPatientRecordTest): Test killed due to server failure
18-Nov-2021 02:11:34   editPersonTest(org.openmrs.reference.EditPersonTest): Test killed due to server failure
18-Nov-2021 02:11:34   retireLocationTest(org.openmrs.reference.RetireLocationTest): Test killed due to server failure
18-Nov-2021 02:11:34   xssOnPhoneNumberFieldTest(org.openmrs.reference.XSSOnPhoneNumberFieldTest): Test killed due to server failure
18-Nov-2021 02:11:34   transferToWardServiceTest(org.openmrs.reference.TransferToWardServiceTest): Test killed due to server failure
18-Nov-2021 02:11:34   editVisitTypeTest(org.openmrs.reference.EditVisitTypeTest): Test killed due to server failure
18-Nov-2021 02:11:34   comeBackToApplicationAfterLogoutTest(org.openmrs.reference.ComeBackToApplicationAfterLogoutTest): Test killed due to server failure
18-Nov-2021 02:11:34   editDemographicTest(org.openmrs.reference.EditDemographicTest): Test killed due to server failure
18-Nov-2021 02:11:34   deleteVisitTypeTest(org.openmrs.reference.DeleteVisitTypeTest): Test killed due to server failure
18-Nov-2021 02:11:34   deleteFormTest(org.openmrs.reference.FormTest): Test killed due to server failure
18-Nov-2021 02:11:34   editFormTest(org.openmrs.reference.FormTest): Test killed due to server failure
18-Nov-2021 02:11:34   initiateFormPresence(org.openmrs.reference.FormTest): Test killed due to server failure
18-Nov-2021 02:11:34   addFormTest(org.openmrs.reference.FormTest): Test killed due to server failure
18-Nov-2021 02:11:34   registerUnidentifiedPatientTest(org.openmrs.reference.RegisterUnidentifiedPatientTest): Test killed due to server failure
18-Nov-2021 02:11:34   addPatientAppointmentTest(org.openmrs.reference.AddPatientAppointmentTest): Test killed due to server failure
18-Nov-2021 02:11:34   admitExitInpatientTest(org.openmrs.reference.AdmitExitInpatientTest): Test killed due to server failure
18-Nov-2021 02:11:34   deleteRequestAppointmentTest(org.openmrs.reference.DeleteRequestAppointmentTest): Test killed due to server failure
18-Nov-2021 02:11:34   editAllergyTest(org.openmrs.reference.EditAllergyTest): Test killed due to server failure
18-Nov-2021 02:11:34   visitNoteTest(org.openmrs.reference.VisitNoteTest): Test killed due to server failure
18-Nov-2021 02:11:34   createPersonTest(org.openmrs.reference.CreatePersonTest): Test killed due to server failure
18-Nov-2021 02:11:34   findPatientByNameTest(org.openmrs.reference.FindPatientByNameTest): Test killed due to server failure
18-Nov-2021 02:11:34   addUserTest(org.openmrs.reference.AddUserTest): Test killed due to server failure
18-Nov-2021 02:11:34   addProviderTest(org.openmrs.reference.AddProviderTest): Test killed due to server failure
18-Nov-2021 02:11:34   addPastVisitTest(org.openmrs.reference.AddPastVisitTest): Test killed due to server failure
18-Nov-2021 02:11:34   recordMergeIssueTest(org.openmrs.reference.RecordMergeIssueTest): Test killed due to server failure
18-Nov-2021 02:11:34   captureVitalsTest(org.openmrs.reference.CaptureVitalsTest): Test killed due to server failure
18-Nov-2021 02:11:34   namePatientAccentedLetterTest(org.openmrs.reference.NamePatientAccentedLetterTest): Test killed due to server failure
18-Nov-2021 02:11:34   retirePersonTest(org.openmrs.reference.RetirePersonTest): Test killed due to server failure
18-Nov-2021 02:11:34   endVisitTest(org.openmrs.reference.EndVisitTest): Test killed due to server failure
18-Nov-2021 02:11:34   deleteAppointmentBlockTest(org.openmrs.reference.DeleteAppointmentBlockTest): Test killed due to server failure
18-Nov-2021 02:11:34   bookRequestAppointmentTest(org.openmrs.reference.BookRequestAppointmentTest): Test killed due to server failure
18-Nov-2021 02:11:34   addDeleteServiceTest(org.openmrs.reference.AddDeleteServiceTest): Test killed due to server failure
18-Nov-2021 02:11:34   addEditAppointmentBlockTest(org.openmrs.reference.AddEditAppointmentBlockTest): Test killed due to server failure
18-Nov-2021 02:11:34   retireProviderTest(org.openmrs.reference.RetireProviderTest): Test killed due to server failure
18-Nov-2021 02:11:34   mergePatientTest(org.openmrs.reference.MergePatientTest): Test killed due to server failure
18-Nov-2021 02:11:34   addLocationTest(org.openmrs.reference.AddDeleteLocationTest): Test killed due to server failure
18-Nov-2021 02:11:34   duplicatePatientRegisterTest(org.openmrs.reference.DuplicatePatientRegisterTest): Test killed due to server failure
18-Nov-2021 02:11:34   usingBackButtonInMergePatientTest(org.openmrs.reference.UsingBackButtonInMergePatientTest): Test killed due to server failure
18-Nov-2021 02:11:34   addDiagnosisToVisitNoteTest(org.openmrs.reference.AddDiagnosisToVisitNoteTest): Test killed due to server failure
18-Nov-2021 02:11:34   mergeVisitsTest(org.openmrs.reference.MergeVisitsTest): Test killed due to server failure
18-Nov-2021 02:11:34   checkModulesTest(org.openmrs.reference.CheckModulesTest): Test killed due to server failure
18-Nov-2021 02:11:34   editServiceTest(org.openmrs.reference.EditServiceTest): Test killed due to server failure
18-Nov-2021 02:11:34   addNewAllergyTest(org.openmrs.reference.AddNewAllergyTest): Test killed due to server failure
18-Nov-2021 02:11:34   verifyNurseModulesAvailableOnHomePage(org.openmrs.reference.LoginTest): Test killed due to server failure
18-Nov-2021 02:11:34   verifyModulesAvailableOnHomePage(org.openmrs.reference.LoginTest): Test killed due to server failure
18-Nov-2021 02:11:34   verifySysadminModulesAvailableOnHomePage(org.openmrs.reference.LoginTest): Test killed due to server failure
18-Nov-2021 02:11:34   verifyClerkModulesAvailableOnHomePage(org.openmrs.reference.LoginTest): Test killed due to server failure
18-Nov-2021 02:11:34   verifyDoctorModulesAvailableOnHomePage(org.openmrs.reference.LoginTest): Test killed due to server failure
18-Nov-2021 02:11:34   deleteProviderTest(org.openmrs.reference.DeleteProviderTest): Test killed due to server failure
18-Nov-2021 02:11:34   registerPatientTest(org.openmrs.reference.RegisterPatientTest): Test killed due to server failure
18-Nov-2021 02:11:34   contactInfoTest(org.openmrs.reference.ContactInfoTest): Test killed due to server failure
18-Nov-2021 02:11:34   startVisitTest(org.openmrs.reference.StartVisitTest): Test killed due to server failure
18-Nov-2021 02:11:34   deletePersonTest(org.openmrs.reference.DeletePersonTest): Test killed due to server failure
18-Nov-2021 02:11:34   editProviderTest(org.openmrs.reference.EditProviderTest): Test killed due to server failure
18-Nov-2021 02:11:34   retireVisitTypeTest(org.openmrs.reference.RetireVisitTypeTest): Test killed due to server failure
18-Nov-2021 02:11:34
18-Nov-2021 02:11:34 Tests in error:
18-Nov-2021 02:11:34   unidentifiedPatientKeyboardTest(org.openmrs.reference.UnidentifiedPatientKeyboardTest)
18-Nov-2021 02:11:34   unidentifiedPatientKeyboardTest(org.openmrs.reference.UnidentifiedPatientKeyboardTest): Session ID is null. Using WebDriver after calling quit()?(..)
18-Nov-2021 02:11:34   editPersonTest(org.openmrs.reference.EditPersonTest): Delete request failed: https://qa-refapp.openmrs.org/openmrs/ws/rest/v1/person/null?purge=true
18-Nov-2021 02:11:34   retireLocationTest(org.openmrs.reference.RetireLocationTest): Delete request failed: https://qa-refapp.openmrs.org/openmrs/ws/rest/v1/location/null?purge=true
18-Nov-2021 02:11:34   editVisitTypeTest(org.openmrs.reference.EditVisitTypeTest): Delete request failed: https://qa-refapp.openmrs.org/openmrs/ws/rest/v1/visittype/null?purge=true
18-Nov-2021 02:11:34   deleteVisitTypeTest(org.openmrs.reference.DeleteVisitTypeTest): Delete request failed: https://qa-refapp.openmrs.org/openmrs/ws/rest/v1/visittype/null?purge=true
18-Nov-2021 02:11:34   deleteFormTest(org.openmrs.reference.FormTest)
18-Nov-2021 02:11:34   editFormTest(org.openmrs.reference.FormTest)
18-Nov-2021 02:11:34   initiateFormPresence(org.openmrs.reference.FormTest)
18-Nov-2021 02:11:34   addFormTest(org.openmrs.reference.FormTest)
18-Nov-2021 02:11:34   registerUnidentifiedPatientTest(org.openmrs.reference.RegisterUnidentifiedPatientTest)
18-Nov-2021 02:11:34   findPatientByNameTest(org.openmrs.reference.FindPatientByNameTest)
18-Nov-2021 02:11:34   addProviderTest(org.openmrs.reference.AddProviderTest): Delete request failed: https://qa-refapp.openmrs.org/openmrs/ws/rest/v1/person/null?purge=true
18-Nov-2021 02:11:34   recordMergeIssueTest(org.openmrs.reference.RecordMergeIssueTest)
18-Nov-2021 02:11:34   namePatientAccentedLetterTest(org.openmrs.reference.NamePatientAccentedLetterTest)
18-Nov-2021 02:11:34   retirePersonTest(org.openmrs.reference.RetirePersonTest): Delete request failed: https://qa-refapp.openmrs.org/openmrs/ws/rest/v1/person/null?purge=true
18-Nov-2021 02:11:34   retireProviderTest(org.openmrs.reference.RetireProviderTest): Delete request failed: https://qa-refapp.openmrs.org/openmrs/ws/rest/v1/provider/null?purge=true
18-Nov-2021 02:11:34   addLocationTest(org.openmrs.reference.AddDeleteLocationTest): Delete request failed: https://qa-refapp.openmrs.org/openmrs/ws/rest/v1//locationtag/null?purge=true
18-Nov-2021 02:11:34   duplicatePatientRegisterTest(org.openmrs.reference.DuplicatePatientRegisterTest)
18-Nov-2021 02:11:34   usingBackButtonInMergePatientTest(org.openmrs.reference.UsingBackButtonInMergePatientTest)
18-Nov-2021 02:11:34   mergeVisitsTest(org.openmrs.reference.MergeVisitsTest)
18-Nov-2021 02:11:34   deleteProviderTest(org.openmrs.reference.DeleteProviderTest): Delete request failed: https://qa-refapp.openmrs.org/openmrs/ws/rest/v1/provider/null?purge=true
18-Nov-2021 02:11:34   registerPatientTest(org.openmrs.reference.RegisterPatientTest)
18-Nov-2021 02:11:34   deletePersonTest(org.openmrs.reference.DeletePersonTest): Delete request failed: https://qa-refapp.openmrs.org/openmrs/ws/rest/v1/person/null?purge=true
18-Nov-2021 02:11:34   editProviderTest(org.openmrs.reference.EditProviderTest): Delete request failed: https://qa-refapp.openmrs.org/openmrs/ws/rest/v1/provider/null?purge=true
18-Nov-2021 02:11:34   retireVisitTypeTest(org.openmrs.reference.RetireVisitTypeTest): Delete request failed: https://qa-refapp.openmrs.org/openmrs/ws/rest/v1/visittype/null?purge=true
18-Nov-2021 02:11:34
18-Nov-2021 02:11:34 Tests run: 85, Failures: 59, Errors: 26, Skipped: 0
18-Nov-2021 02:11:34
18-Nov-2021 02:11:34 [INFO] ------------------------------------------------------------------------
18-Nov-2021 02:11:34 [INFO] Reactor Summary:
18-Nov-2021 02:11:34 [INFO]
18-Nov-2021 02:11:34 [INFO] Reference Application Distribution ................. SUCCESS [  0.223 s]
18-Nov-2021 02:11:34 [INFO] Reference Application Distribution Package ......... SUCCESS [ 23.587 s]
18-Nov-2021 02:11:34 [INFO] Reference Application Distribution UI Tests ........ FAILURE [10:37 min]
18-Nov-2021 02:11:34 [INFO] ------------------------------------------------------------------------
18-Nov-2021 02:11:34 [INFO] BUILD FAILURE
18-Nov-2021 02:11:34 [INFO] ------------------------------------------------------------------------
18-Nov-2021 02:11:34 [INFO] Total time: 11:01 min
18-Nov-2021 02:11:34 [INFO] Finished at: 2021-11-18T02:11:34+00:00
18-Nov-2021 02:11:35 [INFO] Final Memory: 63M/361M
18-Nov-2021 02:11:35 [INFO] ------------------------------------------------------------------------
18-Nov-2021 02:11:35 [ERROR] Failed to execute goal org.apache.maven.plugins:maven-surefire-plugin:2.12:test (default-test) on project referenceapplication-ui-tests: There are test failures.
18-Nov-2021 02:11:35 [ERROR]
18-Nov-2021 02:11:35 [ERROR] Please refer to /home/bamboo-agent/bamboo-agent/xml-data/build-dir/REFAPP-UI-FRAMEWORK/ui-tests/target/surefire-reports for the individual test results.
18-Nov-2021 02:11:35 [ERROR] -> [Help 1]
18-Nov-2021 02:11:35 org.apache.maven.lifecycle.LifecycleExecutionException: Failed to execute goal org.apache.maven.plugins:maven-surefire-plugin:2.12:test (default-test) on project referenceapplication-ui-tests: There are test failures.
18-Nov-2021 02:11:35
18-Nov-2021 02:11:35 Please refer to /home/bamboo-agent/bamboo-agent/xml-data/build-dir/REFAPP-UI-FRAMEWORK/ui-tests/target/surefire-reports for the individual test results.
18-Nov-2021 02:11:35         at org.apache.maven.lifecycle.internal.MojoExecutor.execute(MojoExecutor.java:212)
18-Nov-2021 02:11:35         at org.apache.maven.lifecycle.internal.MojoExecutor.execute(MojoExecutor.java:153)
18-Nov-2021 02:11:35         at org.apache.maven.lifecycle.internal.MojoExecutor.execute(MojoExecutor.java:145)
18-Nov-2021 02:11:35         at org.apache.maven.lifecycle.internal.LifecycleModuleBuilder.buildProject(LifecycleModuleBuilder.java:116)
18-Nov-2021 02:11:35         at org.apache.maven.lifecycle.internal.LifecycleModuleBuilder.buildProject(LifecycleModuleBuilder.java:80)
18-Nov-2021 02:11:35         at org.apache.maven.lifecycle.internal.builder.singlethreaded.SingleThreadedBuilder.build(SingleThreadedBuilder.java:51)
18-Nov-2021 02:11:35         at org.apache.maven.lifecycle.internal.LifecycleStarter.execute(LifecycleStarter.java:128)
18-Nov-2021 02:11:35         at org.apache.maven.DefaultMaven.doExecute(DefaultMaven.java:307)
18-Nov-2021 02:11:35         at org.apache.maven.DefaultMaven.doExecute(DefaultMaven.java:193)
18-Nov-2021 02:11:35         at org.apache.maven.DefaultMaven.execute(DefaultMaven.java:106)
18-Nov-2021 02:11:35         at org.apache.maven.cli.MavenCli.execute(MavenCli.java:863)
18-Nov-2021 02:11:35         at org.apache.maven.cli.MavenCli.doMain(MavenCli.java:288)
18-Nov-2021 02:11:35         at org.apache.maven.cli.MavenCli.main(MavenCli.java:199)
18-Nov-2021 02:11:35         at sun.reflect.NativeMethodAccessorImpl.invoke0(Native Method)
18-Nov-2021 02:11:35         at sun.reflect.NativeMethodAccessorImpl.invoke(NativeMethodAccessorImpl.java:62)
18-Nov-2021 02:11:35         at sun.reflect.DelegatingMethodAccessorImpl.invoke(DelegatingMethodAccessorImpl.java:43)
18-Nov-2021 02:11:35         at java.lang.reflect.Method.invoke(Method.java:498)
18-Nov-2021 02:11:35         at org.codehaus.plexus.classworlds.launcher.Launcher.launchEnhanced(Launcher.java:289)
18-Nov-2021 02:11:35         at org.codehaus.plexus.classworlds.launcher.Launcher.launch(Launcher.java:229)
18-Nov-2021 02:11:35         at org.codehaus.plexus.classworlds.launcher.Launcher.mainWithExitCode(Launcher.java:415)
18-Nov-2021 02:11:35         at org.codehaus.plexus.classworlds.launcher.Launcher.main(Launcher.java:356)
18-Nov-2021 02:11:35 Caused by: org.apache.maven.plugin.MojoFailureException: There are test failures.
18-Nov-2021 02:11:35
18-Nov-2021 02:11:35 Please refer to /home/bamboo-agent/bamboo-agent/xml-data/build-dir/REFAPP-UI-FRAMEWORK/ui-tests/target/surefire-reports for the individual test results.
18-Nov-2021 02:11:35         at org.apache.maven.plugin.surefire.SurefireHelper.reportExecution(SurefireHelper.java:83)
18-Nov-2021 02:11:35         at org.apache.maven.plugin.surefire.SurefirePlugin.writeSummary(SurefirePlugin.java:673)
18-Nov-2021 02:11:35         at org.apache.maven.plugin.surefire.SurefirePlugin.handleSummary(SurefirePlugin.java:647)
18-Nov-2021 02:11:35         at org.apache.maven.plugin.surefire.AbstractSurefireMojo.executeAfterPreconditionsChecked(AbstractSurefireMojo.java:137)
18-Nov-2021 02:11:35         at org.apache.maven.plugin.surefire.AbstractSurefireMojo.execute(AbstractSurefireMojo.java:98)
18-Nov-2021 02:11:35         at org.apache.maven.plugin.DefaultBuildPluginManager.executeMojo(DefaultBuildPluginManager.java:134)
18-Nov-2021 02:11:35         at org.apache.maven.lifecycle.internal.MojoExecutor.execute(MojoExecutor.java:207)
18-Nov-2021 02:11:35         ... 20 more
18-Nov-2021 02:11:35 [ERROR]
18-Nov-2021 02:11:35 [ERROR] Re-run Maven using the -X switch to enable full debug logging.
18-Nov-2021 02:11:35 [ERROR]
18-Nov-2021 02:11:35 [ERROR] For more information about the errors and possible solutions, please read the following articles:
18-Nov-2021 02:11:35 [ERROR] [Help 1] http://cwiki.apache.org/confluence/display/MAVEN/MojoFailureException
18-Nov-2021 02:11:35 [ERROR]
18-Nov-2021 02:11:35 [ERROR] After correcting the problems, you can resume the build with the command
18-Nov-2021 02:11:35 [ERROR]   mvn <goals> -rf :referenceapplication-ui-tests
18-Nov-2021 02:11:35 Failing task since return code of [/usr/share/apache-maven-3.3.9/bin/mvn --batch-mode -Djava.io.tmpdir=/home/bamboo-agent/bamboo-agent/.agent_tmp/REFAPP-UI-FRAMEWORK clean install -DskipTests=false -e] was 1 while expected 0
18-Nov-2021 02:11:35 Parsing test results under /home/bamboo-agent/bamboo-agent/xml-data/build-dir/REFAPP-UI-FRAMEWORK...
18-Nov-2021 02:11:36 Finished task 'Build distribution' with result: Failed
18-Nov-2021 02:11:36 Running post build plugin 'Docker Container Cleanup'
18-Nov-2021 02:11:36 Running post build plugin 'NCover Results Collector'
18-Nov-2021 02:11:36 Running post build plugin 'Clover Results Collector'
18-Nov-2021 02:11:36 Running post build plugin 'Sauce OnDemand Post Runner'
18-Nov-2021 02:11:36 Running post build plugin 'npm Cache Cleanup'
18-Nov-2021 02:11:36 Running post build plugin 'Artifact Copier'
18-Nov-2021 02:11:36 Finalising the build...
18-Nov-2021 02:11:36 Stopping timer.
18-Nov-2021 02:11:36 Build REFAPP-UI-FRAMEWORK-732 completed.
18-Nov-2021 02:11:36 Running on server: post build plugin 'NCover Results Collector'
18-Nov-2021 02:11:36 Running on server: post build plugin 'Build Hanging Detection Configuration'
18-Nov-2021 02:11:36 Running on server: post build plugin 'Clover Delta Calculator'
18-Nov-2021 02:11:41 Running on server: post build plugin 'Maven Dependencies Postprocessor'
18-Nov-2021 02:11:41 All post build plugins have finished
18-Nov-2021 02:11:41 Generating build results summary...
18-Nov-2021 02:11:41 Saving build results to disk...
18-Nov-2021 02:11:41 Logging substituted variables...
18-Nov-2021 02:11:41 Indexing build results...
18-Nov-2021 02:11:41 Finished building REFAPP-UI-FRAMEWORK-732.