UI tests for the reference application

Build: #733 failed

Job: Run QA UI Tests failed

Stages & jobs

  1. Ref App UI Testing

Build log

The build generated 1,676 lines of output.The output is too long and has been truncated to the last 1,000 lines. Download or view full build log

18-Nov-2021 10:07:05 [INFO] Configured Artifact: org.openmrs.module:dataexchange-omod:1.3.7:jar
18-Nov-2021 10:07:05 [INFO] Configured Artifact: org.openmrs.module:appui-omod:1.15.0:jar
18-Nov-2021 10:07:05 [INFO] Configured Artifact: org.openmrs.module:allergyui-omod:1.8.4:jar
18-Nov-2021 10:07:05 [INFO] Configured Artifact: org.openmrs.module:providermanagement-omod:2.13.0:jar
18-Nov-2021 10:07:05 [INFO] Configured Artifact: org.openmrs.module:appointmentschedulingui-omod:1.12.0:jar
18-Nov-2021 10:07:05 [INFO] Configured Artifact: org.openmrs.module:attachments-omod:2.5.0:jar
18-Nov-2021 10:07:05 [INFO] Configured Artifact: org.openmrs.module:formentryapp-omod:1.4.2:jar
18-Nov-2021 10:07:05 [INFO] Configured Artifact: org.openmrs.module:idgen-omod:4.7.0:jar
18-Nov-2021 10:07:05 [INFO] Configured Artifact: org.openmrs.module:metadatamapping-omod:1.4.0:jar
18-Nov-2021 10:07:05 [INFO] Configured Artifact: org.openmrs.module:htmlformentryui-omod:2.2.0-SNAPSHOT:jar
18-Nov-2021 10:07:05 [INFO] Downloading: http://mavenrepo.openmrs.org/nexus/content/repositories/public/org/openmrs/module/htmlformentryui-omod/2.2.0-SNAPSHOT/maven-metadata.xml
18-Nov-2021 10:07:05 [INFO] Downloaded: http://mavenrepo.openmrs.org/nexus/content/repositories/public/org/openmrs/module/htmlformentryui-omod/2.2.0-SNAPSHOT/maven-metadata.xml (1004 B at 3.7 KB/sec)
18-Nov-2021 10:07:05 [INFO] Downloading: http://mavenrepo.openmrs.org/nexus/content/repositories/public/org/openmrs/module/htmlformentryui-omod/2.2.0-SNAPSHOT/htmlformentryui-omod-2.2.0-20211118.001705-16.jar
18-Nov-2021 10:07:06 [INFO] Downloaded: http://mavenrepo.openmrs.org/nexus/content/repositories/public/org/openmrs/module/htmlformentryui-omod/2.2.0-SNAPSHOT/htmlformentryui-omod-2.2.0-20211118.001705-16.jar (1431 KB at 1904.3 KB/sec)
18-Nov-2021 10:07:06 [INFO] Configured Artifact: org.openmrs.module:referencedemodata-omod:1.4.7:jar
18-Nov-2021 10:07:06 [INFO] Configured Artifact: org.openmrs.module:emrapi-omod:1.32.0:jar
18-Nov-2021 10:07:06 [INFO] Configured Artifact: org.openmrs.module:referenceapplication-omod:2.13.0-SNAPSHOT:jar
18-Nov-2021 10:07:06 [INFO] Downloading: http://mavenrepo.openmrs.org/nexus/content/repositories/public/org/openmrs/module/referenceapplication-omod/2.13.0-SNAPSHOT/maven-metadata.xml
18-Nov-2021 10:07:06 [INFO] Downloaded: http://mavenrepo.openmrs.org/nexus/content/repositories/public/org/openmrs/module/referenceapplication-omod/2.13.0-SNAPSHOT/maven-metadata.xml (799 B at 3.1 KB/sec)
18-Nov-2021 10:07:06 [INFO] Downloading: http://mavenrepo.openmrs.org/nexus/content/repositories/public/org/openmrs/module/referenceapplication-omod/2.13.0-SNAPSHOT/referenceapplication-omod-2.13.0-20211118.002013-38.jar
18-Nov-2021 10:07:07 [INFO] Downloaded: http://mavenrepo.openmrs.org/nexus/content/repositories/public/org/openmrs/module/referenceapplication-omod/2.13.0-SNAPSHOT/referenceapplication-omod-2.13.0-20211118.002013-38.jar (1902 KB at 3012.8 KB/sec)
18-Nov-2021 10:07:07 [INFO] Configured Artifact: org.openmrs.module:htmlformentry-omod:4.3.0-SNAPSHOT:jar
18-Nov-2021 10:07:07 [INFO] Downloading: http://mavenrepo.openmrs.org/nexus/content/repositories/public/org/openmrs/module/htmlformentry-omod/4.3.0-SNAPSHOT/maven-metadata.xml
18-Nov-2021 10:07:07 [INFO] Downloaded: http://mavenrepo.openmrs.org/nexus/content/repositories/public/org/openmrs/module/htmlformentry-omod/4.3.0-SNAPSHOT/maven-metadata.xml (998 B at 3.9 KB/sec)
18-Nov-2021 10:07:07 [INFO] Downloading: http://mavenrepo.openmrs.org/nexus/content/repositories/public/org/openmrs/module/htmlformentry-omod/4.3.0-SNAPSHOT/htmlformentry-omod-4.3.0-20211117.191258-2.jar
18-Nov-2021 10:07:07 [INFO] Downloaded: http://mavenrepo.openmrs.org/nexus/content/repositories/public/org/openmrs/module/htmlformentry-omod/4.3.0-SNAPSHOT/htmlformentry-omod-4.3.0-20211117.191258-2.jar (2357 KB at 3430.5 KB/sec)
18-Nov-2021 10:07:08 [INFO] Configured Artifact: org.openmrs.module:appframework-omod:2.16.0:jar
18-Nov-2021 10:07:08 [INFO] Configured Artifact: org.openmrs.module:referencemetadata-omod:2.12.0:jar
18-Nov-2021 10:07:08 [INFO] Configured Artifact: org.openmrs.module:reportingui-omod:1.8.0:jar
18-Nov-2021 10:07:08 [INFO] Configured Artifact: org.openmrs.module:coreapps-omod:1.35.0:jar
18-Nov-2021 10:07:08 [INFO] Configured Artifact: org.openmrs.module:reportingcompatibility-omod:2.0.8:jar
18-Nov-2021 10:07:08 [INFO] Configured Artifact: org.openmrs.module:reporting-omod:1.23.0:jar
18-Nov-2021 10:07:08 [INFO] Configured Artifact: org.openmrs.module:adminui-omod:1.6.0:jar
18-Nov-2021 10:07:08 [INFO] Configured Artifact: org.openmrs.module:registrationcore-omod:1.11.0:jar
18-Nov-2021 10:07:08 [INFO] Configured Artifact: org.openmrs.module:appointmentscheduling-omod:1.17.0-SNAPSHOT:jar
18-Nov-2021 10:07:08 [INFO] Downloading: http://mavenrepo.openmrs.org/nexus/content/repositories/public/org/openmrs/module/appointmentscheduling-omod/1.17.0-SNAPSHOT/maven-metadata.xml
18-Nov-2021 10:07:08 [INFO] Downloaded: http://mavenrepo.openmrs.org/nexus/content/repositories/public/org/openmrs/module/appointmentscheduling-omod/1.17.0-SNAPSHOT/maven-metadata.xml (797 B at 3.0 KB/sec)
18-Nov-2021 10:07:08 [INFO] Downloading: http://mavenrepo.openmrs.org/nexus/content/repositories/public/org/openmrs/module/appointmentscheduling-omod/1.17.0-SNAPSHOT/appointmentscheduling-omod-1.17.0-20211104.173619-2.jar
18-Nov-2021 10:07:09 [INFO] Downloaded: http://mavenrepo.openmrs.org/nexus/content/repositories/public/org/openmrs/module/appointmentscheduling-omod/1.17.0-SNAPSHOT/appointmentscheduling-omod-1.17.0-20211104.173619-2.jar (1539 KB at 2320.4 KB/sec)
18-Nov-2021 10:07:09 [INFO] Configured Artifact: org.openmrs.module:atlas-omod:2.2.5:omod
18-Nov-2021 10:07:09 [INFO] Configured Artifact: org.openmrs.module:calculation-omod:1.3.0:jar
18-Nov-2021 10:07:09 [INFO] Configured Artifact: org.openmrs.module:webservices.rest-omod:2.32.0:jar
18-Nov-2021 10:07:09 [INFO] Configured Artifact: org.openmrs.module:spa-omod:1.0.8:jar
18-Nov-2021 10:07:09 [INFO] Configured Artifact: org.openmrs.module:uicommons-omod:2.19.0:jar
18-Nov-2021 10:07:09 [INFO] Configured Artifact: org.openmrs.module:uiframework-omod:3.23.0-SNAPSHOT:jar
18-Nov-2021 10:07:09 [INFO] Downloading: http://mavenrepo.openmrs.org/nexus/content/repositories/public/org/openmrs/module/uiframework-omod/3.23.0-SNAPSHOT/maven-metadata.xml
18-Nov-2021 10:07:09 [INFO] Downloaded: http://mavenrepo.openmrs.org/nexus/content/repositories/public/org/openmrs/module/uiframework-omod/3.23.0-SNAPSHOT/maven-metadata.xml (1000 B at 3.8 KB/sec)
18-Nov-2021 10:07:09 [INFO] Downloading: http://mavenrepo.openmrs.org/nexus/content/repositories/public/org/openmrs/module/uiframework-omod/3.23.0-SNAPSHOT/uiframework-omod-3.23.0-20211104.111012-6.jar
18-Nov-2021 10:07:10 [INFO] Downloaded: http://mavenrepo.openmrs.org/nexus/content/repositories/public/org/openmrs/module/uiframework-omod/3.23.0-SNAPSHOT/uiframework-omod-3.23.0-20211104.111012-6.jar (2667 KB at 2133.3 KB/sec)
18-Nov-2021 10:07:10 [INFO] Configured Artifact: org.openmrs.module:metadatasharing-omod:1.8.0:jar
18-Nov-2021 10:07:10 [INFO] Copying addresshierarchy-omod-2.14.2.jar to /home/bamboo-agent/bamboo-agent/xml-data/build-dir/REFAPP-UI-FRAMEWORK/package/target/distro/web/modules/addresshierarchy-2.14.2.omod
18-Nov-2021 10:07:11 [INFO] Copying legacyui-omod-1.10.0-SNAPSHOT.jar to /home/bamboo-agent/bamboo-agent/xml-data/build-dir/REFAPP-UI-FRAMEWORK/package/target/distro/web/modules/legacyui-1.10.0-SNAPSHOT.omod
18-Nov-2021 10:07:11 [INFO] Copying openconceptlab-omod-1.2.9.jar to /home/bamboo-agent/bamboo-agent/xml-data/build-dir/REFAPP-UI-FRAMEWORK/package/target/distro/web/modules/openconceptlab-1.2.9.omod
18-Nov-2021 10:07:11 [INFO] Copying metadatadeploy-omod-1.13.0.jar to /home/bamboo-agent/bamboo-agent/xml-data/build-dir/REFAPP-UI-FRAMEWORK/package/target/distro/web/modules/metadatadeploy-1.13.0.omod
18-Nov-2021 10:07:11 [INFO] Copying reportingrest-omod-1.12.0.jar to /home/bamboo-agent/bamboo-agent/xml-data/build-dir/REFAPP-UI-FRAMEWORK/package/target/distro/web/modules/reportingrest-1.12.0.omod
18-Nov-2021 10:07:11 [INFO] Copying owa-omod-1.13.0.jar to /home/bamboo-agent/bamboo-agent/xml-data/build-dir/REFAPP-UI-FRAMEWORK/package/target/distro/web/modules/owa-1.13.0.omod
18-Nov-2021 10:07:11 [INFO] Copying fhir2-omod-1.3.0.jar to /home/bamboo-agent/bamboo-agent/xml-data/build-dir/REFAPP-UI-FRAMEWORK/package/target/distro/web/modules/fhir2-1.3.0.omod
18-Nov-2021 10:07:12 [INFO] Copying serialization.xstream-omod-0.2.15.omod to /home/bamboo-agent/bamboo-agent/xml-data/build-dir/REFAPP-UI-FRAMEWORK/package/target/distro/web/modules/serialization.xstream-0.2.15.omod
18-Nov-2021 10:07:12 [INFO] Copying registrationapp-omod-1.24.0.jar to /home/bamboo-agent/bamboo-agent/xml-data/build-dir/REFAPP-UI-FRAMEWORK/package/target/distro/web/modules/registrationapp-1.24.0.omod
18-Nov-2021 10:07:12 [INFO] Copying event-omod-2.10.0.jar to /home/bamboo-agent/bamboo-agent/xml-data/build-dir/REFAPP-UI-FRAMEWORK/package/target/distro/web/modules/event-2.10.0.omod
18-Nov-2021 10:07:12 [INFO] Copying uilibrary-omod-2.0.7.jar to /home/bamboo-agent/bamboo-agent/xml-data/build-dir/REFAPP-UI-FRAMEWORK/package/target/distro/web/modules/uilibrary-2.0.7.omod
18-Nov-2021 10:07:12 [INFO] Copying htmlwidgets-omod-1.10.0.jar to /home/bamboo-agent/bamboo-agent/xml-data/build-dir/REFAPP-UI-FRAMEWORK/package/target/distro/web/modules/htmlwidgets-1.10.0.omod
18-Nov-2021 10:07:12 [INFO] Copying dataexchange-omod-1.3.7.jar to /home/bamboo-agent/bamboo-agent/xml-data/build-dir/REFAPP-UI-FRAMEWORK/package/target/distro/web/modules/dataexchange-1.3.7.omod
18-Nov-2021 10:07:12 [INFO] Copying appui-omod-1.15.0.jar to /home/bamboo-agent/bamboo-agent/xml-data/build-dir/REFAPP-UI-FRAMEWORK/package/target/distro/web/modules/appui-1.15.0.omod
18-Nov-2021 10:07:12 [INFO] Copying allergyui-omod-1.8.4.jar to /home/bamboo-agent/bamboo-agent/xml-data/build-dir/REFAPP-UI-FRAMEWORK/package/target/distro/web/modules/allergyui-1.8.4.omod
18-Nov-2021 10:07:12 [INFO] Copying providermanagement-omod-2.13.0.jar to /home/bamboo-agent/bamboo-agent/xml-data/build-dir/REFAPP-UI-FRAMEWORK/package/target/distro/web/modules/providermanagement-2.13.0.omod
18-Nov-2021 10:07:12 [INFO] Copying appointmentschedulingui-omod-1.12.0.jar to /home/bamboo-agent/bamboo-agent/xml-data/build-dir/REFAPP-UI-FRAMEWORK/package/target/distro/web/modules/appointmentschedulingui-1.12.0.omod
18-Nov-2021 10:07:12 [INFO] Copying attachments-omod-2.5.0.jar to /home/bamboo-agent/bamboo-agent/xml-data/build-dir/REFAPP-UI-FRAMEWORK/package/target/distro/web/modules/attachments-2.5.0.omod
18-Nov-2021 10:07:12 [INFO] Copying formentryapp-omod-1.4.2.jar to /home/bamboo-agent/bamboo-agent/xml-data/build-dir/REFAPP-UI-FRAMEWORK/package/target/distro/web/modules/formentryapp-1.4.2.omod
18-Nov-2021 10:07:12 [INFO] Copying idgen-omod-4.7.0.jar to /home/bamboo-agent/bamboo-agent/xml-data/build-dir/REFAPP-UI-FRAMEWORK/package/target/distro/web/modules/idgen-4.7.0.omod
18-Nov-2021 10:07:12 [INFO] Copying metadatamapping-omod-1.4.0.jar to /home/bamboo-agent/bamboo-agent/xml-data/build-dir/REFAPP-UI-FRAMEWORK/package/target/distro/web/modules/metadatamapping-1.4.0.omod
18-Nov-2021 10:07:12 [INFO] Copying htmlformentryui-omod-2.2.0-SNAPSHOT.jar to /home/bamboo-agent/bamboo-agent/xml-data/build-dir/REFAPP-UI-FRAMEWORK/package/target/distro/web/modules/htmlformentryui-2.2.0-SNAPSHOT.omod
18-Nov-2021 10:07:12 [INFO] Copying referencedemodata-omod-1.4.7.jar to /home/bamboo-agent/bamboo-agent/xml-data/build-dir/REFAPP-UI-FRAMEWORK/package/target/distro/web/modules/referencedemodata-1.4.7.omod
18-Nov-2021 10:07:13 [INFO] Copying emrapi-omod-1.32.0.jar to /home/bamboo-agent/bamboo-agent/xml-data/build-dir/REFAPP-UI-FRAMEWORK/package/target/distro/web/modules/emrapi-1.32.0.omod
18-Nov-2021 10:07:13 [INFO] Copying referenceapplication-omod-2.13.0-SNAPSHOT.jar to /home/bamboo-agent/bamboo-agent/xml-data/build-dir/REFAPP-UI-FRAMEWORK/package/target/distro/web/modules/referenceapplication-2.13.0-SNAPSHOT.omod
18-Nov-2021 10:07:13 [INFO] Copying htmlformentry-omod-4.3.0-SNAPSHOT.jar to /home/bamboo-agent/bamboo-agent/xml-data/build-dir/REFAPP-UI-FRAMEWORK/package/target/distro/web/modules/htmlformentry-4.3.0-SNAPSHOT.omod
18-Nov-2021 10:07:13 [INFO] Copying appframework-omod-2.16.0.jar to /home/bamboo-agent/bamboo-agent/xml-data/build-dir/REFAPP-UI-FRAMEWORK/package/target/distro/web/modules/appframework-2.16.0.omod
18-Nov-2021 10:07:13 [INFO] Copying referencemetadata-omod-2.12.0.jar to /home/bamboo-agent/bamboo-agent/xml-data/build-dir/REFAPP-UI-FRAMEWORK/package/target/distro/web/modules/referencemetadata-2.12.0.omod
18-Nov-2021 10:07:13 [INFO] Copying reportingui-omod-1.8.0.jar to /home/bamboo-agent/bamboo-agent/xml-data/build-dir/REFAPP-UI-FRAMEWORK/package/target/distro/web/modules/reportingui-1.8.0.omod
18-Nov-2021 10:07:13 [INFO] Copying coreapps-omod-1.35.0.jar to /home/bamboo-agent/bamboo-agent/xml-data/build-dir/REFAPP-UI-FRAMEWORK/package/target/distro/web/modules/coreapps-1.35.0.omod
18-Nov-2021 10:07:13 [INFO] Copying reportingcompatibility-omod-2.0.8.jar to /home/bamboo-agent/bamboo-agent/xml-data/build-dir/REFAPP-UI-FRAMEWORK/package/target/distro/web/modules/reportingcompatibility-2.0.8.omod
18-Nov-2021 10:07:13 [INFO] Copying reporting-omod-1.23.0.jar to /home/bamboo-agent/bamboo-agent/xml-data/build-dir/REFAPP-UI-FRAMEWORK/package/target/distro/web/modules/reporting-1.23.0.omod
18-Nov-2021 10:07:14 [INFO] Copying adminui-omod-1.6.0.jar to /home/bamboo-agent/bamboo-agent/xml-data/build-dir/REFAPP-UI-FRAMEWORK/package/target/distro/web/modules/adminui-1.6.0.omod
18-Nov-2021 10:07:14 [INFO] Copying registrationcore-omod-1.11.0.jar to /home/bamboo-agent/bamboo-agent/xml-data/build-dir/REFAPP-UI-FRAMEWORK/package/target/distro/web/modules/registrationcore-1.11.0.omod
18-Nov-2021 10:07:14 [INFO] Copying appointmentscheduling-omod-1.17.0-SNAPSHOT.jar to /home/bamboo-agent/bamboo-agent/xml-data/build-dir/REFAPP-UI-FRAMEWORK/package/target/distro/web/modules/appointmentscheduling-1.17.0-SNAPSHOT.omod
18-Nov-2021 10:07:14 [INFO] Copying atlas-omod-2.2.5.omod to /home/bamboo-agent/bamboo-agent/xml-data/build-dir/REFAPP-UI-FRAMEWORK/package/target/distro/web/modules/atlas-2.2.5.omod
18-Nov-2021 10:07:14 [INFO] Copying calculation-omod-1.3.0.jar to /home/bamboo-agent/bamboo-agent/xml-data/build-dir/REFAPP-UI-FRAMEWORK/package/target/distro/web/modules/calculation-1.3.0.omod
18-Nov-2021 10:07:14 [INFO] Copying webservices.rest-omod-2.32.0.jar to /home/bamboo-agent/bamboo-agent/xml-data/build-dir/REFAPP-UI-FRAMEWORK/package/target/distro/web/modules/webservices.rest-2.32.0.omod
18-Nov-2021 10:07:14 [INFO] Copying spa-omod-1.0.8.jar to /home/bamboo-agent/bamboo-agent/xml-data/build-dir/REFAPP-UI-FRAMEWORK/package/target/distro/web/modules/spa-1.0.8.omod
18-Nov-2021 10:07:14 [INFO] Copying uicommons-omod-2.19.0.jar to /home/bamboo-agent/bamboo-agent/xml-data/build-dir/REFAPP-UI-FRAMEWORK/package/target/distro/web/modules/uicommons-2.19.0.omod
18-Nov-2021 10:07:14 [INFO] Copying uiframework-omod-3.23.0-SNAPSHOT.jar to /home/bamboo-agent/bamboo-agent/xml-data/build-dir/REFAPP-UI-FRAMEWORK/package/target/distro/web/modules/uiframework-3.23.0-SNAPSHOT.omod
18-Nov-2021 10:07:14 [INFO] Copying metadatasharing-omod-1.8.0.jar to /home/bamboo-agent/bamboo-agent/xml-data/build-dir/REFAPP-UI-FRAMEWORK/package/target/distro/web/modules/metadatasharing-1.8.0.omod
18-Nov-2021 10:07:14
18-Nov-2021 10:07:14 Downloading OWAs...
18-Nov-2021 10:07:14
18-Nov-2021 10:07:14
18-Nov-2021 10:07:14 Downloading OWA: org.openmrs.owa:openmrs-owa-sysadmin:1.2
18-Nov-2021 10:07:14 [INFO] Configured Artifact: org.openmrs.owa:sysadmin:1.2:zip
18-Nov-2021 10:07:14 [INFO] Copying sysadmin-1.2.zip to /home/bamboo-agent/bamboo-agent/xml-data/build-dir/REFAPP-UI-FRAMEWORK/package/target/distro/web/owa/sysadmin-1.2.zip
18-Nov-2021 10:07:14
18-Nov-2021 10:07:14 Creating Docker Compose configuration...
18-Nov-2021 10:07:14
18-Nov-2021 10:07:15
18-Nov-2021 10:07:15 The 'referenceapplication' distribution created! To start up the server run 'docker-compose up' from /home/bamboo-agent/bamboo-agent/xml-data/build-dir/REFAPP-UI-FRAMEWORK/package/target/distro
18-Nov-2021 10:07:15
18-Nov-2021 10:07:15 [INFO]
18-Nov-2021 10:07:15 [INFO] --- openmrs-sdk-maven-plugin:4.0.0:build-distro (build-bundled-distro) @ referenceapplication-package ---
18-Nov-2021 10:07:15
18-Nov-2021 10:07:15 Downloading modules...
18-Nov-2021 10:07:15
18-Nov-2021 10:07:15 [INFO] Configured Artifact: org.openmrs.web:openmrs-webapp:2.4.1:war
18-Nov-2021 10:07:15 [INFO] Copying openmrs-webapp-2.4.1.war to /home/bamboo-agent/bamboo-agent/xml-data/build-dir/REFAPP-UI-FRAMEWORK/package/target/bundled-distro/web/openmrs-2.4.1.war
18-Nov-2021 10:07:15 file:/home/bamboo-agent/bamboo-agent/xml-data/build-dir/REFAPP-UI-FRAMEWORK/package/target/bundled-distro/web/openmrs-2.4.1.war
18-Nov-2021 10:07:15 target:/home/bamboo-agent/bamboo-agent/xml-data/build-dir/REFAPP-UI-FRAMEWORK/package/target/bundled-distro/web
18-Nov-2021 10:07:15 [INFO] Configured Artifact: org.openmrs.module:addresshierarchy-omod:2.14.2:jar
18-Nov-2021 10:07:15 [INFO] Configured Artifact: org.openmrs.module:legacyui-omod:1.10.0-SNAPSHOT:jar
18-Nov-2021 10:07:15 [INFO] Configured Artifact: org.openmrs.module:openconceptlab-omod:1.2.9:jar
18-Nov-2021 10:07:15 [INFO] Configured Artifact: org.openmrs.module:metadatadeploy-omod:1.13.0:jar
18-Nov-2021 10:07:15 [INFO] Configured Artifact: org.openmrs.module:reportingrest-omod:1.12.0:jar
18-Nov-2021 10:07:15 [INFO] Configured Artifact: org.openmrs.module:owa-omod:1.13.0:jar
18-Nov-2021 10:07:15 [INFO] Configured Artifact: org.openmrs.module:fhir2-omod:1.3.0:jar
18-Nov-2021 10:07:15 [INFO] Configured Artifact: org.openmrs.module:serialization.xstream-omod:0.2.15:omod
18-Nov-2021 10:07:15 [INFO] Configured Artifact: org.openmrs.module:registrationapp-omod:1.24.0:jar
18-Nov-2021 10:07:15 [INFO] Configured Artifact: org.openmrs:event-omod:2.10.0:jar
18-Nov-2021 10:07:15 [INFO] Configured Artifact: org.openmrs.module:uilibrary-omod:2.0.7:jar
18-Nov-2021 10:07:15 [INFO] Configured Artifact: org.openmrs.module:htmlwidgets-omod:1.10.0:jar
18-Nov-2021 10:07:15 [INFO] Configured Artifact: org.openmrs.module:dataexchange-omod:1.3.7:jar
18-Nov-2021 10:07:15 [INFO] Configured Artifact: org.openmrs.module:appui-omod:1.15.0:jar
18-Nov-2021 10:07:15 [INFO] Configured Artifact: org.openmrs.module:allergyui-omod:1.8.4:jar
18-Nov-2021 10:07:15 [INFO] Configured Artifact: org.openmrs.module:providermanagement-omod:2.13.0:jar
18-Nov-2021 10:07:15 [INFO] Configured Artifact: org.openmrs.module:appointmentschedulingui-omod:1.12.0:jar
18-Nov-2021 10:07:15 [INFO] Configured Artifact: org.openmrs.module:attachments-omod:2.5.0:jar
18-Nov-2021 10:07:15 [INFO] Configured Artifact: org.openmrs.module:formentryapp-omod:1.4.2:jar
18-Nov-2021 10:07:15 [INFO] Configured Artifact: org.openmrs.module:idgen-omod:4.7.0:jar
18-Nov-2021 10:07:15 [INFO] Configured Artifact: org.openmrs.module:metadatamapping-omod:1.4.0:jar
18-Nov-2021 10:07:15 [INFO] Configured Artifact: org.openmrs.module:htmlformentryui-omod:2.2.0-SNAPSHOT:jar
18-Nov-2021 10:07:15 [INFO] Configured Artifact: org.openmrs.module:referencedemodata-omod:1.4.7:jar
18-Nov-2021 10:07:15 [INFO] Configured Artifact: org.openmrs.module:emrapi-omod:1.32.0:jar
18-Nov-2021 10:07:15 [INFO] Configured Artifact: org.openmrs.module:referenceapplication-omod:2.13.0-SNAPSHOT:jar
18-Nov-2021 10:07:15 [INFO] Configured Artifact: org.openmrs.module:htmlformentry-omod:4.3.0-SNAPSHOT:jar
18-Nov-2021 10:07:15 [INFO] Configured Artifact: org.openmrs.module:appframework-omod:2.16.0:jar
18-Nov-2021 10:07:15 [INFO] Configured Artifact: org.openmrs.module:referencemetadata-omod:2.12.0:jar
18-Nov-2021 10:07:15 [INFO] Configured Artifact: org.openmrs.module:reportingui-omod:1.8.0:jar
18-Nov-2021 10:07:15 [INFO] Configured Artifact: org.openmrs.module:coreapps-omod:1.35.0:jar
18-Nov-2021 10:07:15 [INFO] Configured Artifact: org.openmrs.module:reportingcompatibility-omod:2.0.8:jar
18-Nov-2021 10:07:15 [INFO] Configured Artifact: org.openmrs.module:reporting-omod:1.23.0:jar
18-Nov-2021 10:07:15 [INFO] Configured Artifact: org.openmrs.module:adminui-omod:1.6.0:jar
18-Nov-2021 10:07:15 [INFO] Configured Artifact: org.openmrs.module:registrationcore-omod:1.11.0:jar
18-Nov-2021 10:07:15 [INFO] Configured Artifact: org.openmrs.module:appointmentscheduling-omod:1.17.0-SNAPSHOT:jar
18-Nov-2021 10:07:15 [INFO] Configured Artifact: org.openmrs.module:atlas-omod:2.2.5:omod
18-Nov-2021 10:07:15 [INFO] Configured Artifact: org.openmrs.module:calculation-omod:1.3.0:jar
18-Nov-2021 10:07:15 [INFO] Configured Artifact: org.openmrs.module:webservices.rest-omod:2.32.0:jar
18-Nov-2021 10:07:15 [INFO] Configured Artifact: org.openmrs.module:spa-omod:1.0.8:jar
18-Nov-2021 10:07:15 [INFO] Configured Artifact: org.openmrs.module:uicommons-omod:2.19.0:jar
18-Nov-2021 10:07:15 [INFO] Configured Artifact: org.openmrs.module:uiframework-omod:3.23.0-SNAPSHOT:jar
18-Nov-2021 10:07:15 [INFO] Configured Artifact: org.openmrs.module:metadatasharing-omod:1.8.0:jar
18-Nov-2021 10:07:15 [INFO] Copying addresshierarchy-omod-2.14.2.jar to /home/bamboo-agent/bamboo-agent/xml-data/build-dir/REFAPP-UI-FRAMEWORK/package/target/bundled-distro/web/WEB-INF/bundledModules/addresshierarchy-2.14.2.omod
18-Nov-2021 10:07:15 [INFO] Copying legacyui-omod-1.10.0-SNAPSHOT.jar to /home/bamboo-agent/bamboo-agent/xml-data/build-dir/REFAPP-UI-FRAMEWORK/package/target/bundled-distro/web/WEB-INF/bundledModules/legacyui-1.10.0-SNAPSHOT.omod
18-Nov-2021 10:07:16 [INFO] Copying openconceptlab-omod-1.2.9.jar to /home/bamboo-agent/bamboo-agent/xml-data/build-dir/REFAPP-UI-FRAMEWORK/package/target/bundled-distro/web/WEB-INF/bundledModules/openconceptlab-1.2.9.omod
18-Nov-2021 10:07:16 [INFO] Copying metadatadeploy-omod-1.13.0.jar to /home/bamboo-agent/bamboo-agent/xml-data/build-dir/REFAPP-UI-FRAMEWORK/package/target/bundled-distro/web/WEB-INF/bundledModules/metadatadeploy-1.13.0.omod
18-Nov-2021 10:07:16 [INFO] Copying reportingrest-omod-1.12.0.jar to /home/bamboo-agent/bamboo-agent/xml-data/build-dir/REFAPP-UI-FRAMEWORK/package/target/bundled-distro/web/WEB-INF/bundledModules/reportingrest-1.12.0.omod
18-Nov-2021 10:07:16 [INFO] Copying owa-omod-1.13.0.jar to /home/bamboo-agent/bamboo-agent/xml-data/build-dir/REFAPP-UI-FRAMEWORK/package/target/bundled-distro/web/WEB-INF/bundledModules/owa-1.13.0.omod
18-Nov-2021 10:07:16 [INFO] Copying fhir2-omod-1.3.0.jar to /home/bamboo-agent/bamboo-agent/xml-data/build-dir/REFAPP-UI-FRAMEWORK/package/target/bundled-distro/web/WEB-INF/bundledModules/fhir2-1.3.0.omod
18-Nov-2021 10:07:16 [INFO] Copying serialization.xstream-omod-0.2.15.omod to /home/bamboo-agent/bamboo-agent/xml-data/build-dir/REFAPP-UI-FRAMEWORK/package/target/bundled-distro/web/WEB-INF/bundledModules/serialization.xstream-0.2.15.omod
18-Nov-2021 10:07:16 [INFO] Copying registrationapp-omod-1.24.0.jar to /home/bamboo-agent/bamboo-agent/xml-data/build-dir/REFAPP-UI-FRAMEWORK/package/target/bundled-distro/web/WEB-INF/bundledModules/registrationapp-1.24.0.omod
18-Nov-2021 10:07:16 [INFO] Copying event-omod-2.10.0.jar to /home/bamboo-agent/bamboo-agent/xml-data/build-dir/REFAPP-UI-FRAMEWORK/package/target/bundled-distro/web/WEB-INF/bundledModules/event-2.10.0.omod
18-Nov-2021 10:07:16 [INFO] Copying uilibrary-omod-2.0.7.jar to /home/bamboo-agent/bamboo-agent/xml-data/build-dir/REFAPP-UI-FRAMEWORK/package/target/bundled-distro/web/WEB-INF/bundledModules/uilibrary-2.0.7.omod
18-Nov-2021 10:07:16 [INFO] Copying htmlwidgets-omod-1.10.0.jar to /home/bamboo-agent/bamboo-agent/xml-data/build-dir/REFAPP-UI-FRAMEWORK/package/target/bundled-distro/web/WEB-INF/bundledModules/htmlwidgets-1.10.0.omod
18-Nov-2021 10:07:16 [INFO] Copying dataexchange-omod-1.3.7.jar to /home/bamboo-agent/bamboo-agent/xml-data/build-dir/REFAPP-UI-FRAMEWORK/package/target/bundled-distro/web/WEB-INF/bundledModules/dataexchange-1.3.7.omod
18-Nov-2021 10:07:16 [INFO] Copying appui-omod-1.15.0.jar to /home/bamboo-agent/bamboo-agent/xml-data/build-dir/REFAPP-UI-FRAMEWORK/package/target/bundled-distro/web/WEB-INF/bundledModules/appui-1.15.0.omod
18-Nov-2021 10:07:16 [INFO] Copying allergyui-omod-1.8.4.jar to /home/bamboo-agent/bamboo-agent/xml-data/build-dir/REFAPP-UI-FRAMEWORK/package/target/bundled-distro/web/WEB-INF/bundledModules/allergyui-1.8.4.omod
18-Nov-2021 10:07:16 [INFO] Copying providermanagement-omod-2.13.0.jar to /home/bamboo-agent/bamboo-agent/xml-data/build-dir/REFAPP-UI-FRAMEWORK/package/target/bundled-distro/web/WEB-INF/bundledModules/providermanagement-2.13.0.omod
18-Nov-2021 10:07:16 [INFO] Copying appointmentschedulingui-omod-1.12.0.jar to /home/bamboo-agent/bamboo-agent/xml-data/build-dir/REFAPP-UI-FRAMEWORK/package/target/bundled-distro/web/WEB-INF/bundledModules/appointmentschedulingui-1.12.0.omod
18-Nov-2021 10:07:16 [INFO] Copying attachments-omod-2.5.0.jar to /home/bamboo-agent/bamboo-agent/xml-data/build-dir/REFAPP-UI-FRAMEWORK/package/target/bundled-distro/web/WEB-INF/bundledModules/attachments-2.5.0.omod
18-Nov-2021 10:07:16 [INFO] Copying formentryapp-omod-1.4.2.jar to /home/bamboo-agent/bamboo-agent/xml-data/build-dir/REFAPP-UI-FRAMEWORK/package/target/bundled-distro/web/WEB-INF/bundledModules/formentryapp-1.4.2.omod
18-Nov-2021 10:07:16 [INFO] Copying idgen-omod-4.7.0.jar to /home/bamboo-agent/bamboo-agent/xml-data/build-dir/REFAPP-UI-FRAMEWORK/package/target/bundled-distro/web/WEB-INF/bundledModules/idgen-4.7.0.omod
18-Nov-2021 10:07:16 [INFO] Copying metadatamapping-omod-1.4.0.jar to /home/bamboo-agent/bamboo-agent/xml-data/build-dir/REFAPP-UI-FRAMEWORK/package/target/bundled-distro/web/WEB-INF/bundledModules/metadatamapping-1.4.0.omod
18-Nov-2021 10:07:16 [INFO] Copying htmlformentryui-omod-2.2.0-SNAPSHOT.jar to /home/bamboo-agent/bamboo-agent/xml-data/build-dir/REFAPP-UI-FRAMEWORK/package/target/bundled-distro/web/WEB-INF/bundledModules/htmlformentryui-2.2.0-SNAPSHOT.omod
18-Nov-2021 10:07:16 [INFO] Copying referencedemodata-omod-1.4.7.jar to /home/bamboo-agent/bamboo-agent/xml-data/build-dir/REFAPP-UI-FRAMEWORK/package/target/bundled-distro/web/WEB-INF/bundledModules/referencedemodata-1.4.7.omod
18-Nov-2021 10:07:16 [INFO] Copying emrapi-omod-1.32.0.jar to /home/bamboo-agent/bamboo-agent/xml-data/build-dir/REFAPP-UI-FRAMEWORK/package/target/bundled-distro/web/WEB-INF/bundledModules/emrapi-1.32.0.omod
18-Nov-2021 10:07:16 [INFO] Copying referenceapplication-omod-2.13.0-SNAPSHOT.jar to /home/bamboo-agent/bamboo-agent/xml-data/build-dir/REFAPP-UI-FRAMEWORK/package/target/bundled-distro/web/WEB-INF/bundledModules/referenceapplication-2.13.0-SNAPSHOT.omod
18-Nov-2021 10:07:16 [INFO] Copying htmlformentry-omod-4.3.0-SNAPSHOT.jar to /home/bamboo-agent/bamboo-agent/xml-data/build-dir/REFAPP-UI-FRAMEWORK/package/target/bundled-distro/web/WEB-INF/bundledModules/htmlformentry-4.3.0-SNAPSHOT.omod
18-Nov-2021 10:07:16 [INFO] Copying appframework-omod-2.16.0.jar to /home/bamboo-agent/bamboo-agent/xml-data/build-dir/REFAPP-UI-FRAMEWORK/package/target/bundled-distro/web/WEB-INF/bundledModules/appframework-2.16.0.omod
18-Nov-2021 10:07:16 [INFO] Copying referencemetadata-omod-2.12.0.jar to /home/bamboo-agent/bamboo-agent/xml-data/build-dir/REFAPP-UI-FRAMEWORK/package/target/bundled-distro/web/WEB-INF/bundledModules/referencemetadata-2.12.0.omod
18-Nov-2021 10:07:16 [INFO] Copying reportingui-omod-1.8.0.jar to /home/bamboo-agent/bamboo-agent/xml-data/build-dir/REFAPP-UI-FRAMEWORK/package/target/bundled-distro/web/WEB-INF/bundledModules/reportingui-1.8.0.omod
18-Nov-2021 10:07:16 [INFO] Copying coreapps-omod-1.35.0.jar to /home/bamboo-agent/bamboo-agent/xml-data/build-dir/REFAPP-UI-FRAMEWORK/package/target/bundled-distro/web/WEB-INF/bundledModules/coreapps-1.35.0.omod
18-Nov-2021 10:07:16 [INFO] Copying reportingcompatibility-omod-2.0.8.jar to /home/bamboo-agent/bamboo-agent/xml-data/build-dir/REFAPP-UI-FRAMEWORK/package/target/bundled-distro/web/WEB-INF/bundledModules/reportingcompatibility-2.0.8.omod
18-Nov-2021 10:07:16 [INFO] Copying reporting-omod-1.23.0.jar to /home/bamboo-agent/bamboo-agent/xml-data/build-dir/REFAPP-UI-FRAMEWORK/package/target/bundled-distro/web/WEB-INF/bundledModules/reporting-1.23.0.omod
18-Nov-2021 10:07:16 [INFO] Copying adminui-omod-1.6.0.jar to /home/bamboo-agent/bamboo-agent/xml-data/build-dir/REFAPP-UI-FRAMEWORK/package/target/bundled-distro/web/WEB-INF/bundledModules/adminui-1.6.0.omod
18-Nov-2021 10:07:16 [INFO] Copying registrationcore-omod-1.11.0.jar to /home/bamboo-agent/bamboo-agent/xml-data/build-dir/REFAPP-UI-FRAMEWORK/package/target/bundled-distro/web/WEB-INF/bundledModules/registrationcore-1.11.0.omod
18-Nov-2021 10:07:16 [INFO] Copying appointmentscheduling-omod-1.17.0-SNAPSHOT.jar to /home/bamboo-agent/bamboo-agent/xml-data/build-dir/REFAPP-UI-FRAMEWORK/package/target/bundled-distro/web/WEB-INF/bundledModules/appointmentscheduling-1.17.0-SNAPSHOT.omod
18-Nov-2021 10:07:16 [INFO] Copying atlas-omod-2.2.5.omod to /home/bamboo-agent/bamboo-agent/xml-data/build-dir/REFAPP-UI-FRAMEWORK/package/target/bundled-distro/web/WEB-INF/bundledModules/atlas-2.2.5.omod
18-Nov-2021 10:07:16 [INFO] Copying calculation-omod-1.3.0.jar to /home/bamboo-agent/bamboo-agent/xml-data/build-dir/REFAPP-UI-FRAMEWORK/package/target/bundled-distro/web/WEB-INF/bundledModules/calculation-1.3.0.omod
18-Nov-2021 10:07:16 [INFO] Copying webservices.rest-omod-2.32.0.jar to /home/bamboo-agent/bamboo-agent/xml-data/build-dir/REFAPP-UI-FRAMEWORK/package/target/bundled-distro/web/WEB-INF/bundledModules/webservices.rest-2.32.0.omod
18-Nov-2021 10:07:16 [INFO] Copying spa-omod-1.0.8.jar to /home/bamboo-agent/bamboo-agent/xml-data/build-dir/REFAPP-UI-FRAMEWORK/package/target/bundled-distro/web/WEB-INF/bundledModules/spa-1.0.8.omod
18-Nov-2021 10:07:16 [INFO] Copying uicommons-omod-2.19.0.jar to /home/bamboo-agent/bamboo-agent/xml-data/build-dir/REFAPP-UI-FRAMEWORK/package/target/bundled-distro/web/WEB-INF/bundledModules/uicommons-2.19.0.omod
18-Nov-2021 10:07:16 [INFO] Copying uiframework-omod-3.23.0-SNAPSHOT.jar to /home/bamboo-agent/bamboo-agent/xml-data/build-dir/REFAPP-UI-FRAMEWORK/package/target/bundled-distro/web/WEB-INF/bundledModules/uiframework-3.23.0-SNAPSHOT.omod
18-Nov-2021 10:07:16 [INFO] Copying metadatasharing-omod-1.8.0.jar to /home/bamboo-agent/bamboo-agent/xml-data/build-dir/REFAPP-UI-FRAMEWORK/package/target/bundled-distro/web/WEB-INF/bundledModules/metadatasharing-1.8.0.omod
18-Nov-2021 10:07:16
18-Nov-2021 10:07:16 Downloading OWAs...
18-Nov-2021 10:07:16
18-Nov-2021 10:07:16
18-Nov-2021 10:07:16 Downloading OWA: org.openmrs.owa:openmrs-owa-sysadmin:1.2
18-Nov-2021 10:07:16 [INFO] Configured Artifact: org.openmrs.owa:sysadmin:1.2:zip
18-Nov-2021 10:07:16 [INFO] Copying sysadmin-1.2.zip to /home/bamboo-agent/bamboo-agent/xml-data/build-dir/REFAPP-UI-FRAMEWORK/package/target/bundled-distro/web/WEB-INF/bundledOwas/sysadmin-1.2.zip
18-Nov-2021 10:07:18
18-Nov-2021 10:07:18 Creating Docker Compose configuration...
18-Nov-2021 10:07:18
18-Nov-2021 10:07:18
18-Nov-2021 10:07:18 The 'referenceapplication' distribution created! To start up the server run 'docker-compose up' from /home/bamboo-agent/bamboo-agent/xml-data/build-dir/REFAPP-UI-FRAMEWORK/package/target/bundled-distro
18-Nov-2021 10:07:18
18-Nov-2021 10:07:18 [INFO]
18-Nov-2021 10:07:18 [INFO] --- maven-compiler-plugin:3.1:compile (default-compile) @ referenceapplication-package ---
18-Nov-2021 10:07:18 [INFO] No sources to compile
18-Nov-2021 10:07:18 [INFO]
18-Nov-2021 10:07:18 [INFO] --- maven-resources-plugin:2.6:testResources (default-testResources) @ referenceapplication-package ---
18-Nov-2021 10:07:18 [INFO] Using 'UTF-8' encoding to copy filtered resources.
18-Nov-2021 10:07:18 [INFO] skip non existing resourceDirectory /home/bamboo-agent/bamboo-agent/xml-data/build-dir/REFAPP-UI-FRAMEWORK/package/src/test/resources
18-Nov-2021 10:07:18 [INFO] skip non existing resourceDirectory /home/bamboo-agent/bamboo-agent/xml-data/build-dir/REFAPP-UI-FRAMEWORK/package/src/test/resources
18-Nov-2021 10:07:18 [INFO]
18-Nov-2021 10:07:18 [INFO] --- maven-compiler-plugin:3.1:testCompile (default-testCompile) @ referenceapplication-package ---
18-Nov-2021 10:07:18 [INFO] No sources to compile
18-Nov-2021 10:07:18 [INFO]
18-Nov-2021 10:07:18 [INFO] --- maven-surefire-plugin:2.12:test (default-test) @ referenceapplication-package ---
18-Nov-2021 10:07:18 [INFO] No tests to run.
18-Nov-2021 10:07:18 [INFO] Surefire report directory: /home/bamboo-agent/bamboo-agent/xml-data/build-dir/REFAPP-UI-FRAMEWORK/package/target/surefire-reports
18-Nov-2021 10:07:19
18-Nov-2021 10:07:19 -------------------------------------------------------
18-Nov-2021 10:07:19 T E S T S
18-Nov-2021 10:07:19 -------------------------------------------------------
18-Nov-2021 10:07:20
18-Nov-2021 10:07:20 Results :
18-Nov-2021 10:07:20
18-Nov-2021 10:07:20 Tests run: 0, Failures: 0, Errors: 0, Skipped: 0
18-Nov-2021 10:07:20
18-Nov-2021 10:07:20 [INFO]
18-Nov-2021 10:07:20 [INFO] --- maven-jar-plugin:2.4:jar (default-jar) @ referenceapplication-package ---
18-Nov-2021 10:07:20 [INFO] Building jar: /home/bamboo-agent/bamboo-agent/xml-data/build-dir/REFAPP-UI-FRAMEWORK/package/target/referenceapplication-package-2.13.0-SNAPSHOT.jar
18-Nov-2021 10:07:20 [INFO]
18-Nov-2021 10:07:20 [INFO] --- maven-assembly-plugin:2.3:single (make-assembly) @ referenceapplication-package ---
18-Nov-2021 10:07:21 [INFO] Reading assembly descriptor: /home/bamboo-agent/bamboo-agent/xml-data/build-dir/REFAPP-UI-FRAMEWORK/package/src/main/assembly/assembly.xml
18-Nov-2021 10:07:22 [INFO] Building zip: /home/bamboo-agent/bamboo-agent/xml-data/build-dir/REFAPP-UI-FRAMEWORK/package/target/referenceapplication-package-2.13.0-SNAPSHOT-addons.zip
18-Nov-2021 10:07:26 [INFO]
18-Nov-2021 10:07:26 [INFO] --- build-helper-maven-plugin:3.0.0:attach-artifact (attach-artifacts) @ referenceapplication-package ---
18-Nov-2021 10:07:27 [INFO]
18-Nov-2021 10:07:27 [INFO] --- maven-jar-plugin:2.4:test-jar (default) @ referenceapplication-package ---
18-Nov-2021 10:07:27 [WARNING] JAR will be empty - no content was marked for inclusion!
18-Nov-2021 10:07:27 [INFO] Building jar: /home/bamboo-agent/bamboo-agent/xml-data/build-dir/REFAPP-UI-FRAMEWORK/package/target/referenceapplication-package-2.13.0-SNAPSHOT-tests.jar
18-Nov-2021 10:07:27 [INFO]
18-Nov-2021 10:07:27 [INFO] --- maven-install-plugin:2.4:install (default-install) @ referenceapplication-package ---
18-Nov-2021 10:07:27 [INFO] Installing /home/bamboo-agent/bamboo-agent/xml-data/build-dir/REFAPP-UI-FRAMEWORK/package/target/referenceapplication-package-2.13.0-SNAPSHOT.jar to /home/bamboo-agent/.m2/repository/org/openmrs/distro/referenceapplication-package/2.13.0-SNAPSHOT/referenceapplication-package-2.13.0-SNAPSHOT.jar
18-Nov-2021 10:07:27 [INFO] Installing /home/bamboo-agent/bamboo-agent/xml-data/build-dir/REFAPP-UI-FRAMEWORK/package/pom.xml to /home/bamboo-agent/.m2/repository/org/openmrs/distro/referenceapplication-package/2.13.0-SNAPSHOT/referenceapplication-package-2.13.0-SNAPSHOT.pom
18-Nov-2021 10:07:27 [INFO] Installing /home/bamboo-agent/bamboo-agent/xml-data/build-dir/REFAPP-UI-FRAMEWORK/package/target/referenceapplication-package-2.13.0-SNAPSHOT-addons.zip to /home/bamboo-agent/.m2/repository/org/openmrs/distro/referenceapplication-package/2.13.0-SNAPSHOT/referenceapplication-package-2.13.0-SNAPSHOT-addons.zip
18-Nov-2021 10:07:28 [INFO] Installing /home/bamboo-agent/bamboo-agent/xml-data/build-dir/REFAPP-UI-FRAMEWORK/package/target/bundled-distro/web/openmrs.war to /home/bamboo-agent/.m2/repository/org/openmrs/distro/referenceapplication-package/2.13.0-SNAPSHOT/referenceapplication-package-2.13.0-SNAPSHOT.war
18-Nov-2021 10:07:28 [INFO] Installing /home/bamboo-agent/bamboo-agent/xml-data/build-dir/REFAPP-UI-FRAMEWORK/package/target/referenceapplication-package-2.13.0-SNAPSHOT-tests.jar to /home/bamboo-agent/.m2/repository/org/openmrs/distro/referenceapplication-package/2.13.0-SNAPSHOT/referenceapplication-package-2.13.0-SNAPSHOT-tests.jar
18-Nov-2021 10:07:29 [INFO]                                                                         
18-Nov-2021 10:07:29 [INFO] ------------------------------------------------------------------------
18-Nov-2021 10:07:29 [INFO] Building Reference Application Distribution UI Tests 2.13.0-SNAPSHOT
18-Nov-2021 10:07:29 [INFO] ------------------------------------------------------------------------
18-Nov-2021 10:07:29 [INFO]
18-Nov-2021 10:07:29 [INFO] --- maven-clean-plugin:2.5:clean (default-clean) @ referenceapplication-ui-tests ---
18-Nov-2021 10:07:29 [INFO]
18-Nov-2021 10:07:29 [INFO] --- maven-resources-plugin:2.6:resources (default-resources) @ referenceapplication-ui-tests ---
18-Nov-2021 10:07:29 [INFO] Using 'UTF-8' encoding to copy filtered resources.
18-Nov-2021 10:07:29 [INFO] skip non existing resourceDirectory /home/bamboo-agent/bamboo-agent/xml-data/build-dir/REFAPP-UI-FRAMEWORK/ui-tests/src/main/resources
18-Nov-2021 10:07:29 [INFO]
18-Nov-2021 10:07:29 [INFO] --- maven-compiler-plugin:3.1:compile (default-compile) @ referenceapplication-ui-tests ---
18-Nov-2021 10:07:29 [INFO] No sources to compile
18-Nov-2021 10:07:29 [INFO]
18-Nov-2021 10:07:29 [INFO] --- maven-resources-plugin:2.6:testResources (default-testResources) @ referenceapplication-ui-tests ---
18-Nov-2021 10:07:29 [INFO] Using 'UTF-8' encoding to copy filtered resources.
18-Nov-2021 10:07:29 [INFO] Copying 2 resources
18-Nov-2021 10:07:29 [INFO] Copying 2 resources
18-Nov-2021 10:07:29 [INFO]
18-Nov-2021 10:07:29 [INFO] --- maven-compiler-plugin:3.1:testCompile (default-testCompile) @ referenceapplication-ui-tests ---
18-Nov-2021 10:07:30 [INFO] Changes detected - recompiling the module!
18-Nov-2021 10:07:30 [INFO] Compiling 120 source files to /home/bamboo-agent/bamboo-agent/xml-data/build-dir/REFAPP-UI-FRAMEWORK/ui-tests/target/test-classes
18-Nov-2021 10:07:33 [WARNING] /home/bamboo-agent/bamboo-agent/xml-data/build-dir/REFAPP-UI-FRAMEWORK/ui-tests/src/test/java/org/openmrs/reference/AddDeleteLocationTest.java: Some input files use or override a deprecated API.
18-Nov-2021 10:07:33 [WARNING] /home/bamboo-agent/bamboo-agent/xml-data/build-dir/REFAPP-UI-FRAMEWORK/ui-tests/src/test/java/org/openmrs/reference/AddDeleteLocationTest.java: Recompile with -Xlint:deprecation for details.
18-Nov-2021 10:07:33 [WARNING] /home/bamboo-agent/bamboo-agent/xml-data/build-dir/REFAPP-UI-FRAMEWORK/ui-tests/src/test/java/org/openmrs/reference/AddRolesToUserTest.java: /home/bamboo-agent/bamboo-agent/xml-data/build-dir/REFAPP-UI-FRAMEWORK/ui-tests/src/test/java/org/openmrs/reference/AddRolesToUserTest.java uses unchecked or unsafe operations.
18-Nov-2021 10:07:33 [WARNING] /home/bamboo-agent/bamboo-agent/xml-data/build-dir/REFAPP-UI-FRAMEWORK/ui-tests/src/test/java/org/openmrs/reference/AddRolesToUserTest.java: Recompile with -Xlint:unchecked for details.
18-Nov-2021 10:07:33 [INFO]
18-Nov-2021 10:07:33 [INFO] --- maven-antrun-plugin:1.8:run (make-mac-chromedriver-executable) @ referenceapplication-ui-tests ---
18-Nov-2021 10:07:35 [INFO] Executing tasks
18-Nov-2021 10:07:35
18-Nov-2021 10:07:35 main:
18-Nov-2021 10:07:35 [INFO] An Ant BuildException has occured: /home/bamboo-agent/bamboo-agent/xml-data/build-dir/REFAPP-UI-FRAMEWORK/ui-tests/target/test-classes/chromedriver/mac does not exist.
18-Nov-2021 10:07:35 around Ant part ...<chmod file="target/test-classes/chromedriver/mac/chromedriver" perm="755"/>... @ 4:79 in /home/bamboo-agent/bamboo-agent/xml-data/build-dir/REFAPP-UI-FRAMEWORK/ui-tests/target/antrun/build-main.xml
18-Nov-2021 10:07:35 /home/bamboo-agent/bamboo-agent/xml-data/build-dir/REFAPP-UI-FRAMEWORK/ui-tests/target/antrun/build-main.xml:4: /home/bamboo-agent/bamboo-agent/xml-data/build-dir/REFAPP-UI-FRAMEWORK/ui-tests/target/test-classes/chromedriver/mac does not exist.
18-Nov-2021 10:07:35         at org.apache.tools.ant.types.AbstractFileSet.getDirectoryScanner(AbstractFileSet.java:484)
18-Nov-2021 10:07:35         at org.apache.tools.ant.taskdefs.ExecuteOn.runExec(ExecuteOn.java:369)
18-Nov-2021 10:07:35         at org.apache.tools.ant.taskdefs.ExecTask.execute(ExecTask.java:495)
18-Nov-2021 10:07:35         at org.apache.tools.ant.taskdefs.Chmod.execute(Chmod.java:181)
18-Nov-2021 10:07:35         at org.apache.tools.ant.UnknownElement.execute(UnknownElement.java:292)
18-Nov-2021 10:07:35         at sun.reflect.NativeMethodAccessorImpl.invoke0(Native Method)
18-Nov-2021 10:07:35         at sun.reflect.NativeMethodAccessorImpl.invoke(NativeMethodAccessorImpl.java:62)
18-Nov-2021 10:07:35         at sun.reflect.DelegatingMethodAccessorImpl.invoke(DelegatingMethodAccessorImpl.java:43)
18-Nov-2021 10:07:35         at java.lang.reflect.Method.invoke(Method.java:498)
18-Nov-2021 10:07:35         at org.apache.tools.ant.dispatch.DispatchUtils.execute(DispatchUtils.java:106)
18-Nov-2021 10:07:35         at org.apache.tools.ant.Task.perform(Task.java:348)
18-Nov-2021 10:07:35         at org.apache.tools.ant.Target.execute(Target.java:435)
18-Nov-2021 10:07:35         at org.apache.tools.ant.Target.performTasks(Target.java:456)
18-Nov-2021 10:07:35         at org.apache.tools.ant.Project.executeSortedTargets(Project.java:1393)
18-Nov-2021 10:07:35         at org.apache.tools.ant.Project.executeTarget(Project.java:1364)
18-Nov-2021 10:07:35         at org.apache.maven.plugin.antrun.AntRunMojo.execute(AntRunMojo.java:313)
18-Nov-2021 10:07:35         at org.apache.maven.plugin.DefaultBuildPluginManager.executeMojo(DefaultBuildPluginManager.java:134)
18-Nov-2021 10:07:35         at org.apache.maven.lifecycle.internal.MojoExecutor.execute(MojoExecutor.java:207)
18-Nov-2021 10:07:35         at org.apache.maven.lifecycle.internal.MojoExecutor.execute(MojoExecutor.java:153)
18-Nov-2021 10:07:35         at org.apache.maven.lifecycle.internal.MojoExecutor.execute(MojoExecutor.java:145)
18-Nov-2021 10:07:35         at org.apache.maven.lifecycle.internal.LifecycleModuleBuilder.buildProject(LifecycleModuleBuilder.java:116)
18-Nov-2021 10:07:35         at org.apache.maven.lifecycle.internal.LifecycleModuleBuilder.buildProject(LifecycleModuleBuilder.java:80)
18-Nov-2021 10:07:35         at org.apache.maven.lifecycle.internal.builder.singlethreaded.SingleThreadedBuilder.build(SingleThreadedBuilder.java:51)
18-Nov-2021 10:07:35         at org.apache.maven.lifecycle.internal.LifecycleStarter.execute(LifecycleStarter.java:128)
18-Nov-2021 10:07:35         at org.apache.maven.DefaultMaven.doExecute(DefaultMaven.java:307)
18-Nov-2021 10:07:35         at org.apache.maven.DefaultMaven.doExecute(DefaultMaven.java:193)
18-Nov-2021 10:07:35         at org.apache.maven.DefaultMaven.execute(DefaultMaven.java:106)
18-Nov-2021 10:07:35         at org.apache.maven.cli.MavenCli.execute(MavenCli.java:863)
18-Nov-2021 10:07:35         at org.apache.maven.cli.MavenCli.doMain(MavenCli.java:288)
18-Nov-2021 10:07:35         at org.apache.maven.cli.MavenCli.main(MavenCli.java:199)
18-Nov-2021 10:07:35         at sun.reflect.NativeMethodAccessorImpl.invoke0(Native Method)
18-Nov-2021 10:07:35         at sun.reflect.NativeMethodAccessorImpl.invoke(NativeMethodAccessorImpl.java:62)
18-Nov-2021 10:07:35         at sun.reflect.DelegatingMethodAccessorImpl.invoke(DelegatingMethodAccessorImpl.java:43)
18-Nov-2021 10:07:35         at java.lang.reflect.Method.invoke(Method.java:498)
18-Nov-2021 10:07:35         at org.codehaus.plexus.classworlds.launcher.Launcher.launchEnhanced(Launcher.java:289)
18-Nov-2021 10:07:35         at org.codehaus.plexus.classworlds.launcher.Launcher.launch(Launcher.java:229)
18-Nov-2021 10:07:35         at org.codehaus.plexus.classworlds.launcher.Launcher.mainWithExitCode(Launcher.java:415)
18-Nov-2021 10:07:35         at org.codehaus.plexus.classworlds.launcher.Launcher.main(Launcher.java:356)
18-Nov-2021 10:07:35 [INFO]
18-Nov-2021 10:07:35 [INFO] --- maven-antrun-plugin:1.8:run (make-linux-chromedriver-executable) @ referenceapplication-ui-tests ---
18-Nov-2021 10:07:35 [INFO] Executing tasks
18-Nov-2021 10:07:35
18-Nov-2021 10:07:35 main:
18-Nov-2021 10:07:35 [INFO] Executed tasks
18-Nov-2021 10:07:35 [INFO]
18-Nov-2021 10:07:35 [INFO] --- maven-antrun-plugin:1.8:run (make-mac-firefoxdriver-executable) @ referenceapplication-ui-tests ---
18-Nov-2021 10:07:35 [INFO] Executing tasks
18-Nov-2021 10:07:35
18-Nov-2021 10:07:35 main:
18-Nov-2021 10:07:35 [INFO] An Ant BuildException has occured: /home/bamboo-agent/bamboo-agent/xml-data/build-dir/REFAPP-UI-FRAMEWORK/ui-tests/target/test-classes/firefoxdriver/mac does not exist.
18-Nov-2021 10:07:35 around Ant part ...<chmod file="target/test-classes/firefoxdriver/mac/geckodriver" perm="755"/>... @ 4:79 in /home/bamboo-agent/bamboo-agent/xml-data/build-dir/REFAPP-UI-FRAMEWORK/ui-tests/target/antrun/build-main.xml
18-Nov-2021 10:07:35 /home/bamboo-agent/bamboo-agent/xml-data/build-dir/REFAPP-UI-FRAMEWORK/ui-tests/target/antrun/build-main.xml:4: /home/bamboo-agent/bamboo-agent/xml-data/build-dir/REFAPP-UI-FRAMEWORK/ui-tests/target/test-classes/firefoxdriver/mac does not exist.
18-Nov-2021 10:07:35         at org.apache.tools.ant.types.AbstractFileSet.getDirectoryScanner(AbstractFileSet.java:484)
18-Nov-2021 10:07:35         at org.apache.tools.ant.taskdefs.ExecuteOn.runExec(ExecuteOn.java:369)
18-Nov-2021 10:07:35         at org.apache.tools.ant.taskdefs.ExecTask.execute(ExecTask.java:495)
18-Nov-2021 10:07:35         at org.apache.tools.ant.taskdefs.Chmod.execute(Chmod.java:181)
18-Nov-2021 10:07:35         at org.apache.tools.ant.UnknownElement.execute(UnknownElement.java:292)
18-Nov-2021 10:07:35         at sun.reflect.NativeMethodAccessorImpl.invoke0(Native Method)
18-Nov-2021 10:07:35         at sun.reflect.NativeMethodAccessorImpl.invoke(NativeMethodAccessorImpl.java:62)
18-Nov-2021 10:07:35         at sun.reflect.DelegatingMethodAccessorImpl.invoke(DelegatingMethodAccessorImpl.java:43)
18-Nov-2021 10:07:35         at java.lang.reflect.Method.invoke(Method.java:498)
18-Nov-2021 10:07:35         at org.apache.tools.ant.dispatch.DispatchUtils.execute(DispatchUtils.java:106)
18-Nov-2021 10:07:35         at org.apache.tools.ant.Task.perform(Task.java:348)
18-Nov-2021 10:07:35         at org.apache.tools.ant.Target.execute(Target.java:435)
18-Nov-2021 10:07:35         at org.apache.tools.ant.Target.performTasks(Target.java:456)
18-Nov-2021 10:07:35         at org.apache.tools.ant.Project.executeSortedTargets(Project.java:1393)
18-Nov-2021 10:07:35         at org.apache.tools.ant.Project.executeTarget(Project.java:1364)
18-Nov-2021 10:07:35         at org.apache.maven.plugin.antrun.AntRunMojo.execute(AntRunMojo.java:313)
18-Nov-2021 10:07:35         at org.apache.maven.plugin.DefaultBuildPluginManager.executeMojo(DefaultBuildPluginManager.java:134)
18-Nov-2021 10:07:35         at org.apache.maven.lifecycle.internal.MojoExecutor.execute(MojoExecutor.java:207)
18-Nov-2021 10:07:35         at org.apache.maven.lifecycle.internal.MojoExecutor.execute(MojoExecutor.java:153)
18-Nov-2021 10:07:35         at org.apache.maven.lifecycle.internal.MojoExecutor.execute(MojoExecutor.java:145)
18-Nov-2021 10:07:35         at org.apache.maven.lifecycle.internal.LifecycleModuleBuilder.buildProject(LifecycleModuleBuilder.java:116)
18-Nov-2021 10:07:35         at org.apache.maven.lifecycle.internal.LifecycleModuleBuilder.buildProject(LifecycleModuleBuilder.java:80)
18-Nov-2021 10:07:35         at org.apache.maven.lifecycle.internal.builder.singlethreaded.SingleThreadedBuilder.build(SingleThreadedBuilder.java:51)
18-Nov-2021 10:07:35         at org.apache.maven.lifecycle.internal.LifecycleStarter.execute(LifecycleStarter.java:128)
18-Nov-2021 10:07:35         at org.apache.maven.DefaultMaven.doExecute(DefaultMaven.java:307)
18-Nov-2021 10:07:35         at org.apache.maven.DefaultMaven.doExecute(DefaultMaven.java:193)
18-Nov-2021 10:07:35         at org.apache.maven.DefaultMaven.execute(DefaultMaven.java:106)
18-Nov-2021 10:07:35         at org.apache.maven.cli.MavenCli.execute(MavenCli.java:863)
18-Nov-2021 10:07:35         at org.apache.maven.cli.MavenCli.doMain(MavenCli.java:288)
18-Nov-2021 10:07:35         at org.apache.maven.cli.MavenCli.main(MavenCli.java:199)
18-Nov-2021 10:07:35         at sun.reflect.NativeMethodAccessorImpl.invoke0(Native Method)
18-Nov-2021 10:07:35         at sun.reflect.NativeMethodAccessorImpl.invoke(NativeMethodAccessorImpl.java:62)
18-Nov-2021 10:07:35         at sun.reflect.DelegatingMethodAccessorImpl.invoke(DelegatingMethodAccessorImpl.java:43)
18-Nov-2021 10:07:35         at java.lang.reflect.Method.invoke(Method.java:498)
18-Nov-2021 10:07:35         at org.codehaus.plexus.classworlds.launcher.Launcher.launchEnhanced(Launcher.java:289)
18-Nov-2021 10:07:35         at org.codehaus.plexus.classworlds.launcher.Launcher.launch(Launcher.java:229)
18-Nov-2021 10:07:35         at org.codehaus.plexus.classworlds.launcher.Launcher.mainWithExitCode(Launcher.java:415)
18-Nov-2021 10:07:35         at org.codehaus.plexus.classworlds.launcher.Launcher.main(Launcher.java:356)
18-Nov-2021 10:07:35 [INFO]
18-Nov-2021 10:07:35 [INFO] --- maven-antrun-plugin:1.8:run (make-linux-firefoxdriver-executable) @ referenceapplication-ui-tests ---
18-Nov-2021 10:07:35 [INFO] Executing tasks
18-Nov-2021 10:07:35
18-Nov-2021 10:07:35 main:
18-Nov-2021 10:07:35 [INFO] Executed tasks
18-Nov-2021 10:07:35 [INFO]
18-Nov-2021 10:07:35 [INFO] --- maven-surefire-plugin:2.12:test (default-test) @ referenceapplication-ui-tests ---
18-Nov-2021 10:07:35 [INFO] Surefire report directory: /home/bamboo-agent/bamboo-agent/xml-data/build-dir/REFAPP-UI-FRAMEWORK/ui-tests/target/surefire-reports
18-Nov-2021 10:07:35
18-Nov-2021 10:07:35 -------------------------------------------------------
18-Nov-2021 10:07:35 T E S T S
18-Nov-2021 10:07:35 -------------------------------------------------------
18-Nov-2021 10:07:36 Running org.openmrs.reference.UnidentifiedPatientKeyboardTest
18-Nov-2021 10:07:36 Running locally...
18-Nov-2021 10:07:41 Starting ChromeDriver 90.0.4430.24 (4c6d850f087da467d926e8eddb76550aed655991-refs/branch-heads/4430@{#429}) on port 9460
18-Nov-2021 10:07:41 Only local connections are allowed.
18-Nov-2021 10:07:41 Please see https://chromedriver.chromium.org/security-considerations for suggestions on keeping ChromeDriver safe.
18-Nov-2021 10:07:41 ChromeDriver was started successfully.
18-Nov-2021 10:07:56 Nov 18, 2021 10:07:56 AM org.openqa.selenium.remote.ProtocolHandshake createSession
18-Nov-2021 10:07:56 INFO: Detected dialect: W3C
18-Nov-2021 10:08:07 Tests run: 1, Failures: 0, Errors: 0, Skipped: 0, Time elapsed: 31.841 sec
18-Nov-2021 10:08:08 Running org.openmrs.reference.DeleteAllergyTest
18-Nov-2021 10:08:08 Running locally...
18-Nov-2021 10:08:08 Starting ChromeDriver 90.0.4430.24 (4c6d850f087da467d926e8eddb76550aed655991-refs/branch-heads/4430@{#429}) on port 16613
18-Nov-2021 10:08:08 Only local connections are allowed.
18-Nov-2021 10:08:08 Please see https://chromedriver.chromium.org/security-considerations for suggestions on keeping ChromeDriver safe.
18-Nov-2021 10:08:08 ChromeDriver was started successfully.
18-Nov-2021 10:08:08 Nov 18, 2021 10:08:08 AM org.openqa.selenium.remote.ProtocolHandshake createSession
18-Nov-2021 10:08:08 INFO: Detected dialect: W3C
18-Nov-2021 10:08:18 Tests run: 1, Failures: 0, Errors: 0, Skipped: 0, Time elapsed: 10.946 sec
18-Nov-2021 10:08:18 Running org.openmrs.reference.SearchActiveVisitsTest
18-Nov-2021 10:08:18 Running locally...
18-Nov-2021 10:08:18 Starting ChromeDriver 90.0.4430.24 (4c6d850f087da467d926e8eddb76550aed655991-refs/branch-heads/4430@{#429}) on port 14061
18-Nov-2021 10:08:18 Only local connections are allowed.
18-Nov-2021 10:08:18 Please see https://chromedriver.chromium.org/security-considerations for suggestions on keeping ChromeDriver safe.
18-Nov-2021 10:08:18 ChromeDriver was started successfully.
18-Nov-2021 10:08:19 Nov 18, 2021 10:08:19 AM org.openqa.selenium.remote.ProtocolHandshake createSession
18-Nov-2021 10:08:19 INFO: Detected dialect: W3C
18-Nov-2021 10:08:24 Tests run: 1, Failures: 0, Errors: 0, Skipped: 0, Time elapsed: 5.899 sec
18-Nov-2021 10:08:24 Running org.openmrs.reference.AddVisitTypeTest
18-Nov-2021 10:08:24 Running locally...
18-Nov-2021 10:08:24 Starting ChromeDriver 90.0.4430.24 (4c6d850f087da467d926e8eddb76550aed655991-refs/branch-heads/4430@{#429}) on port 18352
18-Nov-2021 10:08:24 Only local connections are allowed.
18-Nov-2021 10:08:24 Please see https://chromedriver.chromium.org/security-considerations for suggestions on keeping ChromeDriver safe.
18-Nov-2021 10:08:24 ChromeDriver was started successfully.
18-Nov-2021 10:08:25 Nov 18, 2021 10:08:25 AM org.openqa.selenium.remote.ProtocolHandshake createSession
18-Nov-2021 10:08:25 INFO: Detected dialect: W3C
18-Nov-2021 10:08:32 Tests run: 1, Failures: 0, Errors: 0, Skipped: 0, Time elapsed: 7.809 sec
18-Nov-2021 10:08:32 Running org.openmrs.reference.FindPatientRecordTest
18-Nov-2021 10:08:32 Running locally...
18-Nov-2021 10:08:32 Starting ChromeDriver 90.0.4430.24 (4c6d850f087da467d926e8eddb76550aed655991-refs/branch-heads/4430@{#429}) on port 7707
18-Nov-2021 10:08:32 Only local connections are allowed.
18-Nov-2021 10:08:32 Please see https://chromedriver.chromium.org/security-considerations for suggestions on keeping ChromeDriver safe.
18-Nov-2021 10:08:32 ChromeDriver was started successfully.
18-Nov-2021 10:08:32 Nov 18, 2021 10:08:32 AM org.openqa.selenium.remote.ProtocolHandshake createSession
18-Nov-2021 10:08:32 INFO: Detected dialect: W3C
18-Nov-2021 10:08:37 Tests run: 1, Failures: 0, Errors: 0, Skipped: 0, Time elapsed: 4.813 sec
18-Nov-2021 10:08:37 Running org.openmrs.reference.EditPersonTest
18-Nov-2021 10:08:37 Running locally...
18-Nov-2021 10:08:37 Starting ChromeDriver 90.0.4430.24 (4c6d850f087da467d926e8eddb76550aed655991-refs/branch-heads/4430@{#429}) on port 2640
18-Nov-2021 10:08:37 Only local connections are allowed.
18-Nov-2021 10:08:37 Please see https://chromedriver.chromium.org/security-considerations for suggestions on keeping ChromeDriver safe.
18-Nov-2021 10:08:37 ChromeDriver was started successfully.
18-Nov-2021 10:08:37 Nov 18, 2021 10:08:37 AM org.openqa.selenium.remote.ProtocolHandshake createSession
18-Nov-2021 10:08:37 INFO: Detected dialect: W3C
18-Nov-2021 10:08:50 Tests run: 1, Failures: 0, Errors: 0, Skipped: 0, Time elapsed: 12.693 sec
18-Nov-2021 10:08:50 Running org.openmrs.reference.RetireLocationTest
18-Nov-2021 10:08:50 Running locally...
18-Nov-2021 10:08:50 Starting ChromeDriver 90.0.4430.24 (4c6d850f087da467d926e8eddb76550aed655991-refs/branch-heads/4430@{#429}) on port 11799
18-Nov-2021 10:08:50 Only local connections are allowed.
18-Nov-2021 10:08:50 Please see https://chromedriver.chromium.org/security-considerations for suggestions on keeping ChromeDriver safe.
18-Nov-2021 10:08:50 ChromeDriver was started successfully.
18-Nov-2021 10:08:50 Nov 18, 2021 10:08:50 AM org.openqa.selenium.remote.ProtocolHandshake createSession
18-Nov-2021 10:08:50 INFO: Detected dialect: W3C
18-Nov-2021 10:08:53 Tests run: 1, Failures: 0, Errors: 0, Skipped: 0, Time elapsed: 3.398 sec
18-Nov-2021 10:08:53 Running org.openmrs.reference.XSSOnPhoneNumberFieldTest
18-Nov-2021 10:08:53 Running locally...
18-Nov-2021 10:08:53 Starting ChromeDriver 90.0.4430.24 (4c6d850f087da467d926e8eddb76550aed655991-refs/branch-heads/4430@{#429}) on port 13202
18-Nov-2021 10:08:53 Only local connections are allowed.
18-Nov-2021 10:08:53 Please see https://chromedriver.chromium.org/security-considerations for suggestions on keeping ChromeDriver safe.
18-Nov-2021 10:08:53 ChromeDriver was started successfully.
18-Nov-2021 10:08:53 Nov 18, 2021 10:08:53 AM org.openqa.selenium.remote.ProtocolHandshake createSession
18-Nov-2021 10:08:53 INFO: Detected dialect: W3C
18-Nov-2021 10:09:05 Tests run: 1, Failures: 0, Errors: 0, Skipped: 0, Time elapsed: 11.633 sec
18-Nov-2021 10:09:05 Running org.openmrs.reference.TransferToWardServiceTest
18-Nov-2021 10:09:05 Running locally...
18-Nov-2021 10:09:05 Starting ChromeDriver 90.0.4430.24 (4c6d850f087da467d926e8eddb76550aed655991-refs/branch-heads/4430@{#429}) on port 23478
18-Nov-2021 10:09:05 Only local connections are allowed.
18-Nov-2021 10:09:05 Please see https://chromedriver.chromium.org/security-considerations for suggestions on keeping ChromeDriver safe.
18-Nov-2021 10:09:05 ChromeDriver was started successfully.
18-Nov-2021 10:09:05 Nov 18, 2021 10:09:05 AM org.openqa.selenium.remote.ProtocolHandshake createSession
18-Nov-2021 10:09:05 INFO: Detected dialect: W3C
18-Nov-2021 10:09:19 Tests run: 1, Failures: 0, Errors: 0, Skipped: 0, Time elapsed: 14.655 sec
18-Nov-2021 10:09:19 Running org.openmrs.reference.EditVisitTypeTest
18-Nov-2021 10:09:19 Running locally...
18-Nov-2021 10:09:19 Starting ChromeDriver 90.0.4430.24 (4c6d850f087da467d926e8eddb76550aed655991-refs/branch-heads/4430@{#429}) on port 29052
18-Nov-2021 10:09:19 Only local connections are allowed.
18-Nov-2021 10:09:19 Please see https://chromedriver.chromium.org/security-considerations for suggestions on keeping ChromeDriver safe.
18-Nov-2021 10:09:19 ChromeDriver was started successfully.
18-Nov-2021 10:09:20 Nov 18, 2021 10:09:20 AM org.openqa.selenium.remote.ProtocolHandshake createSession
18-Nov-2021 10:09:20 INFO: Detected dialect: W3C
18-Nov-2021 10:09:24 Tests run: 1, Failures: 0, Errors: 0, Skipped: 0, Time elapsed: 4.122 sec
18-Nov-2021 10:09:24 Running org.openmrs.reference.ComeBackToApplicationAfterLogoutTest
18-Nov-2021 10:09:24 Running locally...
18-Nov-2021 10:09:24 Starting ChromeDriver 90.0.4430.24 (4c6d850f087da467d926e8eddb76550aed655991-refs/branch-heads/4430@{#429}) on port 7378
18-Nov-2021 10:09:24 Only local connections are allowed.
18-Nov-2021 10:09:24 Please see https://chromedriver.chromium.org/security-considerations for suggestions on keeping ChromeDriver safe.
18-Nov-2021 10:09:24 ChromeDriver was started successfully.
18-Nov-2021 10:09:24 Nov 18, 2021 10:09:24 AM org.openqa.selenium.remote.ProtocolHandshake createSession
18-Nov-2021 10:09:24 INFO: Detected dialect: W3C
18-Nov-2021 10:09:26 Tests run: 1, Failures: 0, Errors: 0, Skipped: 0, Time elapsed: 2.061 sec
18-Nov-2021 10:09:26 Running org.openmrs.reference.EditDemographicTest
18-Nov-2021 10:09:26 Running locally...
18-Nov-2021 10:09:26 Starting ChromeDriver 90.0.4430.24 (4c6d850f087da467d926e8eddb76550aed655991-refs/branch-heads/4430@{#429}) on port 8145
18-Nov-2021 10:09:26 Only local connections are allowed.
18-Nov-2021 10:09:26 Please see https://chromedriver.chromium.org/security-considerations for suggestions on keeping ChromeDriver safe.
18-Nov-2021 10:09:26 ChromeDriver was started successfully.
18-Nov-2021 10:09:26 Nov 18, 2021 10:09:26 AM org.openqa.selenium.remote.ProtocolHandshake createSession
18-Nov-2021 10:09:26 INFO: Detected dialect: W3C
18-Nov-2021 10:09:35 Tests run: 1, Failures: 0, Errors: 0, Skipped: 0, Time elapsed: 9.409 sec
18-Nov-2021 10:09:35 Running org.openmrs.reference.DeleteVisitTypeTest
18-Nov-2021 10:09:35 Running locally...
18-Nov-2021 10:09:35 Starting ChromeDriver 90.0.4430.24 (4c6d850f087da467d926e8eddb76550aed655991-refs/branch-heads/4430@{#429}) on port 20725
18-Nov-2021 10:09:35 Only local connections are allowed.
18-Nov-2021 10:09:35 Please see https://chromedriver.chromium.org/security-considerations for suggestions on keeping ChromeDriver safe.
18-Nov-2021 10:09:35 ChromeDriver was started successfully.
18-Nov-2021 10:09:35 Nov 18, 2021 10:09:35 AM org.openqa.selenium.remote.ProtocolHandshake createSession
18-Nov-2021 10:09:35 INFO: Detected dialect: W3C
18-Nov-2021 10:09:39 Tests run: 1, Failures: 0, Errors: 0, Skipped: 0, Time elapsed: 3.627 sec
18-Nov-2021 10:09:39 Running org.openmrs.reference.FormTest
18-Nov-2021 10:09:39 Running locally...
18-Nov-2021 10:09:39 Starting ChromeDriver 90.0.4430.24 (4c6d850f087da467d926e8eddb76550aed655991-refs/branch-heads/4430@{#429}) on port 22938
18-Nov-2021 10:09:39 Only local connections are allowed.
18-Nov-2021 10:09:39 Please see https://chromedriver.chromium.org/security-considerations for suggestions on keeping ChromeDriver safe.
18-Nov-2021 10:09:39 ChromeDriver was started successfully.
18-Nov-2021 10:09:39 Nov 18, 2021 10:09:39 AM org.openqa.selenium.remote.ProtocolHandshake createSession
18-Nov-2021 10:09:39 INFO: Detected dialect: W3C
18-Nov-2021 10:09:51 Running locally...
18-Nov-2021 10:09:51 Starting ChromeDriver 90.0.4430.24 (4c6d850f087da467d926e8eddb76550aed655991-refs/branch-heads/4430@{#429}) on port 25223
18-Nov-2021 10:09:51 Only local connections are allowed.
18-Nov-2021 10:09:51 Please see https://chromedriver.chromium.org/security-considerations for suggestions on keeping ChromeDriver safe.
18-Nov-2021 10:09:51 ChromeDriver was started successfully.
18-Nov-2021 10:09:52 Nov 18, 2021 10:09:52 AM org.openqa.selenium.remote.ProtocolHandshake createSession
18-Nov-2021 10:09:52 INFO: Detected dialect: W3C
18-Nov-2021 10:09:59 Running locally...
18-Nov-2021 10:09:59 Starting ChromeDriver 90.0.4430.24 (4c6d850f087da467d926e8eddb76550aed655991-refs/branch-heads/4430@{#429}) on port 6685
18-Nov-2021 10:09:59 Only local connections are allowed.
18-Nov-2021 10:09:59 Please see https://chromedriver.chromium.org/security-considerations for suggestions on keeping ChromeDriver safe.
18-Nov-2021 10:09:59 ChromeDriver was started successfully.
18-Nov-2021 10:09:59 Nov 18, 2021 10:09:59 AM org.openqa.selenium.remote.ProtocolHandshake createSession
18-Nov-2021 10:09:59 INFO: Detected dialect: W3C
18-Nov-2021 10:10:02 Running locally...
18-Nov-2021 10:10:02 Starting ChromeDriver 90.0.4430.24 (4c6d850f087da467d926e8eddb76550aed655991-refs/branch-heads/4430@{#429}) on port 19912
18-Nov-2021 10:10:02 Only local connections are allowed.
18-Nov-2021 10:10:02 Please see https://chromedriver.chromium.org/security-considerations for suggestions on keeping ChromeDriver safe.
18-Nov-2021 10:10:02 ChromeDriver was started successfully.
18-Nov-2021 10:10:03 Nov 18, 2021 10:10:03 AM org.openqa.selenium.remote.ProtocolHandshake createSession
18-Nov-2021 10:10:03 INFO: Detected dialect: W3C
18-Nov-2021 10:10:08 Tests run: 4, Failures: 0, Errors: 0, Skipped: 0, Time elapsed: 29.005 sec
18-Nov-2021 10:10:08 Running org.openmrs.reference.RegisterUnidentifiedPatientTest
18-Nov-2021 10:10:08 Running locally...
18-Nov-2021 10:10:08 Starting ChromeDriver 90.0.4430.24 (4c6d850f087da467d926e8eddb76550aed655991-refs/branch-heads/4430@{#429}) on port 16765
18-Nov-2021 10:10:08 Only local connections are allowed.
18-Nov-2021 10:10:08 Please see https://chromedriver.chromium.org/security-considerations for suggestions on keeping ChromeDriver safe.
18-Nov-2021 10:10:08 ChromeDriver was started successfully.
18-Nov-2021 10:10:08 Nov 18, 2021 10:10:08 AM org.openqa.selenium.remote.ProtocolHandshake createSession
18-Nov-2021 10:10:08 INFO: Detected dialect: W3C
18-Nov-2021 10:10:13 Tests run: 1, Failures: 0, Errors: 0, Skipped: 0, Time elapsed: 5.842 sec
18-Nov-2021 10:10:13 Running org.openmrs.reference.AddPatientAppointmentTest
18-Nov-2021 10:10:13 Running locally...
18-Nov-2021 10:10:13 Starting ChromeDriver 90.0.4430.24 (4c6d850f087da467d926e8eddb76550aed655991-refs/branch-heads/4430@{#429}) on port 12304
18-Nov-2021 10:10:13 Only local connections are allowed.
18-Nov-2021 10:10:13 Please see https://chromedriver.chromium.org/security-considerations for suggestions on keeping ChromeDriver safe.
18-Nov-2021 10:10:14 ChromeDriver was started successfully.
18-Nov-2021 10:10:14 Nov 18, 2021 10:10:14 AM org.openqa.selenium.remote.ProtocolHandshake createSession
18-Nov-2021 10:10:14 INFO: Detected dialect: W3C
18-Nov-2021 10:10:29 Tests run: 1, Failures: 0, Errors: 0, Skipped: 0, Time elapsed: 15.712 sec
18-Nov-2021 10:10:29 Running org.openmrs.reference.AdmitExitInpatientTest
18-Nov-2021 10:10:29 Running locally...
18-Nov-2021 10:10:29 Starting ChromeDriver 90.0.4430.24 (4c6d850f087da467d926e8eddb76550aed655991-refs/branch-heads/4430@{#429}) on port 15023
18-Nov-2021 10:10:29 Only local connections are allowed.
18-Nov-2021 10:10:29 Please see https://chromedriver.chromium.org/security-considerations for suggestions on keeping ChromeDriver safe.
18-Nov-2021 10:10:29 ChromeDriver was started successfully.
18-Nov-2021 10:10:30 Nov 18, 2021 10:10:30 AM org.openqa.selenium.remote.ProtocolHandshake createSession
18-Nov-2021 10:10:30 INFO: Detected dialect: W3C
18-Nov-2021 10:10:45 Tests run: 1, Failures: 0, Errors: 0, Skipped: 0, Time elapsed: 15.367 sec
18-Nov-2021 10:10:45 Running org.openmrs.reference.DeleteRequestAppointmentTest
18-Nov-2021 10:10:45 Running locally...
18-Nov-2021 10:10:45 Starting ChromeDriver 90.0.4430.24 (4c6d850f087da467d926e8eddb76550aed655991-refs/branch-heads/4430@{#429}) on port 11739
18-Nov-2021 10:10:45 Only local connections are allowed.
18-Nov-2021 10:10:45 Please see https://chromedriver.chromium.org/security-considerations for suggestions on keeping ChromeDriver safe.
18-Nov-2021 10:10:45 ChromeDriver was started successfully.
18-Nov-2021 10:10:45 Nov 18, 2021 10:10:45 AM org.openqa.selenium.remote.ProtocolHandshake createSession
18-Nov-2021 10:10:45 INFO: Detected dialect: W3C
18-Nov-2021 10:12:57 Tests run: 2, Failures: 0, Errors: 2, Skipped: 0, Time elapsed: 132.113 sec <<< FAILURE!
18-Nov-2021 10:12:57 Running org.openmrs.reference.EditAllergyTest
18-Nov-2021 10:12:57 Running locally...
18-Nov-2021 10:12:57 Starting ChromeDriver 90.0.4430.24 (4c6d850f087da467d926e8eddb76550aed655991-refs/branch-heads/4430@{#429}) on port 22920
18-Nov-2021 10:12:57 Only local connections are allowed.
18-Nov-2021 10:12:57 Please see https://chromedriver.chromium.org/security-considerations for suggestions on keeping ChromeDriver safe.
18-Nov-2021 10:12:57 ChromeDriver was started successfully.
18-Nov-2021 10:12:57 Nov 18, 2021 10:12:57 AM org.openqa.selenium.remote.ProtocolHandshake createSession
18-Nov-2021 10:12:57 INFO: Detected dialect: W3C
18-Nov-2021 10:13:07 Tests run: 1, Failures: 0, Errors: 0, Skipped: 0, Time elapsed: 10.308 sec
18-Nov-2021 10:13:07 Running org.openmrs.reference.VisitNoteTest
18-Nov-2021 10:13:07 Running locally...
18-Nov-2021 10:13:07 Starting ChromeDriver 90.0.4430.24 (4c6d850f087da467d926e8eddb76550aed655991-refs/branch-heads/4430@{#429}) on port 14170
18-Nov-2021 10:13:07 Only local connections are allowed.
18-Nov-2021 10:13:07 Please see https://chromedriver.chromium.org/security-considerations for suggestions on keeping ChromeDriver safe.
18-Nov-2021 10:13:07 ChromeDriver was started successfully.
18-Nov-2021 10:13:07 Nov 18, 2021 10:13:07 AM org.openqa.selenium.remote.ProtocolHandshake createSession
18-Nov-2021 10:13:07 INFO: Detected dialect: W3C
18-Nov-2021 10:13:32 Tests run: 1, Failures: 0, Errors: 0, Skipped: 0, Time elapsed: 24.629 sec
18-Nov-2021 10:13:32 Running org.openmrs.reference.CreatePersonTest
18-Nov-2021 10:13:32 Running locally...
18-Nov-2021 10:13:32 Starting ChromeDriver 90.0.4430.24 (4c6d850f087da467d926e8eddb76550aed655991-refs/branch-heads/4430@{#429}) on port 8133
18-Nov-2021 10:13:32 Only local connections are allowed.
18-Nov-2021 10:13:32 Please see https://chromedriver.chromium.org/security-considerations for suggestions on keeping ChromeDriver safe.
18-Nov-2021 10:13:32 ChromeDriver was started successfully.
18-Nov-2021 10:13:32 Nov 18, 2021 10:13:32 AM org.openqa.selenium.remote.ProtocolHandshake createSession
18-Nov-2021 10:13:32 INFO: Detected dialect: W3C
18-Nov-2021 10:13:39 Tests run: 1, Failures: 0, Errors: 0, Skipped: 0, Time elapsed: 7.442 sec
18-Nov-2021 10:13:39 Running org.openmrs.reference.FindPatientByNameTest
18-Nov-2021 10:13:39 Running locally...
18-Nov-2021 10:13:39 Starting ChromeDriver 90.0.4430.24 (4c6d850f087da467d926e8eddb76550aed655991-refs/branch-heads/4430@{#429}) on port 22014
18-Nov-2021 10:13:39 Only local connections are allowed.
18-Nov-2021 10:13:39 Please see https://chromedriver.chromium.org/security-considerations for suggestions on keeping ChromeDriver safe.
18-Nov-2021 10:13:39 ChromeDriver was started successfully.
18-Nov-2021 10:13:39 Nov 18, 2021 10:13:39 AM org.openqa.selenium.remote.ProtocolHandshake createSession
18-Nov-2021 10:13:39 INFO: Detected dialect: W3C
18-Nov-2021 10:13:46 Tests run: 1, Failures: 0, Errors: 0, Skipped: 0, Time elapsed: 7.046 sec
18-Nov-2021 10:13:46 Running org.openmrs.reference.AddUserTest
18-Nov-2021 10:13:46 Running locally...
18-Nov-2021 10:13:46 Starting ChromeDriver 90.0.4430.24 (4c6d850f087da467d926e8eddb76550aed655991-refs/branch-heads/4430@{#429}) on port 21629
18-Nov-2021 10:13:46 Only local connections are allowed.
18-Nov-2021 10:13:46 Please see https://chromedriver.chromium.org/security-considerations for suggestions on keeping ChromeDriver safe.
18-Nov-2021 10:13:46 ChromeDriver was started successfully.
18-Nov-2021 10:13:46 Nov 18, 2021 10:13:46 AM org.openqa.selenium.remote.ProtocolHandshake createSession
18-Nov-2021 10:13:46 INFO: Detected dialect: W3C
18-Nov-2021 10:13:57 Tests run: 1, Failures: 0, Errors: 0, Skipped: 0, Time elapsed: 10.709 sec
18-Nov-2021 10:13:57 Running org.openmrs.reference.AddProviderTest
18-Nov-2021 10:13:57 Running locally...
18-Nov-2021 10:13:57 Starting ChromeDriver 90.0.4430.24 (4c6d850f087da467d926e8eddb76550aed655991-refs/branch-heads/4430@{#429}) on port 30882
18-Nov-2021 10:13:57 Only local connections are allowed.
18-Nov-2021 10:13:57 Please see https://chromedriver.chromium.org/security-considerations for suggestions on keeping ChromeDriver safe.
18-Nov-2021 10:13:57 ChromeDriver was started successfully.
18-Nov-2021 10:13:57 Nov 18, 2021 10:13:57 AM org.openqa.selenium.remote.ProtocolHandshake createSession
18-Nov-2021 10:13:57 INFO: Detected dialect: W3C
18-Nov-2021 10:14:10 Tests run: 1, Failures: 0, Errors: 0, Skipped: 0, Time elapsed: 12.945 sec
18-Nov-2021 10:14:10 Running org.openmrs.reference.AddPastVisitTest
18-Nov-2021 10:14:10 Running locally...
18-Nov-2021 10:14:10 Starting ChromeDriver 90.0.4430.24 (4c6d850f087da467d926e8eddb76550aed655991-refs/branch-heads/4430@{#429}) on port 31507
18-Nov-2021 10:14:10 Only local connections are allowed.
18-Nov-2021 10:14:10 Please see https://chromedriver.chromium.org/security-considerations for suggestions on keeping ChromeDriver safe.
18-Nov-2021 10:14:10 ChromeDriver was started successfully.
18-Nov-2021 10:14:10 Nov 18, 2021 10:14:10 AM org.openqa.selenium.remote.ProtocolHandshake createSession
18-Nov-2021 10:14:10 INFO: Detected dialect: W3C
18-Nov-2021 10:14:20 Tests run: 1, Failures: 0, Errors: 0, Skipped: 0, Time elapsed: 10.049 sec
18-Nov-2021 10:14:20 Running org.openmrs.reference.RecordMergeIssueTest
18-Nov-2021 10:14:20 Running locally...
18-Nov-2021 10:14:20 Starting ChromeDriver 90.0.4430.24 (4c6d850f087da467d926e8eddb76550aed655991-refs/branch-heads/4430@{#429}) on port 30173
18-Nov-2021 10:14:20 Only local connections are allowed.
18-Nov-2021 10:14:20 Please see https://chromedriver.chromium.org/security-considerations for suggestions on keeping ChromeDriver safe.
18-Nov-2021 10:14:20 ChromeDriver was started successfully.
18-Nov-2021 10:14:20 Nov 18, 2021 10:14:20 AM org.openqa.selenium.remote.ProtocolHandshake createSession
18-Nov-2021 10:14:20 INFO: Detected dialect: W3C
18-Nov-2021 10:14:33 Tests run: 1, Failures: 0, Errors: 0, Skipped: 0, Time elapsed: 13.01 sec
18-Nov-2021 10:14:33 Running org.openmrs.reference.CaptureVitalsTest
18-Nov-2021 10:14:33 Running locally...
18-Nov-2021 10:14:33 Starting ChromeDriver 90.0.4430.24 (4c6d850f087da467d926e8eddb76550aed655991-refs/branch-heads/4430@{#429}) on port 28362
18-Nov-2021 10:14:33 Only local connections are allowed.
18-Nov-2021 10:14:33 Please see https://chromedriver.chromium.org/security-considerations for suggestions on keeping ChromeDriver safe.
18-Nov-2021 10:14:33 ChromeDriver was started successfully.
18-Nov-2021 10:14:33 Nov 18, 2021 10:14:33 AM org.openqa.selenium.remote.ProtocolHandshake createSession
18-Nov-2021 10:14:33 INFO: Detected dialect: W3C
18-Nov-2021 10:14:43 Tests run: 1, Failures: 0, Errors: 0, Skipped: 0, Time elapsed: 9.811 sec
18-Nov-2021 10:14:43 Running org.openmrs.reference.NamePatientAccentedLetterTest
18-Nov-2021 10:14:43 Running locally...
18-Nov-2021 10:14:43 Starting ChromeDriver 90.0.4430.24 (4c6d850f087da467d926e8eddb76550aed655991-refs/branch-heads/4430@{#429}) on port 12280
18-Nov-2021 10:14:43 Only local connections are allowed.
18-Nov-2021 10:14:43 Please see https://chromedriver.chromium.org/security-considerations for suggestions on keeping ChromeDriver safe.
18-Nov-2021 10:14:43 ChromeDriver was started successfully.
18-Nov-2021 10:14:43 Nov 18, 2021 10:14:43 AM org.openqa.selenium.remote.ProtocolHandshake createSession
18-Nov-2021 10:14:43 INFO: Detected dialect: W3C
18-Nov-2021 10:14:51 Tests run: 1, Failures: 0, Errors: 0, Skipped: 0, Time elapsed: 7.884 sec
18-Nov-2021 10:14:51 Running org.openmrs.reference.RetirePersonTest
18-Nov-2021 10:14:51 Running locally...
18-Nov-2021 10:14:51 Starting ChromeDriver 90.0.4430.24 (4c6d850f087da467d926e8eddb76550aed655991-refs/branch-heads/4430@{#429}) on port 9212
18-Nov-2021 10:14:51 Only local connections are allowed.
18-Nov-2021 10:14:51 Please see https://chromedriver.chromium.org/security-considerations for suggestions on keeping ChromeDriver safe.
18-Nov-2021 10:14:51 ChromeDriver was started successfully.
18-Nov-2021 10:14:51 Nov 18, 2021 10:14:51 AM org.openqa.selenium.remote.ProtocolHandshake createSession
18-Nov-2021 10:14:51 INFO: Detected dialect: W3C
18-Nov-2021 10:14:55 Tests run: 1, Failures: 0, Errors: 0, Skipped: 0, Time elapsed: 4.918 sec
18-Nov-2021 10:14:55 Running org.openmrs.reference.EndVisitTest
18-Nov-2021 10:14:55 Running locally...
18-Nov-2021 10:14:56 Starting ChromeDriver 90.0.4430.24 (4c6d850f087da467d926e8eddb76550aed655991-refs/branch-heads/4430@{#429}) on port 31339
18-Nov-2021 10:14:56 Only local connections are allowed.
18-Nov-2021 10:14:56 Please see https://chromedriver.chromium.org/security-considerations for suggestions on keeping ChromeDriver safe.
18-Nov-2021 10:14:56 ChromeDriver was started successfully.
18-Nov-2021 10:14:56 Nov 18, 2021 10:14:56 AM org.openqa.selenium.remote.ProtocolHandshake createSession
18-Nov-2021 10:14:56 INFO: Detected dialect: W3C
18-Nov-2021 10:15:07 Tests run: 1, Failures: 0, Errors: 0, Skipped: 0, Time elapsed: 11.172 sec
18-Nov-2021 10:15:07 Running org.openmrs.reference.DeleteAppointmentBlockTest
18-Nov-2021 10:15:07 Running locally...
18-Nov-2021 10:15:07 Starting ChromeDriver 90.0.4430.24 (4c6d850f087da467d926e8eddb76550aed655991-refs/branch-heads/4430@{#429}) on port 29731
18-Nov-2021 10:15:07 Only local connections are allowed.
18-Nov-2021 10:15:07 Please see https://chromedriver.chromium.org/security-considerations for suggestions on keeping ChromeDriver safe.
18-Nov-2021 10:15:07 ChromeDriver was started successfully.
18-Nov-2021 10:15:07 Nov 18, 2021 10:15:07 AM org.openqa.selenium.remote.ProtocolHandshake createSession
18-Nov-2021 10:15:07 INFO: Detected dialect: W3C
18-Nov-2021 10:15:12 Tests run: 1, Failures: 0, Errors: 0, Skipped: 0, Time elapsed: 5.794 sec
18-Nov-2021 10:15:12 Running org.openmrs.reference.BookRequestAppointmentTest
18-Nov-2021 10:15:12 Running locally...
18-Nov-2021 10:15:12 Starting ChromeDriver 90.0.4430.24 (4c6d850f087da467d926e8eddb76550aed655991-refs/branch-heads/4430@{#429}) on port 26569
18-Nov-2021 10:15:12 Only local connections are allowed.
18-Nov-2021 10:15:12 Please see https://chromedriver.chromium.org/security-considerations for suggestions on keeping ChromeDriver safe.
18-Nov-2021 10:15:12 ChromeDriver was started successfully.
18-Nov-2021 10:15:13 Nov 18, 2021 10:15:13 AM org.openqa.selenium.remote.ProtocolHandshake createSession
18-Nov-2021 10:15:13 INFO: Detected dialect: W3C
18-Nov-2021 10:15:33 Tests run: 1, Failures: 0, Errors: 0, Skipped: 0, Time elapsed: 20.096 sec
18-Nov-2021 10:15:33 Running org.openmrs.reference.AddDeleteServiceTest
18-Nov-2021 10:15:33 Running locally...
18-Nov-2021 10:15:33 Starting ChromeDriver 90.0.4430.24 (4c6d850f087da467d926e8eddb76550aed655991-refs/branch-heads/4430@{#429}) on port 22212
18-Nov-2021 10:15:33 Only local connections are allowed.
18-Nov-2021 10:15:33 Please see https://chromedriver.chromium.org/security-considerations for suggestions on keeping ChromeDriver safe.
18-Nov-2021 10:15:33 ChromeDriver was started successfully.
18-Nov-2021 10:15:33 Nov 18, 2021 10:15:33 AM org.openqa.selenium.remote.ProtocolHandshake createSession
18-Nov-2021 10:15:33 INFO: Detected dialect: W3C
18-Nov-2021 10:15:38 Tests run: 1, Failures: 0, Errors: 0, Skipped: 0, Time elapsed: 5.723 sec
18-Nov-2021 10:15:38 Running org.openmrs.reference.AddEditAppointmentBlockTest
18-Nov-2021 10:15:38 Running locally...
18-Nov-2021 10:15:38 Starting ChromeDriver 90.0.4430.24 (4c6d850f087da467d926e8eddb76550aed655991-refs/branch-heads/4430@{#429}) on port 10566
18-Nov-2021 10:15:38 Only local connections are allowed.
18-Nov-2021 10:15:38 Please see https://chromedriver.chromium.org/security-considerations for suggestions on keeping ChromeDriver safe.
18-Nov-2021 10:15:38 ChromeDriver was started successfully.
18-Nov-2021 10:15:39 Nov 18, 2021 10:15:39 AM org.openqa.selenium.remote.ProtocolHandshake createSession
18-Nov-2021 10:15:39 INFO: Detected dialect: W3C
18-Nov-2021 10:15:45 Tests run: 1, Failures: 0, Errors: 0, Skipped: 0, Time elapsed: 6.963 sec
18-Nov-2021 10:15:45 Running org.openmrs.reference.RetireProviderTest
18-Nov-2021 10:15:45 Running locally...
18-Nov-2021 10:15:45 Starting ChromeDriver 90.0.4430.24 (4c6d850f087da467d926e8eddb76550aed655991-refs/branch-heads/4430@{#429}) on port 28544
18-Nov-2021 10:15:45 Only local connections are allowed.
18-Nov-2021 10:15:45 Please see https://chromedriver.chromium.org/security-considerations for suggestions on keeping ChromeDriver safe.
18-Nov-2021 10:15:45 ChromeDriver was started successfully.
18-Nov-2021 10:15:46 Nov 18, 2021 10:15:46 AM org.openqa.selenium.remote.ProtocolHandshake createSession
18-Nov-2021 10:15:46 INFO: Detected dialect: W3C
18-Nov-2021 10:15:50 Tests run: 1, Failures: 0, Errors: 0, Skipped: 0, Time elapsed: 5.17 sec
18-Nov-2021 10:15:50 Running org.openmrs.reference.MergePatientTest
18-Nov-2021 10:15:50 Running locally...
18-Nov-2021 10:15:50 Starting ChromeDriver 90.0.4430.24 (4c6d850f087da467d926e8eddb76550aed655991-refs/branch-heads/4430@{#429}) on port 13800
18-Nov-2021 10:15:50 Only local connections are allowed.
18-Nov-2021 10:15:50 Please see https://chromedriver.chromium.org/security-considerations for suggestions on keeping ChromeDriver safe.
18-Nov-2021 10:15:50 ChromeDriver was started successfully.
18-Nov-2021 10:15:51 Nov 18, 2021 10:15:51 AM org.openqa.selenium.remote.ProtocolHandshake createSession
18-Nov-2021 10:15:51 INFO: Detected dialect: W3C
18-Nov-2021 10:15:58 Tests run: 1, Failures: 0, Errors: 0, Skipped: 0, Time elapsed: 7.953 sec
18-Nov-2021 10:15:58 Running org.openmrs.reference.AddDeleteLocationTest
18-Nov-2021 10:15:58 Running locally...
18-Nov-2021 10:15:58 Starting ChromeDriver 90.0.4430.24 (4c6d850f087da467d926e8eddb76550aed655991-refs/branch-heads/4430@{#429}) on port 1701
18-Nov-2021 10:15:58 Only local connections are allowed.
18-Nov-2021 10:15:58 Please see https://chromedriver.chromium.org/security-considerations for suggestions on keeping ChromeDriver safe.
18-Nov-2021 10:15:58 ChromeDriver was started successfully.
18-Nov-2021 10:15:59 Nov 18, 2021 10:15:59 AM org.openqa.selenium.remote.ProtocolHandshake createSession
18-Nov-2021 10:15:59 INFO: Detected dialect: W3C
18-Nov-2021 10:16:03 Tests run: 1, Failures: 0, Errors: 0, Skipped: 0, Time elapsed: 4.329 sec
18-Nov-2021 10:16:03 Running org.openmrs.reference.DuplicatePatientRegisterTest
18-Nov-2021 10:16:03 Running locally...
18-Nov-2021 10:16:03 Starting ChromeDriver 90.0.4430.24 (4c6d850f087da467d926e8eddb76550aed655991-refs/branch-heads/4430@{#429}) on port 21231
18-Nov-2021 10:16:03 Only local connections are allowed.
18-Nov-2021 10:16:03 Please see https://chromedriver.chromium.org/security-considerations for suggestions on keeping ChromeDriver safe.
18-Nov-2021 10:16:03 ChromeDriver was started successfully.
18-Nov-2021 10:16:03 Nov 18, 2021 10:16:03 AM org.openqa.selenium.remote.ProtocolHandshake createSession
18-Nov-2021 10:16:03 INFO: Detected dialect: W3C
18-Nov-2021 10:16:15 Tests run: 1, Failures: 0, Errors: 0, Skipped: 0, Time elapsed: 12.182 sec
18-Nov-2021 10:16:15 Running org.openmrs.reference.UsingBackButtonInMergePatientTest
18-Nov-2021 10:16:15 Running locally...
18-Nov-2021 10:16:15 Starting ChromeDriver 90.0.4430.24 (4c6d850f087da467d926e8eddb76550aed655991-refs/branch-heads/4430@{#429}) on port 28001
18-Nov-2021 10:16:15 Only local connections are allowed.
18-Nov-2021 10:16:15 Please see https://chromedriver.chromium.org/security-considerations for suggestions on keeping ChromeDriver safe.
18-Nov-2021 10:16:15 ChromeDriver was started successfully.
18-Nov-2021 10:16:15 Nov 18, 2021 10:16:15 AM org.openqa.selenium.remote.ProtocolHandshake createSession
18-Nov-2021 10:16:15 INFO: Detected dialect: W3C
18-Nov-2021 10:16:27 Tests run: 1, Failures: 0, Errors: 0, Skipped: 0, Time elapsed: 12.121 sec
18-Nov-2021 10:16:27 Running org.openmrs.reference.AddDiagnosisToVisitNoteTest
18-Nov-2021 10:16:27 Running locally...
18-Nov-2021 10:16:27 Starting ChromeDriver 90.0.4430.24 (4c6d850f087da467d926e8eddb76550aed655991-refs/branch-heads/4430@{#429}) on port 22369
18-Nov-2021 10:16:27 Only local connections are allowed.
18-Nov-2021 10:16:27 Please see https://chromedriver.chromium.org/security-considerations for suggestions on keeping ChromeDriver safe.
18-Nov-2021 10:16:27 ChromeDriver was started successfully.
18-Nov-2021 10:16:27 Nov 18, 2021 10:16:27 AM org.openqa.selenium.remote.ProtocolHandshake createSession
18-Nov-2021 10:16:27 INFO: Detected dialect: W3C
18-Nov-2021 10:16:39 Tests run: 1, Failures: 0, Errors: 0, Skipped: 0, Time elapsed: 12.111 sec
18-Nov-2021 10:16:39 Running org.openmrs.reference.MergeVisitsTest
18-Nov-2021 10:16:39 Running locally...
18-Nov-2021 10:16:39 Starting ChromeDriver 90.0.4430.24 (4c6d850f087da467d926e8eddb76550aed655991-refs/branch-heads/4430@{#429}) on port 15135
18-Nov-2021 10:16:39 Only local connections are allowed.
18-Nov-2021 10:16:39 Please see https://chromedriver.chromium.org/security-considerations for suggestions on keeping ChromeDriver safe.
18-Nov-2021 10:16:39 ChromeDriver was started successfully.
18-Nov-2021 10:16:39 Nov 18, 2021 10:16:39 AM org.openqa.selenium.remote.ProtocolHandshake createSession
18-Nov-2021 10:16:39 INFO: Detected dialect: W3C
18-Nov-2021 10:16:52 Tests run: 1, Failures: 0, Errors: 0, Skipped: 0, Time elapsed: 12.866 sec
18-Nov-2021 10:16:52 Running org.openmrs.reference.CheckModulesTest
18-Nov-2021 10:16:52 Running locally...
18-Nov-2021 10:16:52 Starting ChromeDriver 90.0.4430.24 (4c6d850f087da467d926e8eddb76550aed655991-refs/branch-heads/4430@{#429}) on port 32484
18-Nov-2021 10:16:52 Only local connections are allowed.
18-Nov-2021 10:16:52 Please see https://chromedriver.chromium.org/security-considerations for suggestions on keeping ChromeDriver safe.
18-Nov-2021 10:16:52 ChromeDriver was started successfully.
18-Nov-2021 10:16:52 Nov 18, 2021 10:16:52 AM org.openqa.selenium.remote.ProtocolHandshake createSession
18-Nov-2021 10:16:52 INFO: Detected dialect: W3C
18-Nov-2021 10:17:00 Tests run: 1, Failures: 0, Errors: 0, Skipped: 0, Time elapsed: 7.731 sec
18-Nov-2021 10:17:00 Running org.openmrs.reference.EditServiceTest
18-Nov-2021 10:17:00 Running locally...
18-Nov-2021 10:17:00 Starting ChromeDriver 90.0.4430.24 (4c6d850f087da467d926e8eddb76550aed655991-refs/branch-heads/4430@{#429}) on port 11485
18-Nov-2021 10:17:00 Only local connections are allowed.
18-Nov-2021 10:17:00 Please see https://chromedriver.chromium.org/security-considerations for suggestions on keeping ChromeDriver safe.
18-Nov-2021 10:17:00 ChromeDriver was started successfully.
18-Nov-2021 10:17:00 Nov 18, 2021 10:17:00 AM org.openqa.selenium.remote.ProtocolHandshake createSession
18-Nov-2021 10:17:00 INFO: Detected dialect: W3C
18-Nov-2021 10:17:05 Tests run: 1, Failures: 0, Errors: 0, Skipped: 0, Time elapsed: 5.453 sec
18-Nov-2021 10:17:05 Running org.openmrs.reference.AddNewAllergyTest
18-Nov-2021 10:17:05 Running locally...
18-Nov-2021 10:17:05 Starting ChromeDriver 90.0.4430.24 (4c6d850f087da467d926e8eddb76550aed655991-refs/branch-heads/4430@{#429}) on port 30057
18-Nov-2021 10:17:05 Only local connections are allowed.
18-Nov-2021 10:17:05 Please see https://chromedriver.chromium.org/security-considerations for suggestions on keeping ChromeDriver safe.
18-Nov-2021 10:17:05 ChromeDriver was started successfully.
18-Nov-2021 10:17:05 Nov 18, 2021 10:17:05 AM org.openqa.selenium.remote.ProtocolHandshake createSession
18-Nov-2021 10:17:05 INFO: Detected dialect: W3C
18-Nov-2021 10:17:14 Tests run: 1, Failures: 0, Errors: 0, Skipped: 0, Time elapsed: 9.237 sec
18-Nov-2021 10:17:14 Running org.openmrs.reference.LoginTest
18-Nov-2021 10:17:14 Running locally...
18-Nov-2021 10:17:14 Starting ChromeDriver 90.0.4430.24 (4c6d850f087da467d926e8eddb76550aed655991-refs/branch-heads/4430@{#429}) on port 4565
18-Nov-2021 10:17:14 Only local connections are allowed.
18-Nov-2021 10:17:14 Please see https://chromedriver.chromium.org/security-considerations for suggestions on keeping ChromeDriver safe.
18-Nov-2021 10:17:14 ChromeDriver was started successfully.
18-Nov-2021 10:17:15 Nov 18, 2021 10:17:15 AM org.openqa.selenium.remote.ProtocolHandshake createSession
18-Nov-2021 10:17:15 INFO: Detected dialect: W3C
18-Nov-2021 10:17:17 Running locally...
18-Nov-2021 10:17:17 Starting ChromeDriver 90.0.4430.24 (4c6d850f087da467d926e8eddb76550aed655991-refs/branch-heads/4430@{#429}) on port 26437
18-Nov-2021 10:17:17 Only local connections are allowed.
18-Nov-2021 10:17:17 Please see https://chromedriver.chromium.org/security-considerations for suggestions on keeping ChromeDriver safe.
18-Nov-2021 10:17:17 ChromeDriver was started successfully.
18-Nov-2021 10:17:17 Nov 18, 2021 10:17:17 AM org.openqa.selenium.remote.ProtocolHandshake createSession
18-Nov-2021 10:17:17 INFO: Detected dialect: W3C
18-Nov-2021 10:17:19 Running locally...
18-Nov-2021 10:17:19 Starting ChromeDriver 90.0.4430.24 (4c6d850f087da467d926e8eddb76550aed655991-refs/branch-heads/4430@{#429}) on port 32174
18-Nov-2021 10:17:19 Only local connections are allowed.
18-Nov-2021 10:17:19 Please see https://chromedriver.chromium.org/security-considerations for suggestions on keeping ChromeDriver safe.
18-Nov-2021 10:17:19 ChromeDriver was started successfully.
18-Nov-2021 10:17:19 Nov 18, 2021 10:17:19 AM org.openqa.selenium.remote.ProtocolHandshake createSession
18-Nov-2021 10:17:19 INFO: Detected dialect: W3C
18-Nov-2021 10:17:22 Running locally...
18-Nov-2021 10:17:22 Starting ChromeDriver 90.0.4430.24 (4c6d850f087da467d926e8eddb76550aed655991-refs/branch-heads/4430@{#429}) on port 31089
18-Nov-2021 10:17:22 Only local connections are allowed.
18-Nov-2021 10:17:22 Please see https://chromedriver.chromium.org/security-considerations for suggestions on keeping ChromeDriver safe.
18-Nov-2021 10:17:22 ChromeDriver was started successfully.
18-Nov-2021 10:17:22 Nov 18, 2021 10:17:22 AM org.openqa.selenium.remote.ProtocolHandshake createSession
18-Nov-2021 10:17:22 INFO: Detected dialect: W3C
18-Nov-2021 10:17:24 Running locally...
18-Nov-2021 10:17:24 Starting ChromeDriver 90.0.4430.24 (4c6d850f087da467d926e8eddb76550aed655991-refs/branch-heads/4430@{#429}) on port 11144
18-Nov-2021 10:17:24 Only local connections are allowed.
18-Nov-2021 10:17:24 Please see https://chromedriver.chromium.org/security-considerations for suggestions on keeping ChromeDriver safe.
18-Nov-2021 10:17:24 ChromeDriver was started successfully.
18-Nov-2021 10:17:25 Nov 18, 2021 10:17:25 AM org.openqa.selenium.remote.ProtocolHandshake createSession
18-Nov-2021 10:17:25 INFO: Detected dialect: W3C
18-Nov-2021 10:17:27 Tests run: 5, Failures: 0, Errors: 0, Skipped: 0, Time elapsed: 12.988 sec
18-Nov-2021 10:17:27 Running org.openmrs.reference.DeleteProviderTest
18-Nov-2021 10:17:27 Running locally...
18-Nov-2021 10:17:27 Starting ChromeDriver 90.0.4430.24 (4c6d850f087da467d926e8eddb76550aed655991-refs/branch-heads/4430@{#429}) on port 21377
18-Nov-2021 10:17:27 Only local connections are allowed.
18-Nov-2021 10:17:27 Please see https://chromedriver.chromium.org/security-considerations for suggestions on keeping ChromeDriver safe.
18-Nov-2021 10:17:27 ChromeDriver was started successfully.
18-Nov-2021 10:17:28 Nov 18, 2021 10:17:28 AM org.openqa.selenium.remote.ProtocolHandshake createSession
18-Nov-2021 10:17:28 INFO: Detected dialect: W3C
18-Nov-2021 10:17:32 Tests run: 1, Failures: 0, Errors: 0, Skipped: 0, Time elapsed: 4.641 sec
18-Nov-2021 10:17:32 Running org.openmrs.reference.RegisterPatientTest
18-Nov-2021 10:17:32 Running locally...
18-Nov-2021 10:17:32 Starting ChromeDriver 90.0.4430.24 (4c6d850f087da467d926e8eddb76550aed655991-refs/branch-heads/4430@{#429}) on port 30484
18-Nov-2021 10:17:32 Only local connections are allowed.
18-Nov-2021 10:17:32 Please see https://chromedriver.chromium.org/security-considerations for suggestions on keeping ChromeDriver safe.
18-Nov-2021 10:17:32 ChromeDriver was started successfully.
18-Nov-2021 10:17:32 Nov 18, 2021 10:17:32 AM org.openqa.selenium.remote.ProtocolHandshake createSession
18-Nov-2021 10:17:32 INFO: Detected dialect: W3C
18-Nov-2021 10:17:40 Tests run: 1, Failures: 0, Errors: 0, Skipped: 0, Time elapsed: 7.669 sec
18-Nov-2021 10:17:40 Running org.openmrs.reference.ContactInfoTest
18-Nov-2021 10:17:40 Running locally...
18-Nov-2021 10:17:40 Starting ChromeDriver 90.0.4430.24 (4c6d850f087da467d926e8eddb76550aed655991-refs/branch-heads/4430@{#429}) on port 18879
18-Nov-2021 10:17:40 Only local connections are allowed.
18-Nov-2021 10:17:40 Please see https://chromedriver.chromium.org/security-considerations for suggestions on keeping ChromeDriver safe.
18-Nov-2021 10:17:40 ChromeDriver was started successfully.
18-Nov-2021 10:17:40 Nov 18, 2021 10:17:40 AM org.openqa.selenium.remote.ProtocolHandshake createSession
18-Nov-2021 10:17:40 INFO: Detected dialect: W3C
18-Nov-2021 10:17:51 Tests run: 1, Failures: 0, Errors: 0, Skipped: 0, Time elapsed: 11.412 sec
18-Nov-2021 10:17:51 Running org.openmrs.reference.StartVisitTest
18-Nov-2021 10:17:51 Running locally...
18-Nov-2021 10:17:51 Starting ChromeDriver 90.0.4430.24 (4c6d850f087da467d926e8eddb76550aed655991-refs/branch-heads/4430@{#429}) on port 7133
18-Nov-2021 10:17:51 Only local connections are allowed.
18-Nov-2021 10:17:51 Please see https://chromedriver.chromium.org/security-considerations for suggestions on keeping ChromeDriver safe.
18-Nov-2021 10:17:51 ChromeDriver was started successfully.
18-Nov-2021 10:17:51 Nov 18, 2021 10:17:51 AM org.openqa.selenium.remote.ProtocolHandshake createSession
18-Nov-2021 10:17:51 INFO: Detected dialect: W3C
18-Nov-2021 10:18:00 Tests run: 1, Failures: 0, Errors: 0, Skipped: 0, Time elapsed: 8.448 sec
18-Nov-2021 10:18:00 Running org.openmrs.reference.DeletePersonTest
18-Nov-2021 10:18:00 Running locally...
18-Nov-2021 10:18:00 Starting ChromeDriver 90.0.4430.24 (4c6d850f087da467d926e8eddb76550aed655991-refs/branch-heads/4430@{#429}) on port 6763
18-Nov-2021 10:18:00 Only local connections are allowed.
18-Nov-2021 10:18:00 Please see https://chromedriver.chromium.org/security-considerations for suggestions on keeping ChromeDriver safe.
18-Nov-2021 10:18:00 ChromeDriver was started successfully.
18-Nov-2021 10:18:00 Nov 18, 2021 10:18:00 AM org.openqa.selenium.remote.ProtocolHandshake createSession
18-Nov-2021 10:18:00 INFO: Detected dialect: W3C
18-Nov-2021 10:18:04 Tests run: 1, Failures: 0, Errors: 0, Skipped: 0, Time elapsed: 4.797 sec
18-Nov-2021 10:18:04 Running org.openmrs.reference.EditProviderTest
18-Nov-2021 10:18:04 Running locally...
18-Nov-2021 10:18:04 Starting ChromeDriver 90.0.4430.24 (4c6d850f087da467d926e8eddb76550aed655991-refs/branch-heads/4430@{#429}) on port 21237
18-Nov-2021 10:18:04 Only local connections are allowed.
18-Nov-2021 10:18:04 Please see https://chromedriver.chromium.org/security-considerations for suggestions on keeping ChromeDriver safe.
18-Nov-2021 10:18:04 ChromeDriver was started successfully.
18-Nov-2021 10:18:05 Nov 18, 2021 10:18:05 AM org.openqa.selenium.remote.ProtocolHandshake createSession
18-Nov-2021 10:18:05 INFO: Detected dialect: W3C
18-Nov-2021 10:18:10 Tests run: 1, Failures: 0, Errors: 0, Skipped: 0, Time elapsed: 5.49 sec
18-Nov-2021 10:18:10 Running org.openmrs.reference.RetireVisitTypeTest
18-Nov-2021 10:18:10 Running locally...
18-Nov-2021 10:18:10 Starting ChromeDriver 90.0.4430.24 (4c6d850f087da467d926e8eddb76550aed655991-refs/branch-heads/4430@{#429}) on port 21629
18-Nov-2021 10:18:10 Only local connections are allowed.
18-Nov-2021 10:18:10 Please see https://chromedriver.chromium.org/security-considerations for suggestions on keeping ChromeDriver safe.
18-Nov-2021 10:18:10 ChromeDriver was started successfully.
18-Nov-2021 10:18:10 Nov 18, 2021 10:18:10 AM org.openqa.selenium.remote.ProtocolHandshake createSession
18-Nov-2021 10:18:10 INFO: Detected dialect: W3C
18-Nov-2021 10:18:14 Tests run: 1, Failures: 0, Errors: 0, Skipped: 0, Time elapsed: 3.621 sec
18-Nov-2021 10:18:14
18-Nov-2021 10:18:14 Results :
18-Nov-2021 10:18:14
18-Nov-2021 10:18:14 Tests in error:
18-Nov-2021 10:18:14   deleteRequestAppointmentTest(org.openmrs.reference.DeleteRequestAppointmentTest): Error communicating with the remote browser. It may have died.(..)
18-Nov-2021 10:18:14   deleteRequestAppointmentTest(org.openmrs.reference.DeleteRequestAppointmentTest): Session ID is null. Using WebDriver after calling quit()?(..)
18-Nov-2021 10:18:14
18-Nov-2021 10:18:14 Tests run: 60, Failures: 0, Errors: 2, Skipped: 0
18-Nov-2021 10:18:14
18-Nov-2021 10:18:14 [INFO] ------------------------------------------------------------------------
18-Nov-2021 10:18:14 [INFO] Reactor Summary:
18-Nov-2021 10:18:14 [INFO]
18-Nov-2021 10:18:14 [INFO] Reference Application Distribution ................. SUCCESS [  0.398 s]
18-Nov-2021 10:18:14 [INFO] Reference Application Distribution Package ......... SUCCESS [02:10 min]
18-Nov-2021 10:18:14 [INFO] Reference Application Distribution UI Tests ........ FAILURE [10:45 min]
18-Nov-2021 10:18:14 [INFO] ------------------------------------------------------------------------
18-Nov-2021 10:18:14 [INFO] BUILD FAILURE
18-Nov-2021 10:18:14 [INFO] ------------------------------------------------------------------------
18-Nov-2021 10:18:14 [INFO] Total time: 12:56 min
18-Nov-2021 10:18:14 [INFO] Finished at: 2021-11-18T10:18:14+00:00
18-Nov-2021 10:18:14 [INFO] Final Memory: 59M/335M
18-Nov-2021 10:18:14 [INFO] ------------------------------------------------------------------------
18-Nov-2021 10:18:14 [ERROR] Failed to execute goal org.apache.maven.plugins:maven-surefire-plugin:2.12:test (default-test) on project referenceapplication-ui-tests: There are test failures.
18-Nov-2021 10:18:14 [ERROR]
18-Nov-2021 10:18:14 [ERROR] Please refer to /home/bamboo-agent/bamboo-agent/xml-data/build-dir/REFAPP-UI-FRAMEWORK/ui-tests/target/surefire-reports for the individual test results.
18-Nov-2021 10:18:14 [ERROR] -> [Help 1]
18-Nov-2021 10:18:14 org.apache.maven.lifecycle.LifecycleExecutionException: Failed to execute goal org.apache.maven.plugins:maven-surefire-plugin:2.12:test (default-test) on project referenceapplication-ui-tests: There are test failures.
18-Nov-2021 10:18:14
18-Nov-2021 10:18:14 Please refer to /home/bamboo-agent/bamboo-agent/xml-data/build-dir/REFAPP-UI-FRAMEWORK/ui-tests/target/surefire-reports for the individual test results.
18-Nov-2021 10:18:14         at org.apache.maven.lifecycle.internal.MojoExecutor.execute(MojoExecutor.java:212)
18-Nov-2021 10:18:14         at org.apache.maven.lifecycle.internal.MojoExecutor.execute(MojoExecutor.java:153)
18-Nov-2021 10:18:14         at org.apache.maven.lifecycle.internal.MojoExecutor.execute(MojoExecutor.java:145)
18-Nov-2021 10:18:14         at org.apache.maven.lifecycle.internal.LifecycleModuleBuilder.buildProject(LifecycleModuleBuilder.java:116)
18-Nov-2021 10:18:14         at org.apache.maven.lifecycle.internal.LifecycleModuleBuilder.buildProject(LifecycleModuleBuilder.java:80)
18-Nov-2021 10:18:14         at org.apache.maven.lifecycle.internal.builder.singlethreaded.SingleThreadedBuilder.build(SingleThreadedBuilder.java:51)
18-Nov-2021 10:18:14         at org.apache.maven.lifecycle.internal.LifecycleStarter.execute(LifecycleStarter.java:128)
18-Nov-2021 10:18:14         at org.apache.maven.DefaultMaven.doExecute(DefaultMaven.java:307)
18-Nov-2021 10:18:14         at org.apache.maven.DefaultMaven.doExecute(DefaultMaven.java:193)
18-Nov-2021 10:18:14         at org.apache.maven.DefaultMaven.execute(DefaultMaven.java:106)
18-Nov-2021 10:18:14         at org.apache.maven.cli.MavenCli.execute(MavenCli.java:863)
18-Nov-2021 10:18:14         at org.apache.maven.cli.MavenCli.doMain(MavenCli.java:288)
18-Nov-2021 10:18:14         at org.apache.maven.cli.MavenCli.main(MavenCli.java:199)
18-Nov-2021 10:18:14         at sun.reflect.NativeMethodAccessorImpl.invoke0(Native Method)
18-Nov-2021 10:18:14         at sun.reflect.NativeMethodAccessorImpl.invoke(NativeMethodAccessorImpl.java:62)
18-Nov-2021 10:18:14         at sun.reflect.DelegatingMethodAccessorImpl.invoke(DelegatingMethodAccessorImpl.java:43)
18-Nov-2021 10:18:14         at java.lang.reflect.Method.invoke(Method.java:498)
18-Nov-2021 10:18:14         at org.codehaus.plexus.classworlds.launcher.Launcher.launchEnhanced(Launcher.java:289)
18-Nov-2021 10:18:14         at org.codehaus.plexus.classworlds.launcher.Launcher.launch(Launcher.java:229)
18-Nov-2021 10:18:14         at org.codehaus.plexus.classworlds.launcher.Launcher.mainWithExitCode(Launcher.java:415)
18-Nov-2021 10:18:14         at org.codehaus.plexus.classworlds.launcher.Launcher.main(Launcher.java:356)
18-Nov-2021 10:18:14 Caused by: org.apache.maven.plugin.MojoFailureException: There are test failures.
18-Nov-2021 10:18:14
18-Nov-2021 10:18:14 Please refer to /home/bamboo-agent/bamboo-agent/xml-data/build-dir/REFAPP-UI-FRAMEWORK/ui-tests/target/surefire-reports for the individual test results.
18-Nov-2021 10:18:14         at org.apache.maven.plugin.surefire.SurefireHelper.reportExecution(SurefireHelper.java:83)
18-Nov-2021 10:18:14         at org.apache.maven.plugin.surefire.SurefirePlugin.writeSummary(SurefirePlugin.java:673)
18-Nov-2021 10:18:14         at org.apache.maven.plugin.surefire.SurefirePlugin.handleSummary(SurefirePlugin.java:647)
18-Nov-2021 10:18:14         at org.apache.maven.plugin.surefire.AbstractSurefireMojo.executeAfterPreconditionsChecked(AbstractSurefireMojo.java:137)
18-Nov-2021 10:18:14         at org.apache.maven.plugin.surefire.AbstractSurefireMojo.execute(AbstractSurefireMojo.java:98)
18-Nov-2021 10:18:14         at org.apache.maven.plugin.DefaultBuildPluginManager.executeMojo(DefaultBuildPluginManager.java:134)
18-Nov-2021 10:18:14         at org.apache.maven.lifecycle.internal.MojoExecutor.execute(MojoExecutor.java:207)
18-Nov-2021 10:18:14         ... 20 more
18-Nov-2021 10:18:14 [ERROR]
18-Nov-2021 10:18:14 [ERROR] Re-run Maven using the -X switch to enable full debug logging.
18-Nov-2021 10:18:14 [ERROR]
18-Nov-2021 10:18:14 [ERROR] For more information about the errors and possible solutions, please read the following articles:
18-Nov-2021 10:18:14 [ERROR] [Help 1] http://cwiki.apache.org/confluence/display/MAVEN/MojoFailureException
18-Nov-2021 10:18:14 [ERROR]
18-Nov-2021 10:18:14 [ERROR] After correcting the problems, you can resume the build with the command
18-Nov-2021 10:18:14 [ERROR]   mvn <goals> -rf :referenceapplication-ui-tests
18-Nov-2021 10:18:15 Failing task since return code of [/usr/share/apache-maven-3.3.9/bin/mvn --batch-mode -Djava.io.tmpdir=/home/bamboo-agent/bamboo-agent/.agent_tmp/REFAPP-UI-FRAMEWORK clean install -DskipTests=false -e] was 1 while expected 0
18-Nov-2021 10:18:15 Parsing test results under /home/bamboo-agent/bamboo-agent/xml-data/build-dir/REFAPP-UI-FRAMEWORK...
18-Nov-2021 10:18:16 Finished task 'Build distribution' with result: Failed
18-Nov-2021 10:18:16 Running post build plugin 'Docker Container Cleanup'
18-Nov-2021 10:18:16 Running post build plugin 'NCover Results Collector'
18-Nov-2021 10:18:16 Running post build plugin 'Clover Results Collector'
18-Nov-2021 10:18:16 Running post build plugin 'Sauce OnDemand Post Runner'
18-Nov-2021 10:18:16 Running post build plugin 'npm Cache Cleanup'
18-Nov-2021 10:18:16 Running post build plugin 'Artifact Copier'
18-Nov-2021 10:18:16 Finalising the build...
18-Nov-2021 10:18:16 Stopping timer.
18-Nov-2021 10:18:16 Build REFAPP-UI-FRAMEWORK-733 completed.
18-Nov-2021 10:18:16 Running on server: post build plugin 'NCover Results Collector'
18-Nov-2021 10:18:16 Running on server: post build plugin 'Build Hanging Detection Configuration'
18-Nov-2021 10:18:16 Running on server: post build plugin 'Clover Delta Calculator'
18-Nov-2021 10:18:16 Running on server: post build plugin 'Maven Dependencies Postprocessor'
18-Nov-2021 10:18:16 All post build plugins have finished
18-Nov-2021 10:18:16 Generating build results summary...
18-Nov-2021 10:18:16 Saving build results to disk...
18-Nov-2021 10:18:16 Logging substituted variables...
18-Nov-2021 10:18:16 Indexing build results...
18-Nov-2021 10:18:16 Finished building REFAPP-UI-FRAMEWORK-733.