UI tests for the reference application

Build: #739 failed

Job: Run QA UI Tests failed

Stages & jobs

  1. Ref App UI Testing

Build log

The build generated 18,261 lines of output.The output is too long and has been truncated to the last 1,000 lines. Download or view full build log

22-Nov-2021 20:24:17 Failed to login in UnidentifiedPatientKeyboardTest.unidentifiedPatientKeyboardTest, trying again...
22-Nov-2021 20:24:17 Failed to login in UnidentifiedPatientKeyboardTest.unidentifiedPatientKeyboardTest, trying again...
22-Nov-2021 20:24:17 Failed to login in UnidentifiedPatientKeyboardTest.unidentifiedPatientKeyboardTest, trying again...
22-Nov-2021 20:24:17 Failed to login in UnidentifiedPatientKeyboardTest.unidentifiedPatientKeyboardTest, trying again...
22-Nov-2021 20:24:17 Failed to login in UnidentifiedPatientKeyboardTest.unidentifiedPatientKeyboardTest, trying again...
22-Nov-2021 20:24:17 Failed to login in UnidentifiedPatientKeyboardTest.unidentifiedPatientKeyboardTest, trying again...
22-Nov-2021 20:24:17 Failed to login in UnidentifiedPatientKeyboardTest.unidentifiedPatientKeyboardTest, trying again...
22-Nov-2021 20:24:17 Failed to login in UnidentifiedPatientKeyboardTest.unidentifiedPatientKeyboardTest, trying again...
22-Nov-2021 20:24:17 Failed to login in UnidentifiedPatientKeyboardTest.unidentifiedPatientKeyboardTest, trying again...
22-Nov-2021 20:24:17 Failed to login in UnidentifiedPatientKeyboardTest.unidentifiedPatientKeyboardTest, trying again...
22-Nov-2021 20:24:17 Failed to login in UnidentifiedPatientKeyboardTest.unidentifiedPatientKeyboardTest, trying again...
22-Nov-2021 20:24:17 Failed to login in UnidentifiedPatientKeyboardTest.unidentifiedPatientKeyboardTest, trying again...
22-Nov-2021 20:24:17 Failed to login in UnidentifiedPatientKeyboardTest.unidentifiedPatientKeyboardTest, trying again...
22-Nov-2021 20:24:17 Failed to login in UnidentifiedPatientKeyboardTest.unidentifiedPatientKeyboardTest, trying again...
22-Nov-2021 20:24:17 Failed to login in UnidentifiedPatientKeyboardTest.unidentifiedPatientKeyboardTest, trying again...
22-Nov-2021 20:24:17 Failed to login in UnidentifiedPatientKeyboardTest.unidentifiedPatientKeyboardTest, trying again...
22-Nov-2021 20:24:17 Failed to login in UnidentifiedPatientKeyboardTest.unidentifiedPatientKeyboardTest, trying again...
22-Nov-2021 20:24:17 Failed to login in UnidentifiedPatientKeyboardTest.unidentifiedPatientKeyboardTest, trying again...
22-Nov-2021 20:24:17 Failed to login in UnidentifiedPatientKeyboardTest.unidentifiedPatientKeyboardTest, trying again...
22-Nov-2021 20:24:17 Failed to login in UnidentifiedPatientKeyboardTest.unidentifiedPatientKeyboardTest, trying again...
22-Nov-2021 20:24:17 Failed to login in UnidentifiedPatientKeyboardTest.unidentifiedPatientKeyboardTest, trying again...
22-Nov-2021 20:24:18 Failed to login in UnidentifiedPatientKeyboardTest.unidentifiedPatientKeyboardTest, trying again...
22-Nov-2021 20:24:18 Failed to login in UnidentifiedPatientKeyboardTest.unidentifiedPatientKeyboardTest, trying again...
22-Nov-2021 20:24:18 Failed to login in UnidentifiedPatientKeyboardTest.unidentifiedPatientKeyboardTest, trying again...
22-Nov-2021 20:24:18 Failed to login in UnidentifiedPatientKeyboardTest.unidentifiedPatientKeyboardTest, trying again...
22-Nov-2021 20:24:18 Failed to login in UnidentifiedPatientKeyboardTest.unidentifiedPatientKeyboardTest, trying again...
22-Nov-2021 20:24:18 Failed to login in UnidentifiedPatientKeyboardTest.unidentifiedPatientKeyboardTest, trying again...
22-Nov-2021 20:24:18 Failed to login in UnidentifiedPatientKeyboardTest.unidentifiedPatientKeyboardTest, trying again...
22-Nov-2021 20:24:18 Failed to login in UnidentifiedPatientKeyboardTest.unidentifiedPatientKeyboardTest, trying again...
22-Nov-2021 20:24:18 Failed to login in UnidentifiedPatientKeyboardTest.unidentifiedPatientKeyboardTest, trying again...
22-Nov-2021 20:24:18 Failed to login in UnidentifiedPatientKeyboardTest.unidentifiedPatientKeyboardTest, trying again...
22-Nov-2021 20:24:18 Failed to login in UnidentifiedPatientKeyboardTest.unidentifiedPatientKeyboardTest, trying again...
22-Nov-2021 20:24:18 Failed to login in UnidentifiedPatientKeyboardTest.unidentifiedPatientKeyboardTest, trying again...
22-Nov-2021 20:24:18 Failed to login in UnidentifiedPatientKeyboardTest.unidentifiedPatientKeyboardTest, trying again...
22-Nov-2021 20:24:18 Failed to login in UnidentifiedPatientKeyboardTest.unidentifiedPatientKeyboardTest, trying again...
22-Nov-2021 20:24:18 Failed to login in UnidentifiedPatientKeyboardTest.unidentifiedPatientKeyboardTest, trying again...
22-Nov-2021 20:24:18 Failed to login in UnidentifiedPatientKeyboardTest.unidentifiedPatientKeyboardTest, trying again...
22-Nov-2021 20:24:18 Failed to login in UnidentifiedPatientKeyboardTest.unidentifiedPatientKeyboardTest, trying again...
22-Nov-2021 20:24:18 Failed to login in UnidentifiedPatientKeyboardTest.unidentifiedPatientKeyboardTest, trying again...
22-Nov-2021 20:24:18 Failed to login in UnidentifiedPatientKeyboardTest.unidentifiedPatientKeyboardTest, trying again...
22-Nov-2021 20:24:18 Failed to login in UnidentifiedPatientKeyboardTest.unidentifiedPatientKeyboardTest, trying again...
22-Nov-2021 20:24:18 Failed to login in UnidentifiedPatientKeyboardTest.unidentifiedPatientKeyboardTest, trying again...
22-Nov-2021 20:24:18 Failed to login in UnidentifiedPatientKeyboardTest.unidentifiedPatientKeyboardTest, trying again...
22-Nov-2021 20:24:18 Failed to login in UnidentifiedPatientKeyboardTest.unidentifiedPatientKeyboardTest, trying again...
22-Nov-2021 20:24:18 Failed to login in UnidentifiedPatientKeyboardTest.unidentifiedPatientKeyboardTest, trying again...
22-Nov-2021 20:24:18 Failed to login in UnidentifiedPatientKeyboardTest.unidentifiedPatientKeyboardTest, trying again...
22-Nov-2021 20:24:18 Failed to login in UnidentifiedPatientKeyboardTest.unidentifiedPatientKeyboardTest, trying again...
22-Nov-2021 20:24:18 Failed to login in UnidentifiedPatientKeyboardTest.unidentifiedPatientKeyboardTest, trying again...
22-Nov-2021 20:24:18 Failed to login in UnidentifiedPatientKeyboardTest.unidentifiedPatientKeyboardTest, trying again...
22-Nov-2021 20:24:18 Failed to login in UnidentifiedPatientKeyboardTest.unidentifiedPatientKeyboardTest, trying again...
22-Nov-2021 20:24:18 Failed to login in UnidentifiedPatientKeyboardTest.unidentifiedPatientKeyboardTest, trying again...
22-Nov-2021 20:24:18 Failed to login in UnidentifiedPatientKeyboardTest.unidentifiedPatientKeyboardTest, trying again...
22-Nov-2021 20:24:18 Failed to login in UnidentifiedPatientKeyboardTest.unidentifiedPatientKeyboardTest, trying again...
22-Nov-2021 20:24:18 Failed to login in UnidentifiedPatientKeyboardTest.unidentifiedPatientKeyboardTest, trying again...
22-Nov-2021 20:24:18 Failed to login in UnidentifiedPatientKeyboardTest.unidentifiedPatientKeyboardTest, trying again...
22-Nov-2021 20:24:18 Failed to login in UnidentifiedPatientKeyboardTest.unidentifiedPatientKeyboardTest, trying again...
22-Nov-2021 20:24:18 Failed to login in UnidentifiedPatientKeyboardTest.unidentifiedPatientKeyboardTest, trying again...
22-Nov-2021 20:24:18 Failed to login in UnidentifiedPatientKeyboardTest.unidentifiedPatientKeyboardTest, trying again...
22-Nov-2021 20:24:18 Failed to login in UnidentifiedPatientKeyboardTest.unidentifiedPatientKeyboardTest, trying again...
22-Nov-2021 20:24:18 Failed to login in UnidentifiedPatientKeyboardTest.unidentifiedPatientKeyboardTest, trying again...
22-Nov-2021 20:24:19 Failed to login in UnidentifiedPatientKeyboardTest.unidentifiedPatientKeyboardTest, trying again...
22-Nov-2021 20:24:19 Failed to login in UnidentifiedPatientKeyboardTest.unidentifiedPatientKeyboardTest, trying again...
22-Nov-2021 20:24:19 Failed to login in UnidentifiedPatientKeyboardTest.unidentifiedPatientKeyboardTest, trying again...
22-Nov-2021 20:24:19 Failed to login in UnidentifiedPatientKeyboardTest.unidentifiedPatientKeyboardTest, trying again...
22-Nov-2021 20:24:19 Failed to login in UnidentifiedPatientKeyboardTest.unidentifiedPatientKeyboardTest, trying again...
22-Nov-2021 20:24:19 Failed to login in UnidentifiedPatientKeyboardTest.unidentifiedPatientKeyboardTest, trying again...
22-Nov-2021 20:24:19 Failed to login in UnidentifiedPatientKeyboardTest.unidentifiedPatientKeyboardTest, trying again...
22-Nov-2021 20:24:19 Failed to login in UnidentifiedPatientKeyboardTest.unidentifiedPatientKeyboardTest, trying again...
22-Nov-2021 20:24:19 Failed to login in UnidentifiedPatientKeyboardTest.unidentifiedPatientKeyboardTest, trying again...
22-Nov-2021 20:24:19 Failed to login in UnidentifiedPatientKeyboardTest.unidentifiedPatientKeyboardTest, trying again...
22-Nov-2021 20:24:19 Failed to login in UnidentifiedPatientKeyboardTest.unidentifiedPatientKeyboardTest, trying again...
22-Nov-2021 20:24:19 Failed to login in UnidentifiedPatientKeyboardTest.unidentifiedPatientKeyboardTest, trying again...
22-Nov-2021 20:24:19 Failed to login in UnidentifiedPatientKeyboardTest.unidentifiedPatientKeyboardTest, trying again...
22-Nov-2021 20:24:19 Failed to login in UnidentifiedPatientKeyboardTest.unidentifiedPatientKeyboardTest, trying again...
22-Nov-2021 20:24:19 Failed to login in UnidentifiedPatientKeyboardTest.unidentifiedPatientKeyboardTest, trying again...
22-Nov-2021 20:24:19 Failed to login in UnidentifiedPatientKeyboardTest.unidentifiedPatientKeyboardTest, trying again...
22-Nov-2021 20:24:19 Failed to login in UnidentifiedPatientKeyboardTest.unidentifiedPatientKeyboardTest, trying again...
22-Nov-2021 20:24:19 Failed to login in UnidentifiedPatientKeyboardTest.unidentifiedPatientKeyboardTest, trying again...
22-Nov-2021 20:24:19 Failed to login in UnidentifiedPatientKeyboardTest.unidentifiedPatientKeyboardTest, trying again...
22-Nov-2021 20:24:19 Failed to login in UnidentifiedPatientKeyboardTest.unidentifiedPatientKeyboardTest, trying again...
22-Nov-2021 20:24:19 Failed to login in UnidentifiedPatientKeyboardTest.unidentifiedPatientKeyboardTest, trying again...
22-Nov-2021 20:24:19 Failed to login in UnidentifiedPatientKeyboardTest.unidentifiedPatientKeyboardTest, trying again...
22-Nov-2021 20:24:19 Failed to login in UnidentifiedPatientKeyboardTest.unidentifiedPatientKeyboardTest, trying again...
22-Nov-2021 20:24:19 Failed to login in UnidentifiedPatientKeyboardTest.unidentifiedPatientKeyboardTest, trying again...
22-Nov-2021 20:24:19 Failed to login in UnidentifiedPatientKeyboardTest.unidentifiedPatientKeyboardTest, trying again...
22-Nov-2021 20:24:19 Failed to login in UnidentifiedPatientKeyboardTest.unidentifiedPatientKeyboardTest, trying again...
22-Nov-2021 20:24:19 Failed to login in UnidentifiedPatientKeyboardTest.unidentifiedPatientKeyboardTest, trying again...
22-Nov-2021 20:24:20 Failed to login in UnidentifiedPatientKeyboardTest.unidentifiedPatientKeyboardTest, trying again...
22-Nov-2021 20:24:20 Failed to login in UnidentifiedPatientKeyboardTest.unidentifiedPatientKeyboardTest, trying again...
22-Nov-2021 20:24:20 Failed to login in UnidentifiedPatientKeyboardTest.unidentifiedPatientKeyboardTest, trying again...
22-Nov-2021 20:24:20 Failed to login in UnidentifiedPatientKeyboardTest.unidentifiedPatientKeyboardTest, trying again...
22-Nov-2021 20:24:20 Failed to login in UnidentifiedPatientKeyboardTest.unidentifiedPatientKeyboardTest, trying again...
22-Nov-2021 20:24:20 Failed to login in UnidentifiedPatientKeyboardTest.unidentifiedPatientKeyboardTest, trying again...
22-Nov-2021 20:24:20 Failed to login in UnidentifiedPatientKeyboardTest.unidentifiedPatientKeyboardTest, trying again...
22-Nov-2021 20:24:20 Failed to login in UnidentifiedPatientKeyboardTest.unidentifiedPatientKeyboardTest, trying again...
22-Nov-2021 20:24:20 Failed to login in UnidentifiedPatientKeyboardTest.unidentifiedPatientKeyboardTest, trying again...
22-Nov-2021 20:24:20 Failed to login in UnidentifiedPatientKeyboardTest.unidentifiedPatientKeyboardTest, trying again...
22-Nov-2021 20:24:20 Failed to login in UnidentifiedPatientKeyboardTest.unidentifiedPatientKeyboardTest, trying again...
22-Nov-2021 20:24:20 Failed to login in UnidentifiedPatientKeyboardTest.unidentifiedPatientKeyboardTest, trying again...
22-Nov-2021 20:24:20 Failed to login in UnidentifiedPatientKeyboardTest.unidentifiedPatientKeyboardTest, trying again...
22-Nov-2021 20:24:20 Failed to login in UnidentifiedPatientKeyboardTest.unidentifiedPatientKeyboardTest, trying again...
22-Nov-2021 20:24:20 Failed to login in UnidentifiedPatientKeyboardTest.unidentifiedPatientKeyboardTest, trying again...
22-Nov-2021 20:24:20 Failed to login in UnidentifiedPatientKeyboardTest.unidentifiedPatientKeyboardTest, trying again...
22-Nov-2021 20:24:20 Failed to login in UnidentifiedPatientKeyboardTest.unidentifiedPatientKeyboardTest, trying again...
22-Nov-2021 20:24:20 Failed to login in UnidentifiedPatientKeyboardTest.unidentifiedPatientKeyboardTest, trying again...
22-Nov-2021 20:24:20 Failed to login in UnidentifiedPatientKeyboardTest.unidentifiedPatientKeyboardTest, trying again...
22-Nov-2021 20:24:20 Failed to login in UnidentifiedPatientKeyboardTest.unidentifiedPatientKeyboardTest, trying again...
22-Nov-2021 20:24:20 Failed to login in UnidentifiedPatientKeyboardTest.unidentifiedPatientKeyboardTest, trying again...
22-Nov-2021 20:24:20 Failed to login in UnidentifiedPatientKeyboardTest.unidentifiedPatientKeyboardTest, trying again...
22-Nov-2021 20:24:20 Failed to login in UnidentifiedPatientKeyboardTest.unidentifiedPatientKeyboardTest, trying again...
22-Nov-2021 20:24:20 Failed to login in UnidentifiedPatientKeyboardTest.unidentifiedPatientKeyboardTest, trying again...
22-Nov-2021 20:24:20 Failed to login in UnidentifiedPatientKeyboardTest.unidentifiedPatientKeyboardTest, trying again...
22-Nov-2021 20:24:20 Failed to login in UnidentifiedPatientKeyboardTest.unidentifiedPatientKeyboardTest, trying again...
22-Nov-2021 20:24:20 Failed to login in UnidentifiedPatientKeyboardTest.unidentifiedPatientKeyboardTest, trying again...
22-Nov-2021 20:24:20 Failed to login in UnidentifiedPatientKeyboardTest.unidentifiedPatientKeyboardTest, trying again...
22-Nov-2021 20:24:21 Failed to login in UnidentifiedPatientKeyboardTest.unidentifiedPatientKeyboardTest, trying again...
22-Nov-2021 20:24:21 Failed to login in UnidentifiedPatientKeyboardTest.unidentifiedPatientKeyboardTest, trying again...
22-Nov-2021 20:24:21 Failed to login in UnidentifiedPatientKeyboardTest.unidentifiedPatientKeyboardTest, trying again...
22-Nov-2021 20:24:21 Failed to login in UnidentifiedPatientKeyboardTest.unidentifiedPatientKeyboardTest, trying again...
22-Nov-2021 20:24:21 Failed to login in UnidentifiedPatientKeyboardTest.unidentifiedPatientKeyboardTest, trying again...
22-Nov-2021 20:24:21 Failed to login in UnidentifiedPatientKeyboardTest.unidentifiedPatientKeyboardTest, trying again...
22-Nov-2021 20:24:21 Failed to login in UnidentifiedPatientKeyboardTest.unidentifiedPatientKeyboardTest, trying again...
22-Nov-2021 20:24:21 Failed to login in UnidentifiedPatientKeyboardTest.unidentifiedPatientKeyboardTest, trying again...
22-Nov-2021 20:24:21 Failed to login in UnidentifiedPatientKeyboardTest.unidentifiedPatientKeyboardTest, trying again...
22-Nov-2021 20:24:21 Failed to login in UnidentifiedPatientKeyboardTest.unidentifiedPatientKeyboardTest, trying again...
22-Nov-2021 20:24:21 Failed to login in UnidentifiedPatientKeyboardTest.unidentifiedPatientKeyboardTest, trying again...
22-Nov-2021 20:24:21 Failed to login in UnidentifiedPatientKeyboardTest.unidentifiedPatientKeyboardTest, trying again...
22-Nov-2021 20:24:21 Failed to login in UnidentifiedPatientKeyboardTest.unidentifiedPatientKeyboardTest, trying again...
22-Nov-2021 20:24:21 Failed to login in UnidentifiedPatientKeyboardTest.unidentifiedPatientKeyboardTest, trying again...
22-Nov-2021 20:24:21 Failed to login in UnidentifiedPatientKeyboardTest.unidentifiedPatientKeyboardTest, trying again...
22-Nov-2021 20:24:21 Failed to login in UnidentifiedPatientKeyboardTest.unidentifiedPatientKeyboardTest, trying again...
22-Nov-2021 20:24:21 Failed to login in UnidentifiedPatientKeyboardTest.unidentifiedPatientKeyboardTest, trying again...
22-Nov-2021 20:24:21 Failed to login in UnidentifiedPatientKeyboardTest.unidentifiedPatientKeyboardTest, trying again...
22-Nov-2021 20:24:21 Failed to login in UnidentifiedPatientKeyboardTest.unidentifiedPatientKeyboardTest, trying again...
22-Nov-2021 20:24:21 Failed to login in UnidentifiedPatientKeyboardTest.unidentifiedPatientKeyboardTest, trying again...
22-Nov-2021 20:24:21 Failed to login in UnidentifiedPatientKeyboardTest.unidentifiedPatientKeyboardTest, trying again...
22-Nov-2021 20:24:21 Failed to login in UnidentifiedPatientKeyboardTest.unidentifiedPatientKeyboardTest, trying again...
22-Nov-2021 20:24:21 Failed to login in UnidentifiedPatientKeyboardTest.unidentifiedPatientKeyboardTest, trying again...
22-Nov-2021 20:24:21 Failed to login in UnidentifiedPatientKeyboardTest.unidentifiedPatientKeyboardTest, trying again...
22-Nov-2021 20:24:21 Failed to login in UnidentifiedPatientKeyboardTest.unidentifiedPatientKeyboardTest, trying again...
22-Nov-2021 20:24:21 Failed to login in UnidentifiedPatientKeyboardTest.unidentifiedPatientKeyboardTest, trying again...
22-Nov-2021 20:24:21 Failed to login in UnidentifiedPatientKeyboardTest.unidentifiedPatientKeyboardTest, trying again...
22-Nov-2021 20:24:21 Failed to login in UnidentifiedPatientKeyboardTest.unidentifiedPatientKeyboardTest, trying again...
22-Nov-2021 20:24:21 Failed to login in UnidentifiedPatientKeyboardTest.unidentifiedPatientKeyboardTest, trying again...
22-Nov-2021 20:24:21 Failed to login in UnidentifiedPatientKeyboardTest.unidentifiedPatientKeyboardTest, trying again...
22-Nov-2021 20:24:22 Failed to login in UnidentifiedPatientKeyboardTest.unidentifiedPatientKeyboardTest, trying again...
22-Nov-2021 20:24:22 Failed to login in UnidentifiedPatientKeyboardTest.unidentifiedPatientKeyboardTest, trying again...
22-Nov-2021 20:24:22 Failed to login in UnidentifiedPatientKeyboardTest.unidentifiedPatientKeyboardTest, trying again...
22-Nov-2021 20:24:22 Failed to login in UnidentifiedPatientKeyboardTest.unidentifiedPatientKeyboardTest, trying again...
22-Nov-2021 20:24:22 Failed to login in UnidentifiedPatientKeyboardTest.unidentifiedPatientKeyboardTest, trying again...
22-Nov-2021 20:24:22 Failed to login in UnidentifiedPatientKeyboardTest.unidentifiedPatientKeyboardTest, trying again...
22-Nov-2021 20:24:22 Failed to login in UnidentifiedPatientKeyboardTest.unidentifiedPatientKeyboardTest, trying again...
22-Nov-2021 20:24:22 Failed to login in UnidentifiedPatientKeyboardTest.unidentifiedPatientKeyboardTest, trying again...
22-Nov-2021 20:24:22 Failed to login in UnidentifiedPatientKeyboardTest.unidentifiedPatientKeyboardTest, trying again...
22-Nov-2021 20:24:22 Failed to login in UnidentifiedPatientKeyboardTest.unidentifiedPatientKeyboardTest, trying again...
22-Nov-2021 20:24:22 Failed to login in UnidentifiedPatientKeyboardTest.unidentifiedPatientKeyboardTest, trying again...
22-Nov-2021 20:24:22 Failed to login in UnidentifiedPatientKeyboardTest.unidentifiedPatientKeyboardTest, trying again...
22-Nov-2021 20:24:22 Failed to login in UnidentifiedPatientKeyboardTest.unidentifiedPatientKeyboardTest, trying again...
22-Nov-2021 20:24:22 Failed to login in UnidentifiedPatientKeyboardTest.unidentifiedPatientKeyboardTest, trying again...
22-Nov-2021 20:24:22 Failed to login in UnidentifiedPatientKeyboardTest.unidentifiedPatientKeyboardTest, trying again...
22-Nov-2021 20:24:22 Failed to login in UnidentifiedPatientKeyboardTest.unidentifiedPatientKeyboardTest, trying again...
22-Nov-2021 20:24:22 Failed to login in UnidentifiedPatientKeyboardTest.unidentifiedPatientKeyboardTest, trying again...
22-Nov-2021 20:24:22 Failed to login in UnidentifiedPatientKeyboardTest.unidentifiedPatientKeyboardTest, trying again...
22-Nov-2021 20:24:22 Failed to login in UnidentifiedPatientKeyboardTest.unidentifiedPatientKeyboardTest, trying again...
22-Nov-2021 20:24:22 Failed to login in UnidentifiedPatientKeyboardTest.unidentifiedPatientKeyboardTest, trying again...
22-Nov-2021 20:24:22 Failed to login in UnidentifiedPatientKeyboardTest.unidentifiedPatientKeyboardTest, trying again...
22-Nov-2021 20:24:22 Failed to login in UnidentifiedPatientKeyboardTest.unidentifiedPatientKeyboardTest, trying again...
22-Nov-2021 20:24:22 Failed to login in UnidentifiedPatientKeyboardTest.unidentifiedPatientKeyboardTest, trying again...
22-Nov-2021 20:24:22 Failed to login in UnidentifiedPatientKeyboardTest.unidentifiedPatientKeyboardTest, trying again...
22-Nov-2021 20:24:22 Failed to login in UnidentifiedPatientKeyboardTest.unidentifiedPatientKeyboardTest, trying again...
22-Nov-2021 20:24:22 Failed to login in UnidentifiedPatientKeyboardTest.unidentifiedPatientKeyboardTest, trying again...
22-Nov-2021 20:24:22 Failed to login in UnidentifiedPatientKeyboardTest.unidentifiedPatientKeyboardTest, trying again...
22-Nov-2021 20:24:22 Failed to login in UnidentifiedPatientKeyboardTest.unidentifiedPatientKeyboardTest, trying again...
22-Nov-2021 20:24:22 Failed to login in UnidentifiedPatientKeyboardTest.unidentifiedPatientKeyboardTest, trying again...
22-Nov-2021 20:24:22 Failed to login in UnidentifiedPatientKeyboardTest.unidentifiedPatientKeyboardTest, trying again...
22-Nov-2021 20:24:23 Failed to login in UnidentifiedPatientKeyboardTest.unidentifiedPatientKeyboardTest, trying again...
22-Nov-2021 20:24:23 Failed to login in UnidentifiedPatientKeyboardTest.unidentifiedPatientKeyboardTest, trying again...
22-Nov-2021 20:24:23 Failed to login in UnidentifiedPatientKeyboardTest.unidentifiedPatientKeyboardTest, trying again...
22-Nov-2021 20:24:23 Failed to login in UnidentifiedPatientKeyboardTest.unidentifiedPatientKeyboardTest, trying again...
22-Nov-2021 20:24:23 Failed to login in UnidentifiedPatientKeyboardTest.unidentifiedPatientKeyboardTest, trying again...
22-Nov-2021 20:24:23 Failed to login in UnidentifiedPatientKeyboardTest.unidentifiedPatientKeyboardTest, trying again...
22-Nov-2021 20:24:23 Failed to login in UnidentifiedPatientKeyboardTest.unidentifiedPatientKeyboardTest, trying again...
22-Nov-2021 20:24:23 Failed to login in UnidentifiedPatientKeyboardTest.unidentifiedPatientKeyboardTest, trying again...
22-Nov-2021 20:24:23 Failed to login in UnidentifiedPatientKeyboardTest.unidentifiedPatientKeyboardTest, trying again...
22-Nov-2021 20:24:23 Failed to login in UnidentifiedPatientKeyboardTest.unidentifiedPatientKeyboardTest, trying again...
22-Nov-2021 20:24:23 Failed to login in UnidentifiedPatientKeyboardTest.unidentifiedPatientKeyboardTest, trying again...
22-Nov-2021 20:24:23 Failed to login in UnidentifiedPatientKeyboardTest.unidentifiedPatientKeyboardTest, trying again...
22-Nov-2021 20:24:23 Failed to login in UnidentifiedPatientKeyboardTest.unidentifiedPatientKeyboardTest, trying again...
22-Nov-2021 20:24:23 Failed to login in UnidentifiedPatientKeyboardTest.unidentifiedPatientKeyboardTest, trying again...
22-Nov-2021 20:24:23 Failed to login in UnidentifiedPatientKeyboardTest.unidentifiedPatientKeyboardTest, trying again...
22-Nov-2021 20:24:23 Failed to login in UnidentifiedPatientKeyboardTest.unidentifiedPatientKeyboardTest, trying again...
22-Nov-2021 20:24:23 Failed to login in UnidentifiedPatientKeyboardTest.unidentifiedPatientKeyboardTest, trying again...
22-Nov-2021 20:24:23 Failed to login in UnidentifiedPatientKeyboardTest.unidentifiedPatientKeyboardTest, trying again...
22-Nov-2021 20:24:23 Failed to login in UnidentifiedPatientKeyboardTest.unidentifiedPatientKeyboardTest, trying again...
22-Nov-2021 20:24:23 Failed to login in UnidentifiedPatientKeyboardTest.unidentifiedPatientKeyboardTest, trying again...
22-Nov-2021 20:24:23 Failed to login in UnidentifiedPatientKeyboardTest.unidentifiedPatientKeyboardTest, trying again...
22-Nov-2021 20:24:23 Failed to login in UnidentifiedPatientKeyboardTest.unidentifiedPatientKeyboardTest, trying again...
22-Nov-2021 20:24:23 Failed to login in UnidentifiedPatientKeyboardTest.unidentifiedPatientKeyboardTest, trying again...
22-Nov-2021 20:24:23 Failed to login in UnidentifiedPatientKeyboardTest.unidentifiedPatientKeyboardTest, trying again...
22-Nov-2021 20:24:23 Failed to login in UnidentifiedPatientKeyboardTest.unidentifiedPatientKeyboardTest, trying again...
22-Nov-2021 20:24:23 Failed to login in UnidentifiedPatientKeyboardTest.unidentifiedPatientKeyboardTest, trying again...
22-Nov-2021 20:24:23 Failed to login in UnidentifiedPatientKeyboardTest.unidentifiedPatientKeyboardTest, trying again...
22-Nov-2021 20:24:23 Failed to login in UnidentifiedPatientKeyboardTest.unidentifiedPatientKeyboardTest, trying again...
22-Nov-2021 20:24:23 Failed to login in UnidentifiedPatientKeyboardTest.unidentifiedPatientKeyboardTest, trying again...
22-Nov-2021 20:24:23 Failed to login in UnidentifiedPatientKeyboardTest.unidentifiedPatientKeyboardTest, trying again...
22-Nov-2021 20:24:23 Failed to login in UnidentifiedPatientKeyboardTest.unidentifiedPatientKeyboardTest, trying again...
22-Nov-2021 20:24:23 Failed to login in UnidentifiedPatientKeyboardTest.unidentifiedPatientKeyboardTest, trying again...
22-Nov-2021 20:24:24 Failed to login in UnidentifiedPatientKeyboardTest.unidentifiedPatientKeyboardTest, trying again...
22-Nov-2021 20:24:24 Failed to login in UnidentifiedPatientKeyboardTest.unidentifiedPatientKeyboardTest, trying again...
22-Nov-2021 20:24:24 Failed to login in UnidentifiedPatientKeyboardTest.unidentifiedPatientKeyboardTest, trying again...
22-Nov-2021 20:24:24 Failed to login in UnidentifiedPatientKeyboardTest.unidentifiedPatientKeyboardTest, trying again...
22-Nov-2021 20:24:24 Failed to login in UnidentifiedPatientKeyboardTest.unidentifiedPatientKeyboardTest, trying again...
22-Nov-2021 20:24:24 Failed to login in UnidentifiedPatientKeyboardTest.unidentifiedPatientKeyboardTest, trying again...
22-Nov-2021 20:24:24 Failed to login in UnidentifiedPatientKeyboardTest.unidentifiedPatientKeyboardTest, trying again...
22-Nov-2021 20:24:24 Failed to login in UnidentifiedPatientKeyboardTest.unidentifiedPatientKeyboardTest, trying again...
22-Nov-2021 20:24:24 Failed to login in UnidentifiedPatientKeyboardTest.unidentifiedPatientKeyboardTest, trying again...
22-Nov-2021 20:24:24 Failed to login in UnidentifiedPatientKeyboardTest.unidentifiedPatientKeyboardTest, trying again...
22-Nov-2021 20:24:24 Failed to login in UnidentifiedPatientKeyboardTest.unidentifiedPatientKeyboardTest, trying again...
22-Nov-2021 20:24:24 Failed to login in UnidentifiedPatientKeyboardTest.unidentifiedPatientKeyboardTest, trying again...
22-Nov-2021 20:24:24 Failed to login in UnidentifiedPatientKeyboardTest.unidentifiedPatientKeyboardTest, trying again...
22-Nov-2021 20:24:24 Failed to login in UnidentifiedPatientKeyboardTest.unidentifiedPatientKeyboardTest, trying again...
22-Nov-2021 20:24:24 Failed to login in UnidentifiedPatientKeyboardTest.unidentifiedPatientKeyboardTest, trying again...
22-Nov-2021 20:24:24 Failed to login in UnidentifiedPatientKeyboardTest.unidentifiedPatientKeyboardTest, trying again...
22-Nov-2021 20:24:24 Failed to login in UnidentifiedPatientKeyboardTest.unidentifiedPatientKeyboardTest, trying again...
22-Nov-2021 20:24:24 Failed to login in UnidentifiedPatientKeyboardTest.unidentifiedPatientKeyboardTest, trying again...
22-Nov-2021 20:24:24 Failed to login in UnidentifiedPatientKeyboardTest.unidentifiedPatientKeyboardTest, trying again...
22-Nov-2021 20:24:24 Failed to login in UnidentifiedPatientKeyboardTest.unidentifiedPatientKeyboardTest, trying again...
22-Nov-2021 20:24:24 Failed to login in UnidentifiedPatientKeyboardTest.unidentifiedPatientKeyboardTest, trying again...
22-Nov-2021 20:24:24 Failed to login in UnidentifiedPatientKeyboardTest.unidentifiedPatientKeyboardTest, trying again...
22-Nov-2021 20:24:24 Failed to login in UnidentifiedPatientKeyboardTest.unidentifiedPatientKeyboardTest, trying again...
22-Nov-2021 20:24:24 Failed to login in UnidentifiedPatientKeyboardTest.unidentifiedPatientKeyboardTest, trying again...
22-Nov-2021 20:24:24 Failed to login in UnidentifiedPatientKeyboardTest.unidentifiedPatientKeyboardTest, trying again...
22-Nov-2021 20:24:24 Failed to login in UnidentifiedPatientKeyboardTest.unidentifiedPatientKeyboardTest, trying again...
22-Nov-2021 20:24:24 Failed to login in UnidentifiedPatientKeyboardTest.unidentifiedPatientKeyboardTest, trying again...
22-Nov-2021 20:24:24 Failed to login in UnidentifiedPatientKeyboardTest.unidentifiedPatientKeyboardTest, trying again...
22-Nov-2021 20:24:24 Failed to login in UnidentifiedPatientKeyboardTest.unidentifiedPatientKeyboardTest, trying again...
22-Nov-2021 20:24:24 Failed to login in UnidentifiedPatientKeyboardTest.unidentifiedPatientKeyboardTest, trying again...
22-Nov-2021 20:24:25 Failed to login in UnidentifiedPatientKeyboardTest.unidentifiedPatientKeyboardTest, trying again...
22-Nov-2021 20:24:25 Failed to login in UnidentifiedPatientKeyboardTest.unidentifiedPatientKeyboardTest, trying again...
22-Nov-2021 20:24:25 Failed to login in UnidentifiedPatientKeyboardTest.unidentifiedPatientKeyboardTest, trying again...
22-Nov-2021 20:24:25 Failed to login in UnidentifiedPatientKeyboardTest.unidentifiedPatientKeyboardTest, trying again...
22-Nov-2021 20:24:25 Failed to login in UnidentifiedPatientKeyboardTest.unidentifiedPatientKeyboardTest, trying again...
22-Nov-2021 20:24:25 Failed to login in UnidentifiedPatientKeyboardTest.unidentifiedPatientKeyboardTest, trying again...
22-Nov-2021 20:24:25 Failed to login in UnidentifiedPatientKeyboardTest.unidentifiedPatientKeyboardTest, trying again...
22-Nov-2021 20:24:25 Failed to login in UnidentifiedPatientKeyboardTest.unidentifiedPatientKeyboardTest, trying again...
22-Nov-2021 20:24:25 Failed to login in UnidentifiedPatientKeyboardTest.unidentifiedPatientKeyboardTest, trying again...
22-Nov-2021 20:24:25 Failed to login in UnidentifiedPatientKeyboardTest.unidentifiedPatientKeyboardTest, trying again...
22-Nov-2021 20:24:25 Failed to login in UnidentifiedPatientKeyboardTest.unidentifiedPatientKeyboardTest, trying again...
22-Nov-2021 20:24:25 Failed to login in UnidentifiedPatientKeyboardTest.unidentifiedPatientKeyboardTest, trying again...
22-Nov-2021 20:24:25 Failed to login in UnidentifiedPatientKeyboardTest.unidentifiedPatientKeyboardTest, trying again...
22-Nov-2021 20:24:25 Failed to login in UnidentifiedPatientKeyboardTest.unidentifiedPatientKeyboardTest, trying again...
22-Nov-2021 20:24:25 Failed to login in UnidentifiedPatientKeyboardTest.unidentifiedPatientKeyboardTest, trying again...
22-Nov-2021 20:24:25 Failed to login in UnidentifiedPatientKeyboardTest.unidentifiedPatientKeyboardTest, trying again...
22-Nov-2021 20:24:25 Failed to login in UnidentifiedPatientKeyboardTest.unidentifiedPatientKeyboardTest, trying again...
22-Nov-2021 20:24:25 Failed to login in UnidentifiedPatientKeyboardTest.unidentifiedPatientKeyboardTest, trying again...
22-Nov-2021 20:24:25 Failed to login in UnidentifiedPatientKeyboardTest.unidentifiedPatientKeyboardTest, trying again...
22-Nov-2021 20:24:25 Failed to login in UnidentifiedPatientKeyboardTest.unidentifiedPatientKeyboardTest, trying again...
22-Nov-2021 20:24:25 Failed to login in UnidentifiedPatientKeyboardTest.unidentifiedPatientKeyboardTest, trying again...
22-Nov-2021 20:24:25 Failed to login in UnidentifiedPatientKeyboardTest.unidentifiedPatientKeyboardTest, trying again...
22-Nov-2021 20:24:25 Failed to login in UnidentifiedPatientKeyboardTest.unidentifiedPatientKeyboardTest, trying again...
22-Nov-2021 20:24:25 Failed to login in UnidentifiedPatientKeyboardTest.unidentifiedPatientKeyboardTest, trying again...
22-Nov-2021 20:24:25 Failed to login in UnidentifiedPatientKeyboardTest.unidentifiedPatientKeyboardTest, trying again...
22-Nov-2021 20:24:25 Failed to login in UnidentifiedPatientKeyboardTest.unidentifiedPatientKeyboardTest, trying again...
22-Nov-2021 20:24:25 Failed to login in UnidentifiedPatientKeyboardTest.unidentifiedPatientKeyboardTest, trying again...
22-Nov-2021 20:24:25 Failed to login in UnidentifiedPatientKeyboardTest.unidentifiedPatientKeyboardTest, trying again...
22-Nov-2021 20:24:25 Failed to login in UnidentifiedPatientKeyboardTest.unidentifiedPatientKeyboardTest, trying again...
22-Nov-2021 20:24:25 Failed to login in UnidentifiedPatientKeyboardTest.unidentifiedPatientKeyboardTest, trying again...
22-Nov-2021 20:24:25 Failed to login in UnidentifiedPatientKeyboardTest.unidentifiedPatientKeyboardTest, trying again...
22-Nov-2021 20:24:25 Failed to login in UnidentifiedPatientKeyboardTest.unidentifiedPatientKeyboardTest, trying again...
22-Nov-2021 20:24:25 Failed to login in UnidentifiedPatientKeyboardTest.unidentifiedPatientKeyboardTest, trying again...
22-Nov-2021 20:24:26 Failed to login in UnidentifiedPatientKeyboardTest.unidentifiedPatientKeyboardTest, trying again...
22-Nov-2021 20:24:26 Failed to login in UnidentifiedPatientKeyboardTest.unidentifiedPatientKeyboardTest, trying again...
22-Nov-2021 20:24:26 Failed to login in UnidentifiedPatientKeyboardTest.unidentifiedPatientKeyboardTest, trying again...
22-Nov-2021 20:24:26 Failed to login in UnidentifiedPatientKeyboardTest.unidentifiedPatientKeyboardTest, trying again...
22-Nov-2021 20:24:26 Failed to login in UnidentifiedPatientKeyboardTest.unidentifiedPatientKeyboardTest, trying again...
22-Nov-2021 20:24:26 Failed to login in UnidentifiedPatientKeyboardTest.unidentifiedPatientKeyboardTest, trying again...
22-Nov-2021 20:24:26 Failed to login in UnidentifiedPatientKeyboardTest.unidentifiedPatientKeyboardTest, trying again...
22-Nov-2021 20:24:26 Failed to login in UnidentifiedPatientKeyboardTest.unidentifiedPatientKeyboardTest, trying again...
22-Nov-2021 20:24:26 Failed to login in UnidentifiedPatientKeyboardTest.unidentifiedPatientKeyboardTest, trying again...
22-Nov-2021 20:24:26 Failed to login in UnidentifiedPatientKeyboardTest.unidentifiedPatientKeyboardTest, trying again...
22-Nov-2021 20:24:26 Failed to login in UnidentifiedPatientKeyboardTest.unidentifiedPatientKeyboardTest, trying again...
22-Nov-2021 20:24:26 Failed to login in UnidentifiedPatientKeyboardTest.unidentifiedPatientKeyboardTest, trying again...
22-Nov-2021 20:24:26 Failed to login in UnidentifiedPatientKeyboardTest.unidentifiedPatientKeyboardTest, trying again...
22-Nov-2021 20:24:26 Failed to login in UnidentifiedPatientKeyboardTest.unidentifiedPatientKeyboardTest, trying again...
22-Nov-2021 20:24:26 Failed to login in UnidentifiedPatientKeyboardTest.unidentifiedPatientKeyboardTest, trying again...
22-Nov-2021 20:24:26 Failed to login in UnidentifiedPatientKeyboardTest.unidentifiedPatientKeyboardTest, trying again...
22-Nov-2021 20:24:26 Failed to login in UnidentifiedPatientKeyboardTest.unidentifiedPatientKeyboardTest, trying again...
22-Nov-2021 20:24:26 Failed to login in UnidentifiedPatientKeyboardTest.unidentifiedPatientKeyboardTest, trying again...
22-Nov-2021 20:24:26 Failed to login in UnidentifiedPatientKeyboardTest.unidentifiedPatientKeyboardTest, trying again...
22-Nov-2021 20:24:26 Failed to login in UnidentifiedPatientKeyboardTest.unidentifiedPatientKeyboardTest, trying again...
22-Nov-2021 20:24:26 Failed to login in UnidentifiedPatientKeyboardTest.unidentifiedPatientKeyboardTest, trying again...
22-Nov-2021 20:24:26 Failed to login in UnidentifiedPatientKeyboardTest.unidentifiedPatientKeyboardTest, trying again...
22-Nov-2021 20:24:26 Failed to login in UnidentifiedPatientKeyboardTest.unidentifiedPatientKeyboardTest, trying again...
22-Nov-2021 20:24:26 Failed to login in UnidentifiedPatientKeyboardTest.unidentifiedPatientKeyboardTest, trying again...
22-Nov-2021 20:24:26 Failed to login in UnidentifiedPatientKeyboardTest.unidentifiedPatientKeyboardTest, trying again...
22-Nov-2021 20:24:26 Failed to login in UnidentifiedPatientKeyboardTest.unidentifiedPatientKeyboardTest, trying again...
22-Nov-2021 20:24:26 Failed to login in UnidentifiedPatientKeyboardTest.unidentifiedPatientKeyboardTest, trying again...
22-Nov-2021 20:24:27 Failed to login in UnidentifiedPatientKeyboardTest.unidentifiedPatientKeyboardTest, trying again...
22-Nov-2021 20:24:27 Failed to login in UnidentifiedPatientKeyboardTest.unidentifiedPatientKeyboardTest, trying again...
22-Nov-2021 20:24:27 Failed to login in UnidentifiedPatientKeyboardTest.unidentifiedPatientKeyboardTest, trying again...
22-Nov-2021 20:24:27 Failed to login in UnidentifiedPatientKeyboardTest.unidentifiedPatientKeyboardTest, trying again...
22-Nov-2021 20:24:27 Failed to login in UnidentifiedPatientKeyboardTest.unidentifiedPatientKeyboardTest, trying again...
22-Nov-2021 20:24:27 Failed to login in UnidentifiedPatientKeyboardTest.unidentifiedPatientKeyboardTest, trying again...
22-Nov-2021 20:24:27 Failed to login in UnidentifiedPatientKeyboardTest.unidentifiedPatientKeyboardTest, trying again...
22-Nov-2021 20:24:27 Failed to login in UnidentifiedPatientKeyboardTest.unidentifiedPatientKeyboardTest, trying again...
22-Nov-2021 20:24:27 Failed to login in UnidentifiedPatientKeyboardTest.unidentifiedPatientKeyboardTest, trying again...
22-Nov-2021 20:24:27 Failed to login in UnidentifiedPatientKeyboardTest.unidentifiedPatientKeyboardTest, trying again...
22-Nov-2021 20:24:27 Failed to login in UnidentifiedPatientKeyboardTest.unidentifiedPatientKeyboardTest, trying again...
22-Nov-2021 20:24:27 Failed to login in UnidentifiedPatientKeyboardTest.unidentifiedPatientKeyboardTest, trying again...
22-Nov-2021 20:24:27 Failed to login in UnidentifiedPatientKeyboardTest.unidentifiedPatientKeyboardTest, trying again...
22-Nov-2021 20:24:27 Failed to login in UnidentifiedPatientKeyboardTest.unidentifiedPatientKeyboardTest, trying again...
22-Nov-2021 20:24:27 Failed to login in UnidentifiedPatientKeyboardTest.unidentifiedPatientKeyboardTest, trying again...
22-Nov-2021 20:24:27 Failed to login in UnidentifiedPatientKeyboardTest.unidentifiedPatientKeyboardTest, trying again...
22-Nov-2021 20:24:27 Failed to login in UnidentifiedPatientKeyboardTest.unidentifiedPatientKeyboardTest, trying again...
22-Nov-2021 20:24:27 Failed to login in UnidentifiedPatientKeyboardTest.unidentifiedPatientKeyboardTest, trying again...
22-Nov-2021 20:24:27 Failed to login in UnidentifiedPatientKeyboardTest.unidentifiedPatientKeyboardTest, trying again...
22-Nov-2021 20:24:27 Failed to login in UnidentifiedPatientKeyboardTest.unidentifiedPatientKeyboardTest, trying again...
22-Nov-2021 20:24:27 Failed to login in UnidentifiedPatientKeyboardTest.unidentifiedPatientKeyboardTest, trying again...
22-Nov-2021 20:24:27 Failed to login in UnidentifiedPatientKeyboardTest.unidentifiedPatientKeyboardTest, trying again...
22-Nov-2021 20:24:27 Failed to login in UnidentifiedPatientKeyboardTest.unidentifiedPatientKeyboardTest, trying again...
22-Nov-2021 20:24:27 Failed to login in UnidentifiedPatientKeyboardTest.unidentifiedPatientKeyboardTest, trying again...
22-Nov-2021 20:24:27 Failed to login in UnidentifiedPatientKeyboardTest.unidentifiedPatientKeyboardTest, trying again...
22-Nov-2021 20:24:27 Failed to login in UnidentifiedPatientKeyboardTest.unidentifiedPatientKeyboardTest, trying again...
22-Nov-2021 20:24:27 Failed to login in UnidentifiedPatientKeyboardTest.unidentifiedPatientKeyboardTest, trying again...
22-Nov-2021 20:24:27 Failed to login in UnidentifiedPatientKeyboardTest.unidentifiedPatientKeyboardTest, trying again...
22-Nov-2021 20:24:27 Failed to login in UnidentifiedPatientKeyboardTest.unidentifiedPatientKeyboardTest, trying again...
22-Nov-2021 20:24:27 Failed to login in UnidentifiedPatientKeyboardTest.unidentifiedPatientKeyboardTest, trying again...
22-Nov-2021 20:24:27 Failed to login in UnidentifiedPatientKeyboardTest.unidentifiedPatientKeyboardTest, trying again...
22-Nov-2021 20:24:28 Failed to login in UnidentifiedPatientKeyboardTest.unidentifiedPatientKeyboardTest, trying again...
22-Nov-2021 20:24:28 Failed to login in UnidentifiedPatientKeyboardTest.unidentifiedPatientKeyboardTest, trying again...
22-Nov-2021 20:24:28 Failed to login in UnidentifiedPatientKeyboardTest.unidentifiedPatientKeyboardTest, trying again...
22-Nov-2021 20:24:28 Failed to login in UnidentifiedPatientKeyboardTest.unidentifiedPatientKeyboardTest, trying again...
22-Nov-2021 20:24:28 Failed to login in UnidentifiedPatientKeyboardTest.unidentifiedPatientKeyboardTest, trying again...
22-Nov-2021 20:24:28 Failed to login in UnidentifiedPatientKeyboardTest.unidentifiedPatientKeyboardTest, trying again...
22-Nov-2021 20:24:28 Failed to login in UnidentifiedPatientKeyboardTest.unidentifiedPatientKeyboardTest, trying again...
22-Nov-2021 20:24:28 Failed to login in UnidentifiedPatientKeyboardTest.unidentifiedPatientKeyboardTest, trying again...
22-Nov-2021 20:24:28 Failed to login in UnidentifiedPatientKeyboardTest.unidentifiedPatientKeyboardTest, trying again...
22-Nov-2021 20:24:28 Failed to login in UnidentifiedPatientKeyboardTest.unidentifiedPatientKeyboardTest, trying again...
22-Nov-2021 20:24:28 Failed to login in UnidentifiedPatientKeyboardTest.unidentifiedPatientKeyboardTest, trying again...
22-Nov-2021 20:24:28 Failed to login in UnidentifiedPatientKeyboardTest.unidentifiedPatientKeyboardTest, trying again...
22-Nov-2021 20:24:28 Failed to login in UnidentifiedPatientKeyboardTest.unidentifiedPatientKeyboardTest, trying again...
22-Nov-2021 20:24:28 Failed to login in UnidentifiedPatientKeyboardTest.unidentifiedPatientKeyboardTest, trying again...
22-Nov-2021 20:24:28 Failed to login in UnidentifiedPatientKeyboardTest.unidentifiedPatientKeyboardTest, trying again...
22-Nov-2021 20:24:28 Failed to login in UnidentifiedPatientKeyboardTest.unidentifiedPatientKeyboardTest, trying again...
22-Nov-2021 20:24:28 Failed to login in UnidentifiedPatientKeyboardTest.unidentifiedPatientKeyboardTest, trying again...
22-Nov-2021 20:24:28 Failed to login in UnidentifiedPatientKeyboardTest.unidentifiedPatientKeyboardTest, trying again...
22-Nov-2021 20:24:28 Failed to login in UnidentifiedPatientKeyboardTest.unidentifiedPatientKeyboardTest, trying again...
22-Nov-2021 20:24:28 Failed to login in UnidentifiedPatientKeyboardTest.unidentifiedPatientKeyboardTest, trying again...
22-Nov-2021 20:24:28 Failed to login in UnidentifiedPatientKeyboardTest.unidentifiedPatientKeyboardTest, trying again...
22-Nov-2021 20:24:28 Failed to login in UnidentifiedPatientKeyboardTest.unidentifiedPatientKeyboardTest, trying again...
22-Nov-2021 20:24:28 Failed to login in UnidentifiedPatientKeyboardTest.unidentifiedPatientKeyboardTest, trying again...
22-Nov-2021 20:24:28 Failed to login in UnidentifiedPatientKeyboardTest.unidentifiedPatientKeyboardTest, trying again...
22-Nov-2021 20:24:28 Failed to login in UnidentifiedPatientKeyboardTest.unidentifiedPatientKeyboardTest, trying again...
22-Nov-2021 20:24:28 Failed to login in UnidentifiedPatientKeyboardTest.unidentifiedPatientKeyboardTest, trying again...
22-Nov-2021 20:24:28 Failed to login in UnidentifiedPatientKeyboardTest.unidentifiedPatientKeyboardTest, trying again...
22-Nov-2021 20:24:28 Failed to login in UnidentifiedPatientKeyboardTest.unidentifiedPatientKeyboardTest, trying again...
22-Nov-2021 20:24:28 Failed to login in UnidentifiedPatientKeyboardTest.unidentifiedPatientKeyboardTest, trying again...
22-Nov-2021 20:24:28 Failed to login in UnidentifiedPatientKeyboardTest.unidentifiedPatientKeyboardTest, trying again...
22-Nov-2021 20:24:28 Failed to login in UnidentifiedPatientKeyboardTest.unidentifiedPatientKeyboardTest, trying again...
22-Nov-2021 20:24:28 Failed to login in UnidentifiedPatientKeyboardTest.unidentifiedPatientKeyboardTest, trying again...
22-Nov-2021 20:24:28 Failed to login in UnidentifiedPatientKeyboardTest.unidentifiedPatientKeyboardTest, trying again...
22-Nov-2021 20:24:28 Failed to login in UnidentifiedPatientKeyboardTest.unidentifiedPatientKeyboardTest, trying again...
22-Nov-2021 20:24:28 Failed to login in UnidentifiedPatientKeyboardTest.unidentifiedPatientKeyboardTest, trying again...
22-Nov-2021 20:24:28 Failed to login in UnidentifiedPatientKeyboardTest.unidentifiedPatientKeyboardTest, trying again...
22-Nov-2021 20:24:28 Failed to login in UnidentifiedPatientKeyboardTest.unidentifiedPatientKeyboardTest, trying again...
22-Nov-2021 20:24:28 Failed to login in UnidentifiedPatientKeyboardTest.unidentifiedPatientKeyboardTest, trying again...
22-Nov-2021 20:24:28 Failed to login in UnidentifiedPatientKeyboardTest.unidentifiedPatientKeyboardTest, trying again...
22-Nov-2021 20:24:29 Failed to login in UnidentifiedPatientKeyboardTest.unidentifiedPatientKeyboardTest, trying again...
22-Nov-2021 20:24:29 Failed to login in UnidentifiedPatientKeyboardTest.unidentifiedPatientKeyboardTest, trying again...
22-Nov-2021 20:24:29 Failed to login in UnidentifiedPatientKeyboardTest.unidentifiedPatientKeyboardTest, trying again...
22-Nov-2021 20:24:29 Failed to login in UnidentifiedPatientKeyboardTest.unidentifiedPatientKeyboardTest, trying again...
22-Nov-2021 20:24:29 Failed to login in UnidentifiedPatientKeyboardTest.unidentifiedPatientKeyboardTest, trying again...
22-Nov-2021 20:24:29 Failed to login in UnidentifiedPatientKeyboardTest.unidentifiedPatientKeyboardTest, trying again...
22-Nov-2021 20:24:29 Failed to login in UnidentifiedPatientKeyboardTest.unidentifiedPatientKeyboardTest, trying again...
22-Nov-2021 20:24:29 Failed to login in UnidentifiedPatientKeyboardTest.unidentifiedPatientKeyboardTest, trying again...
22-Nov-2021 20:24:29 Failed to login in UnidentifiedPatientKeyboardTest.unidentifiedPatientKeyboardTest, trying again...
22-Nov-2021 20:24:29 Failed to login in UnidentifiedPatientKeyboardTest.unidentifiedPatientKeyboardTest, trying again...
22-Nov-2021 20:24:29 Failed to login in UnidentifiedPatientKeyboardTest.unidentifiedPatientKeyboardTest, trying again...
22-Nov-2021 20:24:29 Failed to login in UnidentifiedPatientKeyboardTest.unidentifiedPatientKeyboardTest, trying again...
22-Nov-2021 20:24:29 Failed to login in UnidentifiedPatientKeyboardTest.unidentifiedPatientKeyboardTest, trying again...
22-Nov-2021 20:24:29 Failed to login in UnidentifiedPatientKeyboardTest.unidentifiedPatientKeyboardTest, trying again...
22-Nov-2021 20:24:29 Failed to login in UnidentifiedPatientKeyboardTest.unidentifiedPatientKeyboardTest, trying again...
22-Nov-2021 20:24:29 Failed to login in UnidentifiedPatientKeyboardTest.unidentifiedPatientKeyboardTest, trying again...
22-Nov-2021 20:24:29 Failed to login in UnidentifiedPatientKeyboardTest.unidentifiedPatientKeyboardTest, trying again...
22-Nov-2021 20:24:29 Failed to login in UnidentifiedPatientKeyboardTest.unidentifiedPatientKeyboardTest, trying again...
22-Nov-2021 20:24:29 Failed to login in UnidentifiedPatientKeyboardTest.unidentifiedPatientKeyboardTest, trying again...
22-Nov-2021 20:24:29 Failed to login in UnidentifiedPatientKeyboardTest.unidentifiedPatientKeyboardTest, trying again...
22-Nov-2021 20:24:29 Failed to login in UnidentifiedPatientKeyboardTest.unidentifiedPatientKeyboardTest, trying again...
22-Nov-2021 20:24:29 Failed to login in UnidentifiedPatientKeyboardTest.unidentifiedPatientKeyboardTest, trying again...
22-Nov-2021 20:24:29 Failed to login in UnidentifiedPatientKeyboardTest.unidentifiedPatientKeyboardTest, trying again...
22-Nov-2021 20:24:29 Failed to login in UnidentifiedPatientKeyboardTest.unidentifiedPatientKeyboardTest, trying again...
22-Nov-2021 20:24:29 Failed to login in UnidentifiedPatientKeyboardTest.unidentifiedPatientKeyboardTest, trying again...
22-Nov-2021 20:24:29 Failed to login in UnidentifiedPatientKeyboardTest.unidentifiedPatientKeyboardTest, trying again...
22-Nov-2021 20:24:29 Failed to login in UnidentifiedPatientKeyboardTest.unidentifiedPatientKeyboardTest, trying again...
22-Nov-2021 20:24:29 Failed to login in UnidentifiedPatientKeyboardTest.unidentifiedPatientKeyboardTest, trying again...
22-Nov-2021 20:24:29 Failed to login in UnidentifiedPatientKeyboardTest.unidentifiedPatientKeyboardTest, trying again...
22-Nov-2021 20:24:29 Failed to login in UnidentifiedPatientKeyboardTest.unidentifiedPatientKeyboardTest, trying again...
22-Nov-2021 20:24:29 Failed to login in UnidentifiedPatientKeyboardTest.unidentifiedPatientKeyboardTest, trying again...
22-Nov-2021 20:24:29 Failed to login in UnidentifiedPatientKeyboardTest.unidentifiedPatientKeyboardTest, trying again...
22-Nov-2021 20:24:29 Failed to login in UnidentifiedPatientKeyboardTest.unidentifiedPatientKeyboardTest, trying again...
22-Nov-2021 20:24:29 Failed to login in UnidentifiedPatientKeyboardTest.unidentifiedPatientKeyboardTest, trying again...
22-Nov-2021 20:24:29 Failed to login in UnidentifiedPatientKeyboardTest.unidentifiedPatientKeyboardTest, trying again...
22-Nov-2021 20:24:30 Failed to login in UnidentifiedPatientKeyboardTest.unidentifiedPatientKeyboardTest, trying again...
22-Nov-2021 20:24:30 Failed to login in UnidentifiedPatientKeyboardTest.unidentifiedPatientKeyboardTest, trying again...
22-Nov-2021 20:24:30 Failed to login in UnidentifiedPatientKeyboardTest.unidentifiedPatientKeyboardTest, trying again...
22-Nov-2021 20:24:30 Failed to login in UnidentifiedPatientKeyboardTest.unidentifiedPatientKeyboardTest, trying again...
22-Nov-2021 20:24:30 Failed to login in UnidentifiedPatientKeyboardTest.unidentifiedPatientKeyboardTest, trying again...
22-Nov-2021 20:24:30 Failed to login in UnidentifiedPatientKeyboardTest.unidentifiedPatientKeyboardTest, trying again...
22-Nov-2021 20:24:30 Failed to login in UnidentifiedPatientKeyboardTest.unidentifiedPatientKeyboardTest, trying again...
22-Nov-2021 20:24:30 Failed to login in UnidentifiedPatientKeyboardTest.unidentifiedPatientKeyboardTest, trying again...
22-Nov-2021 20:24:30 Failed to login in UnidentifiedPatientKeyboardTest.unidentifiedPatientKeyboardTest, trying again...
22-Nov-2021 20:24:30 Failed to login in UnidentifiedPatientKeyboardTest.unidentifiedPatientKeyboardTest, trying again...
22-Nov-2021 20:24:30 Failed to login in UnidentifiedPatientKeyboardTest.unidentifiedPatientKeyboardTest, trying again...
22-Nov-2021 20:24:30 Failed to login in UnidentifiedPatientKeyboardTest.unidentifiedPatientKeyboardTest, trying again...
22-Nov-2021 20:24:30 Failed to login in UnidentifiedPatientKeyboardTest.unidentifiedPatientKeyboardTest, trying again...
22-Nov-2021 20:24:30 Failed to login in UnidentifiedPatientKeyboardTest.unidentifiedPatientKeyboardTest, trying again...
22-Nov-2021 20:24:30 Failed to login in UnidentifiedPatientKeyboardTest.unidentifiedPatientKeyboardTest, trying again...
22-Nov-2021 20:24:30 Failed to login in UnidentifiedPatientKeyboardTest.unidentifiedPatientKeyboardTest, trying again...
22-Nov-2021 20:24:30 Failed to login in UnidentifiedPatientKeyboardTest.unidentifiedPatientKeyboardTest, trying again...
22-Nov-2021 20:24:30 Failed to login in UnidentifiedPatientKeyboardTest.unidentifiedPatientKeyboardTest, trying again...
22-Nov-2021 20:24:30 Failed to login in UnidentifiedPatientKeyboardTest.unidentifiedPatientKeyboardTest, trying again...
22-Nov-2021 20:24:30 Failed to login in UnidentifiedPatientKeyboardTest.unidentifiedPatientKeyboardTest, trying again...
22-Nov-2021 20:24:30 Failed to login in UnidentifiedPatientKeyboardTest.unidentifiedPatientKeyboardTest, trying again...
22-Nov-2021 20:24:30 Failed to login in UnidentifiedPatientKeyboardTest.unidentifiedPatientKeyboardTest, trying again...
22-Nov-2021 20:24:30 Failed to login in UnidentifiedPatientKeyboardTest.unidentifiedPatientKeyboardTest, trying again...
22-Nov-2021 20:24:30 Failed to login in UnidentifiedPatientKeyboardTest.unidentifiedPatientKeyboardTest, trying again...
22-Nov-2021 20:24:30 Failed to login in UnidentifiedPatientKeyboardTest.unidentifiedPatientKeyboardTest, trying again...
22-Nov-2021 20:24:30 Failed to login in UnidentifiedPatientKeyboardTest.unidentifiedPatientKeyboardTest, trying again...
22-Nov-2021 20:24:30 Failed to login in UnidentifiedPatientKeyboardTest.unidentifiedPatientKeyboardTest, trying again...
22-Nov-2021 20:24:30 Failed to login in UnidentifiedPatientKeyboardTest.unidentifiedPatientKeyboardTest, trying again...
22-Nov-2021 20:24:30 Failed to login in UnidentifiedPatientKeyboardTest.unidentifiedPatientKeyboardTest, trying again...
22-Nov-2021 20:24:30 Failed to login in UnidentifiedPatientKeyboardTest.unidentifiedPatientKeyboardTest, trying again...
22-Nov-2021 20:24:30 Failed to login in UnidentifiedPatientKeyboardTest.unidentifiedPatientKeyboardTest, trying again...
22-Nov-2021 20:24:31 Failed to login in UnidentifiedPatientKeyboardTest.unidentifiedPatientKeyboardTest, trying again...
22-Nov-2021 20:24:31 Failed to login in UnidentifiedPatientKeyboardTest.unidentifiedPatientKeyboardTest, trying again...
22-Nov-2021 20:24:31 Failed to login in UnidentifiedPatientKeyboardTest.unidentifiedPatientKeyboardTest, trying again...
22-Nov-2021 20:24:31 Failed to login in UnidentifiedPatientKeyboardTest.unidentifiedPatientKeyboardTest, trying again...
22-Nov-2021 20:24:31 Failed to login in UnidentifiedPatientKeyboardTest.unidentifiedPatientKeyboardTest, trying again...
22-Nov-2021 20:24:31 Failed to login in UnidentifiedPatientKeyboardTest.unidentifiedPatientKeyboardTest, trying again...
22-Nov-2021 20:24:31 Failed to login in UnidentifiedPatientKeyboardTest.unidentifiedPatientKeyboardTest, trying again...
22-Nov-2021 20:24:31 Failed to login in UnidentifiedPatientKeyboardTest.unidentifiedPatientKeyboardTest, trying again...
22-Nov-2021 20:24:31 Failed to login in UnidentifiedPatientKeyboardTest.unidentifiedPatientKeyboardTest, trying again...
22-Nov-2021 20:24:31 Failed to login in UnidentifiedPatientKeyboardTest.unidentifiedPatientKeyboardTest, trying again...
22-Nov-2021 20:24:31 Failed to login in UnidentifiedPatientKeyboardTest.unidentifiedPatientKeyboardTest, trying again...
22-Nov-2021 20:24:31 Failed to login in UnidentifiedPatientKeyboardTest.unidentifiedPatientKeyboardTest, trying again...
22-Nov-2021 20:24:31 Failed to login in UnidentifiedPatientKeyboardTest.unidentifiedPatientKeyboardTest, trying again...
22-Nov-2021 20:24:31 Failed to login in UnidentifiedPatientKeyboardTest.unidentifiedPatientKeyboardTest, trying again...
22-Nov-2021 20:24:31 Failed to login in UnidentifiedPatientKeyboardTest.unidentifiedPatientKeyboardTest, trying again...
22-Nov-2021 20:24:31 Failed to login in UnidentifiedPatientKeyboardTest.unidentifiedPatientKeyboardTest, trying again...
22-Nov-2021 20:24:31 Failed to login in UnidentifiedPatientKeyboardTest.unidentifiedPatientKeyboardTest, trying again...
22-Nov-2021 20:24:31 Failed to login in UnidentifiedPatientKeyboardTest.unidentifiedPatientKeyboardTest, trying again...
22-Nov-2021 20:24:31 Failed to login in UnidentifiedPatientKeyboardTest.unidentifiedPatientKeyboardTest, trying again...
22-Nov-2021 20:24:31 Failed to login in UnidentifiedPatientKeyboardTest.unidentifiedPatientKeyboardTest, trying again...
22-Nov-2021 20:24:31 Failed to login in UnidentifiedPatientKeyboardTest.unidentifiedPatientKeyboardTest, trying again...
22-Nov-2021 20:24:31 Failed to login in UnidentifiedPatientKeyboardTest.unidentifiedPatientKeyboardTest, trying again...
22-Nov-2021 20:24:31 Failed to login in UnidentifiedPatientKeyboardTest.unidentifiedPatientKeyboardTest, trying again...
22-Nov-2021 20:24:31 Failed to login in UnidentifiedPatientKeyboardTest.unidentifiedPatientKeyboardTest, trying again...
22-Nov-2021 20:24:31 Failed to login in UnidentifiedPatientKeyboardTest.unidentifiedPatientKeyboardTest, trying again...
22-Nov-2021 20:24:31 Failed to login in UnidentifiedPatientKeyboardTest.unidentifiedPatientKeyboardTest, trying again...
22-Nov-2021 20:24:31 Failed to login in UnidentifiedPatientKeyboardTest.unidentifiedPatientKeyboardTest, trying again...
22-Nov-2021 20:24:31 Failed to login in UnidentifiedPatientKeyboardTest.unidentifiedPatientKeyboardTest, trying again...
22-Nov-2021 20:24:31 Failed to login in UnidentifiedPatientKeyboardTest.unidentifiedPatientKeyboardTest, trying again...
22-Nov-2021 20:24:31 Failed to login in UnidentifiedPatientKeyboardTest.unidentifiedPatientKeyboardTest, trying again...
22-Nov-2021 20:24:31 Failed to login in UnidentifiedPatientKeyboardTest.unidentifiedPatientKeyboardTest, trying again...
22-Nov-2021 20:24:31 Failed to login in UnidentifiedPatientKeyboardTest.unidentifiedPatientKeyboardTest, trying again...
22-Nov-2021 20:24:31 Failed to login in UnidentifiedPatientKeyboardTest.unidentifiedPatientKeyboardTest, trying again...
22-Nov-2021 20:24:32 Failed to login in UnidentifiedPatientKeyboardTest.unidentifiedPatientKeyboardTest, trying again...
22-Nov-2021 20:24:32 Failed to login in UnidentifiedPatientKeyboardTest.unidentifiedPatientKeyboardTest, trying again...
22-Nov-2021 20:24:32 Failed to login in UnidentifiedPatientKeyboardTest.unidentifiedPatientKeyboardTest, trying again...
22-Nov-2021 20:24:32 Failed to login in UnidentifiedPatientKeyboardTest.unidentifiedPatientKeyboardTest, trying again...
22-Nov-2021 20:24:32 Failed to login in UnidentifiedPatientKeyboardTest.unidentifiedPatientKeyboardTest, trying again...
22-Nov-2021 20:24:32 Failed to login in UnidentifiedPatientKeyboardTest.unidentifiedPatientKeyboardTest, trying again...
22-Nov-2021 20:24:32 Failed to login in UnidentifiedPatientKeyboardTest.unidentifiedPatientKeyboardTest, trying again...
22-Nov-2021 20:24:32 Failed to login in UnidentifiedPatientKeyboardTest.unidentifiedPatientKeyboardTest, trying again...
22-Nov-2021 20:24:32 Failed to login in UnidentifiedPatientKeyboardTest.unidentifiedPatientKeyboardTest, trying again...
22-Nov-2021 20:24:32 Failed to login in UnidentifiedPatientKeyboardTest.unidentifiedPatientKeyboardTest, trying again...
22-Nov-2021 20:24:32 Failed to login in UnidentifiedPatientKeyboardTest.unidentifiedPatientKeyboardTest, trying again...
22-Nov-2021 20:24:32 Failed to login in UnidentifiedPatientKeyboardTest.unidentifiedPatientKeyboardTest, trying again...
22-Nov-2021 20:24:32 Failed to login in UnidentifiedPatientKeyboardTest.unidentifiedPatientKeyboardTest, trying again...
22-Nov-2021 20:24:32 Failed to login in UnidentifiedPatientKeyboardTest.unidentifiedPatientKeyboardTest, trying again...
22-Nov-2021 20:24:32 Failed to login in UnidentifiedPatientKeyboardTest.unidentifiedPatientKeyboardTest, trying again...
22-Nov-2021 20:24:32 Failed to login in UnidentifiedPatientKeyboardTest.unidentifiedPatientKeyboardTest, trying again...
22-Nov-2021 20:24:32 Failed to login in UnidentifiedPatientKeyboardTest.unidentifiedPatientKeyboardTest, trying again...
22-Nov-2021 20:24:32 Failed to login in UnidentifiedPatientKeyboardTest.unidentifiedPatientKeyboardTest, trying again...
22-Nov-2021 20:24:32 Failed to login in UnidentifiedPatientKeyboardTest.unidentifiedPatientKeyboardTest, trying again...
22-Nov-2021 20:24:32 Failed to login in UnidentifiedPatientKeyboardTest.unidentifiedPatientKeyboardTest, trying again...
22-Nov-2021 20:24:32 Failed to login in UnidentifiedPatientKeyboardTest.unidentifiedPatientKeyboardTest, trying again...
22-Nov-2021 20:24:32 Failed to login in UnidentifiedPatientKeyboardTest.unidentifiedPatientKeyboardTest, trying again...
22-Nov-2021 20:24:32 Failed to login in UnidentifiedPatientKeyboardTest.unidentifiedPatientKeyboardTest, trying again...
22-Nov-2021 20:24:32 Failed to login in UnidentifiedPatientKeyboardTest.unidentifiedPatientKeyboardTest, trying again...
22-Nov-2021 20:24:32 Failed to login in UnidentifiedPatientKeyboardTest.unidentifiedPatientKeyboardTest, trying again...
22-Nov-2021 20:24:32 Failed to login in UnidentifiedPatientKeyboardTest.unidentifiedPatientKeyboardTest, trying again...
22-Nov-2021 20:24:32 Failed to login in UnidentifiedPatientKeyboardTest.unidentifiedPatientKeyboardTest, trying again...
22-Nov-2021 20:24:32 Failed to login in UnidentifiedPatientKeyboardTest.unidentifiedPatientKeyboardTest, trying again...
22-Nov-2021 20:24:32 Failed to login in UnidentifiedPatientKeyboardTest.unidentifiedPatientKeyboardTest, trying again...
22-Nov-2021 20:24:32 Failed to login in UnidentifiedPatientKeyboardTest.unidentifiedPatientKeyboardTest, trying again...
22-Nov-2021 20:24:32 Failed to login in UnidentifiedPatientKeyboardTest.unidentifiedPatientKeyboardTest, trying again...
22-Nov-2021 20:24:32 Failed to login in UnidentifiedPatientKeyboardTest.unidentifiedPatientKeyboardTest, trying again...
22-Nov-2021 20:24:32 Failed to login in UnidentifiedPatientKeyboardTest.unidentifiedPatientKeyboardTest, trying again...
22-Nov-2021 20:24:32 Failed to login in UnidentifiedPatientKeyboardTest.unidentifiedPatientKeyboardTest, trying again...
22-Nov-2021 20:24:32 Failed to login in UnidentifiedPatientKeyboardTest.unidentifiedPatientKeyboardTest, trying again...
22-Nov-2021 20:24:32 Failed to login in UnidentifiedPatientKeyboardTest.unidentifiedPatientKeyboardTest, trying again...
22-Nov-2021 20:24:33 Failed to login in UnidentifiedPatientKeyboardTest.unidentifiedPatientKeyboardTest, trying again...
22-Nov-2021 20:24:33 Failed to login in UnidentifiedPatientKeyboardTest.unidentifiedPatientKeyboardTest, trying again...
22-Nov-2021 20:24:33 Failed to login in UnidentifiedPatientKeyboardTest.unidentifiedPatientKeyboardTest, trying again...
22-Nov-2021 20:24:33 Failed to login in UnidentifiedPatientKeyboardTest.unidentifiedPatientKeyboardTest, trying again...
22-Nov-2021 20:24:33 Failed to login in UnidentifiedPatientKeyboardTest.unidentifiedPatientKeyboardTest, trying again...
22-Nov-2021 20:24:33 Failed to login in UnidentifiedPatientKeyboardTest.unidentifiedPatientKeyboardTest, trying again...
22-Nov-2021 20:24:33 Failed to login in UnidentifiedPatientKeyboardTest.unidentifiedPatientKeyboardTest, trying again...
22-Nov-2021 20:24:33 Failed to login in UnidentifiedPatientKeyboardTest.unidentifiedPatientKeyboardTest, trying again...
22-Nov-2021 20:24:33 Failed to login in UnidentifiedPatientKeyboardTest.unidentifiedPatientKeyboardTest, trying again...
22-Nov-2021 20:24:33 Failed to login in UnidentifiedPatientKeyboardTest.unidentifiedPatientKeyboardTest, trying again...
22-Nov-2021 20:24:33 Failed to login in UnidentifiedPatientKeyboardTest.unidentifiedPatientKeyboardTest, trying again...
22-Nov-2021 20:24:33 Failed to login in UnidentifiedPatientKeyboardTest.unidentifiedPatientKeyboardTest, trying again...
22-Nov-2021 20:24:33 Failed to login in UnidentifiedPatientKeyboardTest.unidentifiedPatientKeyboardTest, trying again...
22-Nov-2021 20:24:33 Failed to login in UnidentifiedPatientKeyboardTest.unidentifiedPatientKeyboardTest, trying again...
22-Nov-2021 20:24:33 Failed to login in UnidentifiedPatientKeyboardTest.unidentifiedPatientKeyboardTest, trying again...
22-Nov-2021 20:24:33 Failed to login in UnidentifiedPatientKeyboardTest.unidentifiedPatientKeyboardTest, trying again...
22-Nov-2021 20:24:33 Failed to login in UnidentifiedPatientKeyboardTest.unidentifiedPatientKeyboardTest, trying again...
22-Nov-2021 20:24:33 Failed to login in UnidentifiedPatientKeyboardTest.unidentifiedPatientKeyboardTest, trying again...
22-Nov-2021 20:24:33 Failed to login in UnidentifiedPatientKeyboardTest.unidentifiedPatientKeyboardTest, trying again...
22-Nov-2021 20:24:33 Failed to login in UnidentifiedPatientKeyboardTest.unidentifiedPatientKeyboardTest, trying again...
22-Nov-2021 20:24:33 Failed to login in UnidentifiedPatientKeyboardTest.unidentifiedPatientKeyboardTest, trying again...
22-Nov-2021 20:24:33 Failed to login in UnidentifiedPatientKeyboardTest.unidentifiedPatientKeyboardTest, trying again...
22-Nov-2021 20:24:33 Failed to login in UnidentifiedPatientKeyboardTest.unidentifiedPatientKeyboardTest, trying again...
22-Nov-2021 20:24:33 Failed to login in UnidentifiedPatientKeyboardTest.unidentifiedPatientKeyboardTest, trying again...
22-Nov-2021 20:24:33 Failed to login in UnidentifiedPatientKeyboardTest.unidentifiedPatientKeyboardTest, trying again...
22-Nov-2021 20:24:33 Failed to login in UnidentifiedPatientKeyboardTest.unidentifiedPatientKeyboardTest, trying again...
22-Nov-2021 20:24:33 Failed to login in UnidentifiedPatientKeyboardTest.unidentifiedPatientKeyboardTest, trying again...
22-Nov-2021 20:24:33 Failed to login in UnidentifiedPatientKeyboardTest.unidentifiedPatientKeyboardTest, trying again...
22-Nov-2021 20:24:33 Failed to login in UnidentifiedPatientKeyboardTest.unidentifiedPatientKeyboardTest, trying again...
22-Nov-2021 20:24:33 Failed to login in UnidentifiedPatientKeyboardTest.unidentifiedPatientKeyboardTest, trying again...
22-Nov-2021 20:24:33 Failed to login in UnidentifiedPatientKeyboardTest.unidentifiedPatientKeyboardTest, trying again...
22-Nov-2021 20:24:33 Failed to login in UnidentifiedPatientKeyboardTest.unidentifiedPatientKeyboardTest, trying again...
22-Nov-2021 20:24:33 Failed to login in UnidentifiedPatientKeyboardTest.unidentifiedPatientKeyboardTest, trying again...
22-Nov-2021 20:24:33 Failed to login in UnidentifiedPatientKeyboardTest.unidentifiedPatientKeyboardTest, trying again...
22-Nov-2021 20:24:33 Failed to login in UnidentifiedPatientKeyboardTest.unidentifiedPatientKeyboardTest, trying again...
22-Nov-2021 20:24:33 Failed to login in UnidentifiedPatientKeyboardTest.unidentifiedPatientKeyboardTest, trying again...
22-Nov-2021 20:24:33 Failed to login in UnidentifiedPatientKeyboardTest.unidentifiedPatientKeyboardTest, trying again...
22-Nov-2021 20:24:34 Failed to login in UnidentifiedPatientKeyboardTest.unidentifiedPatientKeyboardTest, trying again...
22-Nov-2021 20:24:34 Failed to login in UnidentifiedPatientKeyboardTest.unidentifiedPatientKeyboardTest, trying again...
22-Nov-2021 20:24:34 Failed to login in UnidentifiedPatientKeyboardTest.unidentifiedPatientKeyboardTest, trying again...
22-Nov-2021 20:24:34 Failed to login in UnidentifiedPatientKeyboardTest.unidentifiedPatientKeyboardTest, trying again...
22-Nov-2021 20:24:34 Failed to login in UnidentifiedPatientKeyboardTest.unidentifiedPatientKeyboardTest, trying again...
22-Nov-2021 20:24:34 Failed to login in UnidentifiedPatientKeyboardTest.unidentifiedPatientKeyboardTest, trying again...
22-Nov-2021 20:24:34 Failed to login in UnidentifiedPatientKeyboardTest.unidentifiedPatientKeyboardTest, trying again...
22-Nov-2021 20:24:34 Failed to login in UnidentifiedPatientKeyboardTest.unidentifiedPatientKeyboardTest, trying again...
22-Nov-2021 20:24:34 Failed to login in UnidentifiedPatientKeyboardTest.unidentifiedPatientKeyboardTest, trying again...
22-Nov-2021 20:24:34 Failed to login in UnidentifiedPatientKeyboardTest.unidentifiedPatientKeyboardTest, trying again...
22-Nov-2021 20:24:34 Failed to login in UnidentifiedPatientKeyboardTest.unidentifiedPatientKeyboardTest, trying again...
22-Nov-2021 20:24:34 Failed to login in UnidentifiedPatientKeyboardTest.unidentifiedPatientKeyboardTest, trying again...
22-Nov-2021 20:24:34 Failed to login in UnidentifiedPatientKeyboardTest.unidentifiedPatientKeyboardTest, trying again...
22-Nov-2021 20:24:34 Failed to login in UnidentifiedPatientKeyboardTest.unidentifiedPatientKeyboardTest, trying again...
22-Nov-2021 20:24:34 Failed to login in UnidentifiedPatientKeyboardTest.unidentifiedPatientKeyboardTest, trying again...
22-Nov-2021 20:24:34 Failed to login in UnidentifiedPatientKeyboardTest.unidentifiedPatientKeyboardTest, trying again...
22-Nov-2021 20:24:34 Failed to login in UnidentifiedPatientKeyboardTest.unidentifiedPatientKeyboardTest, trying again...
22-Nov-2021 20:24:34 Failed to login in UnidentifiedPatientKeyboardTest.unidentifiedPatientKeyboardTest, trying again...
22-Nov-2021 20:24:34 Failed to login in UnidentifiedPatientKeyboardTest.unidentifiedPatientKeyboardTest, trying again...
22-Nov-2021 20:24:34 Failed to login in UnidentifiedPatientKeyboardTest.unidentifiedPatientKeyboardTest, trying again...
22-Nov-2021 20:24:34 Failed to login in UnidentifiedPatientKeyboardTest.unidentifiedPatientKeyboardTest, trying again...
22-Nov-2021 20:24:34 Failed to login in UnidentifiedPatientKeyboardTest.unidentifiedPatientKeyboardTest, trying again...
22-Nov-2021 20:24:34 Failed to login in UnidentifiedPatientKeyboardTest.unidentifiedPatientKeyboardTest, trying again...
22-Nov-2021 20:24:34 Failed to login in UnidentifiedPatientKeyboardTest.unidentifiedPatientKeyboardTest, trying again...
22-Nov-2021 20:24:34 Failed to login in UnidentifiedPatientKeyboardTest.unidentifiedPatientKeyboardTest, trying again...
22-Nov-2021 20:24:34 Failed to login in UnidentifiedPatientKeyboardTest.unidentifiedPatientKeyboardTest, trying again...
22-Nov-2021 20:24:34 Failed to login in UnidentifiedPatientKeyboardTest.unidentifiedPatientKeyboardTest, trying again...
22-Nov-2021 20:24:34 Failed to login in UnidentifiedPatientKeyboardTest.unidentifiedPatientKeyboardTest, trying again...
22-Nov-2021 20:24:34 Failed to login in UnidentifiedPatientKeyboardTest.unidentifiedPatientKeyboardTest, trying again...
22-Nov-2021 20:24:34 Failed to login in UnidentifiedPatientKeyboardTest.unidentifiedPatientKeyboardTest, trying again...
22-Nov-2021 20:24:35 Failed to login in UnidentifiedPatientKeyboardTest.unidentifiedPatientKeyboardTest, trying again...
22-Nov-2021 20:24:35 Failed to login in UnidentifiedPatientKeyboardTest.unidentifiedPatientKeyboardTest, trying again...
22-Nov-2021 20:24:35 Failed to login in UnidentifiedPatientKeyboardTest.unidentifiedPatientKeyboardTest, trying again...
22-Nov-2021 20:24:35 Failed to login in UnidentifiedPatientKeyboardTest.unidentifiedPatientKeyboardTest, trying again...
22-Nov-2021 20:24:35 Failed to login in UnidentifiedPatientKeyboardTest.unidentifiedPatientKeyboardTest, trying again...
22-Nov-2021 20:24:35 Failed to login in UnidentifiedPatientKeyboardTest.unidentifiedPatientKeyboardTest, trying again...
22-Nov-2021 20:24:35 Failed to login in UnidentifiedPatientKeyboardTest.unidentifiedPatientKeyboardTest, trying again...
22-Nov-2021 20:24:35 Failed to login in UnidentifiedPatientKeyboardTest.unidentifiedPatientKeyboardTest, trying again...
22-Nov-2021 20:24:35 Failed to login in UnidentifiedPatientKeyboardTest.unidentifiedPatientKeyboardTest, trying again...
22-Nov-2021 20:24:35 Failed to login in UnidentifiedPatientKeyboardTest.unidentifiedPatientKeyboardTest, trying again...
22-Nov-2021 20:24:35 Failed to login in UnidentifiedPatientKeyboardTest.unidentifiedPatientKeyboardTest, trying again...
22-Nov-2021 20:24:35 Failed to login in UnidentifiedPatientKeyboardTest.unidentifiedPatientKeyboardTest, trying again...
22-Nov-2021 20:24:35 Failed to login in UnidentifiedPatientKeyboardTest.unidentifiedPatientKeyboardTest, trying again...
22-Nov-2021 20:24:35 Failed to login in UnidentifiedPatientKeyboardTest.unidentifiedPatientKeyboardTest, trying again...
22-Nov-2021 20:24:35 Failed to login in UnidentifiedPatientKeyboardTest.unidentifiedPatientKeyboardTest, trying again...
22-Nov-2021 20:24:35 Failed to login in UnidentifiedPatientKeyboardTest.unidentifiedPatientKeyboardTest, trying again...
22-Nov-2021 20:24:35 Failed to login in UnidentifiedPatientKeyboardTest.unidentifiedPatientKeyboardTest, trying again...
22-Nov-2021 20:24:35 Failed to login in UnidentifiedPatientKeyboardTest.unidentifiedPatientKeyboardTest, trying again...
22-Nov-2021 20:24:35 Failed to login in UnidentifiedPatientKeyboardTest.unidentifiedPatientKeyboardTest, trying again...
22-Nov-2021 20:24:35 Failed to login in UnidentifiedPatientKeyboardTest.unidentifiedPatientKeyboardTest, trying again...
22-Nov-2021 20:24:35 Failed to login in UnidentifiedPatientKeyboardTest.unidentifiedPatientKeyboardTest, trying again...
22-Nov-2021 20:24:35 Failed to login in UnidentifiedPatientKeyboardTest.unidentifiedPatientKeyboardTest, trying again...
22-Nov-2021 20:24:35 Failed to login in UnidentifiedPatientKeyboardTest.unidentifiedPatientKeyboardTest, trying again...
22-Nov-2021 20:24:35 Failed to login in UnidentifiedPatientKeyboardTest.unidentifiedPatientKeyboardTest, trying again...
22-Nov-2021 20:24:35 Failed to login in UnidentifiedPatientKeyboardTest.unidentifiedPatientKeyboardTest, trying again...
22-Nov-2021 20:24:35 Failed to login in UnidentifiedPatientKeyboardTest.unidentifiedPatientKeyboardTest, trying again...
22-Nov-2021 20:24:35 Failed to login in UnidentifiedPatientKeyboardTest.unidentifiedPatientKeyboardTest, trying again...
22-Nov-2021 20:24:35 Failed to login in UnidentifiedPatientKeyboardTest.unidentifiedPatientKeyboardTest, trying again...
22-Nov-2021 20:24:35 Failed to login in UnidentifiedPatientKeyboardTest.unidentifiedPatientKeyboardTest, trying again...
22-Nov-2021 20:24:35 Failed to login in UnidentifiedPatientKeyboardTest.unidentifiedPatientKeyboardTest, trying again...
22-Nov-2021 20:24:35 Failed to login in UnidentifiedPatientKeyboardTest.unidentifiedPatientKeyboardTest, trying again...
22-Nov-2021 20:24:35 Failed to login in UnidentifiedPatientKeyboardTest.unidentifiedPatientKeyboardTest, trying again...
22-Nov-2021 20:24:35 Failed to login in UnidentifiedPatientKeyboardTest.unidentifiedPatientKeyboardTest, trying again...
22-Nov-2021 20:24:35 Failed to login in UnidentifiedPatientKeyboardTest.unidentifiedPatientKeyboardTest, trying again...
22-Nov-2021 20:24:36 Failed to login in UnidentifiedPatientKeyboardTest.unidentifiedPatientKeyboardTest, trying again...
22-Nov-2021 20:24:36 Failed to login in UnidentifiedPatientKeyboardTest.unidentifiedPatientKeyboardTest, trying again...
22-Nov-2021 20:24:36 Failed to login in UnidentifiedPatientKeyboardTest.unidentifiedPatientKeyboardTest, trying again...
22-Nov-2021 20:24:36 Failed to login in UnidentifiedPatientKeyboardTest.unidentifiedPatientKeyboardTest, trying again...
22-Nov-2021 20:24:36 Failed to login in UnidentifiedPatientKeyboardTest.unidentifiedPatientKeyboardTest, trying again...
22-Nov-2021 20:24:36 Failed to login in UnidentifiedPatientKeyboardTest.unidentifiedPatientKeyboardTest, trying again...
22-Nov-2021 20:24:36 Failed to login in UnidentifiedPatientKeyboardTest.unidentifiedPatientKeyboardTest, trying again...
22-Nov-2021 20:24:36 Failed to login in UnidentifiedPatientKeyboardTest.unidentifiedPatientKeyboardTest, trying again...
22-Nov-2021 20:24:36 Failed to login in UnidentifiedPatientKeyboardTest.unidentifiedPatientKeyboardTest, trying again...
22-Nov-2021 20:24:36 Failed to login in UnidentifiedPatientKeyboardTest.unidentifiedPatientKeyboardTest, trying again...
22-Nov-2021 20:24:36 Failed to login in UnidentifiedPatientKeyboardTest.unidentifiedPatientKeyboardTest, trying again...
22-Nov-2021 20:24:36 Failed to login in UnidentifiedPatientKeyboardTest.unidentifiedPatientKeyboardTest, trying again...
22-Nov-2021 20:24:36 Failed to login in UnidentifiedPatientKeyboardTest.unidentifiedPatientKeyboardTest, trying again...
22-Nov-2021 20:24:36 Failed to login in UnidentifiedPatientKeyboardTest.unidentifiedPatientKeyboardTest, trying again...
22-Nov-2021 20:24:36 Failed to login in UnidentifiedPatientKeyboardTest.unidentifiedPatientKeyboardTest, trying again...
22-Nov-2021 20:24:36 Failed to login in UnidentifiedPatientKeyboardTest.unidentifiedPatientKeyboardTest, trying again...
22-Nov-2021 20:24:36 Failed to login in UnidentifiedPatientKeyboardTest.unidentifiedPatientKeyboardTest, trying again...
22-Nov-2021 20:24:36 Failed to login in UnidentifiedPatientKeyboardTest.unidentifiedPatientKeyboardTest, trying again...
22-Nov-2021 20:24:36 Failed to login in UnidentifiedPatientKeyboardTest.unidentifiedPatientKeyboardTest, trying again...
22-Nov-2021 20:24:36 Failed to login in UnidentifiedPatientKeyboardTest.unidentifiedPatientKeyboardTest, trying again...
22-Nov-2021 20:24:36 Failed to login in UnidentifiedPatientKeyboardTest.unidentifiedPatientKeyboardTest, trying again...
22-Nov-2021 20:24:36 Failed to login in UnidentifiedPatientKeyboardTest.unidentifiedPatientKeyboardTest, trying again...
22-Nov-2021 20:24:36 Failed to login in UnidentifiedPatientKeyboardTest.unidentifiedPatientKeyboardTest, trying again...
22-Nov-2021 20:24:36 Failed to login in UnidentifiedPatientKeyboardTest.unidentifiedPatientKeyboardTest, trying again...
22-Nov-2021 20:24:36 Failed to login in UnidentifiedPatientKeyboardTest.unidentifiedPatientKeyboardTest, trying again...
22-Nov-2021 20:24:36 Failed to login in UnidentifiedPatientKeyboardTest.unidentifiedPatientKeyboardTest, trying again...
22-Nov-2021 20:24:36 Failed to login in UnidentifiedPatientKeyboardTest.unidentifiedPatientKeyboardTest, trying again...
22-Nov-2021 20:24:36 Failed to login in UnidentifiedPatientKeyboardTest.unidentifiedPatientKeyboardTest, trying again...
22-Nov-2021 20:24:36 Failed to login in UnidentifiedPatientKeyboardTest.unidentifiedPatientKeyboardTest, trying again...
22-Nov-2021 20:24:36 Failed to login in UnidentifiedPatientKeyboardTest.unidentifiedPatientKeyboardTest, trying again...
22-Nov-2021 20:24:36 Failed to login in UnidentifiedPatientKeyboardTest.unidentifiedPatientKeyboardTest, trying again...
22-Nov-2021 20:24:37 Failed to login in UnidentifiedPatientKeyboardTest.unidentifiedPatientKeyboardTest, trying again...
22-Nov-2021 20:24:37 Failed to login in UnidentifiedPatientKeyboardTest.unidentifiedPatientKeyboardTest, trying again...
22-Nov-2021 20:24:37 Failed to login in UnidentifiedPatientKeyboardTest.unidentifiedPatientKeyboardTest, trying again...
22-Nov-2021 20:24:37 Failed to login in UnidentifiedPatientKeyboardTest.unidentifiedPatientKeyboardTest, trying again...
22-Nov-2021 20:24:37 Failed to login in UnidentifiedPatientKeyboardTest.unidentifiedPatientKeyboardTest, trying again...
22-Nov-2021 20:24:37 Failed to login in UnidentifiedPatientKeyboardTest.unidentifiedPatientKeyboardTest, trying again...
22-Nov-2021 20:24:37 Failed to login in UnidentifiedPatientKeyboardTest.unidentifiedPatientKeyboardTest, trying again...
22-Nov-2021 20:24:37 Failed to login in UnidentifiedPatientKeyboardTest.unidentifiedPatientKeyboardTest, trying again...
22-Nov-2021 20:24:37 Failed to login in UnidentifiedPatientKeyboardTest.unidentifiedPatientKeyboardTest, trying again...
22-Nov-2021 20:24:37 Failed to login in UnidentifiedPatientKeyboardTest.unidentifiedPatientKeyboardTest, trying again...
22-Nov-2021 20:24:37 Failed to login in UnidentifiedPatientKeyboardTest.unidentifiedPatientKeyboardTest, trying again...
22-Nov-2021 20:24:37 Failed to login in UnidentifiedPatientKeyboardTest.unidentifiedPatientKeyboardTest, trying again...
22-Nov-2021 20:24:37 Failed to login in UnidentifiedPatientKeyboardTest.unidentifiedPatientKeyboardTest, trying again...
22-Nov-2021 20:24:37 Failed to login in UnidentifiedPatientKeyboardTest.unidentifiedPatientKeyboardTest, trying again...
22-Nov-2021 20:24:37 Failed to login in UnidentifiedPatientKeyboardTest.unidentifiedPatientKeyboardTest, trying again...
22-Nov-2021 20:24:37 Failed to login in UnidentifiedPatientKeyboardTest.unidentifiedPatientKeyboardTest, trying again...
22-Nov-2021 20:24:37 Failed to login in UnidentifiedPatientKeyboardTest.unidentifiedPatientKeyboardTest, trying again...
22-Nov-2021 20:24:37 Failed to login in UnidentifiedPatientKeyboardTest.unidentifiedPatientKeyboardTest, trying again...
22-Nov-2021 20:24:37 Failed to login in UnidentifiedPatientKeyboardTest.unidentifiedPatientKeyboardTest, trying again...
22-Nov-2021 20:24:37 Failed to login in UnidentifiedPatientKeyboardTest.unidentifiedPatientKeyboardTest, trying again...
22-Nov-2021 20:24:37 Failed to login in UnidentifiedPatientKeyboardTest.unidentifiedPatientKeyboardTest, trying again...
22-Nov-2021 20:24:37 Failed to login in UnidentifiedPatientKeyboardTest.unidentifiedPatientKeyboardTest, trying again...
22-Nov-2021 20:24:37 Failed to login in UnidentifiedPatientKeyboardTest.unidentifiedPatientKeyboardTest, trying again...
22-Nov-2021 20:24:37 Failed to login in UnidentifiedPatientKeyboardTest.unidentifiedPatientKeyboardTest, trying again...
22-Nov-2021 20:24:37 Failed to login in UnidentifiedPatientKeyboardTest.unidentifiedPatientKeyboardTest, trying again...
22-Nov-2021 20:24:37 Failed to login in UnidentifiedPatientKeyboardTest.unidentifiedPatientKeyboardTest, trying again...
22-Nov-2021 20:24:37 Failed to login in UnidentifiedPatientKeyboardTest.unidentifiedPatientKeyboardTest, trying again...
22-Nov-2021 20:24:37 Failed to login in UnidentifiedPatientKeyboardTest.unidentifiedPatientKeyboardTest, trying again...
22-Nov-2021 20:24:37 Failed to login in UnidentifiedPatientKeyboardTest.unidentifiedPatientKeyboardTest, trying again...
22-Nov-2021 20:24:37 Failed to login in UnidentifiedPatientKeyboardTest.unidentifiedPatientKeyboardTest, trying again...
22-Nov-2021 20:24:38 Failed to login in UnidentifiedPatientKeyboardTest.unidentifiedPatientKeyboardTest, trying again...
22-Nov-2021 20:24:38 Failed to login in UnidentifiedPatientKeyboardTest.unidentifiedPatientKeyboardTest, trying again...
22-Nov-2021 20:24:38 Failed to login in UnidentifiedPatientKeyboardTest.unidentifiedPatientKeyboardTest, trying again...
22-Nov-2021 20:24:38 Failed to login in UnidentifiedPatientKeyboardTest.unidentifiedPatientKeyboardTest, trying again...
22-Nov-2021 20:24:38 Failed to login in UnidentifiedPatientKeyboardTest.unidentifiedPatientKeyboardTest, trying again...
22-Nov-2021 20:24:38 Failed to login in UnidentifiedPatientKeyboardTest.unidentifiedPatientKeyboardTest, trying again...
22-Nov-2021 20:24:38 Failed to login in UnidentifiedPatientKeyboardTest.unidentifiedPatientKeyboardTest, trying again...
22-Nov-2021 20:24:38 Failed to login in UnidentifiedPatientKeyboardTest.unidentifiedPatientKeyboardTest, trying again...
22-Nov-2021 20:24:38 Failed to login in UnidentifiedPatientKeyboardTest.unidentifiedPatientKeyboardTest, trying again...
22-Nov-2021 20:24:38 Failed to login in UnidentifiedPatientKeyboardTest.unidentifiedPatientKeyboardTest, trying again...
22-Nov-2021 20:24:38 Failed to login in UnidentifiedPatientKeyboardTest.unidentifiedPatientKeyboardTest, trying again...
22-Nov-2021 20:24:38 Failed to login in UnidentifiedPatientKeyboardTest.unidentifiedPatientKeyboardTest, trying again...
22-Nov-2021 20:24:38 Failed to login in UnidentifiedPatientKeyboardTest.unidentifiedPatientKeyboardTest, trying again...
22-Nov-2021 20:24:38 Failed to login in UnidentifiedPatientKeyboardTest.unidentifiedPatientKeyboardTest, trying again...
22-Nov-2021 20:24:38 Test killed due to server failure in UnidentifiedPatientKeyboardTest.unidentifiedPatientKeyboardTest
22-Nov-2021 20:24:38 java.lang.IllegalArgumentException: Status code of the supplied response [404] is not from the required status code family "SERVER_ERROR".
22-Nov-2021 20:24:38         at jakarta.ws.rs.WebApplicationException.validate(WebApplicationException.java:269)
22-Nov-2021 20:24:38         at jakarta.ws.rs.ServerErrorException.<init>(ServerErrorException.java:74)
22-Nov-2021 20:24:38         at org.openmrs.uitestframework.test.TestBase.goToLoginPage(TestBase.java:245)
22-Nov-2021 20:24:38         at org.openmrs.uitestframework.test.TestBase.login(TestBase.java:231)
22-Nov-2021 20:24:38         at org.openmrs.uitestframework.test.TestBase.launchBrowser(TestBase.java:191)
22-Nov-2021 20:24:38         at org.openmrs.uitestframework.test.TestBase.startWebDriver(TestBase.java:130)
22-Nov-2021 20:24:38         at sun.reflect.NativeMethodAccessorImpl.invoke0(Native Method)
22-Nov-2021 20:24:38         at sun.reflect.NativeMethodAccessorImpl.invoke(NativeMethodAccessorImpl.java:62)
22-Nov-2021 20:24:38         at sun.reflect.DelegatingMethodAccessorImpl.invoke(DelegatingMethodAccessorImpl.java:43)
22-Nov-2021 20:24:38         at java.lang.reflect.Method.invoke(Method.java:498)
22-Nov-2021 20:24:38         at org.junit.runners.model.FrameworkMethod$1.runReflectiveCall(FrameworkMethod.java:59)
22-Nov-2021 20:24:38         at org.junit.internal.runners.model.ReflectiveCallable.run(ReflectiveCallable.java:12)
22-Nov-2021 20:24:38         at org.junit.runners.model.FrameworkMethod.invokeExplosively(FrameworkMethod.java:56)
22-Nov-2021 20:24:38         at org.junit.internal.runners.statements.RunBefores.invokeMethod(RunBefores.java:33)
22-Nov-2021 20:24:38         at org.junit.internal.runners.statements.RunBefores.evaluate(RunBefores.java:24)
22-Nov-2021 20:24:38         at org.junit.internal.runners.statements.RunAfters.evaluate(RunAfters.java:27)
22-Nov-2021 20:24:38         at org.junit.rules.TestWatcher$1.evaluate(TestWatcher.java:61)
22-Nov-2021 20:24:38         at org.junit.rules.TestWatcher$1.evaluate(TestWatcher.java:61)
22-Nov-2021 20:24:38         at org.junit.runners.ParentRunner$3.evaluate(ParentRunner.java:306)
22-Nov-2021 20:24:38         at org.junit.runners.BlockJUnit4ClassRunner$1.evaluate(BlockJUnit4ClassRunner.java:100)
22-Nov-2021 20:24:38         at org.junit.runners.ParentRunner.runLeaf(ParentRunner.java:366)
22-Nov-2021 20:24:38         at org.junit.runners.BlockJUnit4ClassRunner.runChild(BlockJUnit4ClassRunner.java:103)
22-Nov-2021 20:24:38         at org.junit.runners.BlockJUnit4ClassRunner.runChild(BlockJUnit4ClassRunner.java:63)
22-Nov-2021 20:24:38         at org.junit.runners.ParentRunner$4.run(ParentRunner.java:331)
22-Nov-2021 20:24:38         at org.junit.runners.ParentRunner$1.schedule(ParentRunner.java:79)
22-Nov-2021 20:24:38         at org.junit.runners.ParentRunner.runChildren(ParentRunner.java:329)
22-Nov-2021 20:24:38         at org.junit.runners.ParentRunner.access$100(ParentRunner.java:66)
22-Nov-2021 20:24:38         at org.junit.runners.ParentRunner$2.evaluate(ParentRunner.java:293)
22-Nov-2021 20:24:38         at org.junit.runners.ParentRunner$3.evaluate(ParentRunner.java:306)
22-Nov-2021 20:24:38         at org.junit.runners.ParentRunner.run(ParentRunner.java:413)
22-Nov-2021 20:24:38         at org.apache.maven.surefire.junit4.JUnit4Provider.execute(JUnit4Provider.java:236)
22-Nov-2021 20:24:38         at org.apache.maven.surefire.junit4.JUnit4Provider.executeTestSet(JUnit4Provider.java:134)
22-Nov-2021 20:24:38         at org.apache.maven.surefire.junit4.JUnit4Provider.invoke(JUnit4Provider.java:113)
22-Nov-2021 20:24:38         at sun.reflect.NativeMethodAccessorImpl.invoke0(Native Method)
22-Nov-2021 20:24:38         at sun.reflect.NativeMethodAccessorImpl.invoke(NativeMethodAccessorImpl.java:62)
22-Nov-2021 20:24:38         at sun.reflect.DelegatingMethodAccessorImpl.invoke(DelegatingMethodAccessorImpl.java:43)
22-Nov-2021 20:24:38         at java.lang.reflect.Method.invoke(Method.java:498)
22-Nov-2021 20:24:38         at org.apache.maven.surefire.util.ReflectionUtils.invokeMethodWithArray(ReflectionUtils.java:189)
22-Nov-2021 20:24:38         at org.apache.maven.surefire.booter.ProviderFactory$ProviderProxy.invoke(ProviderFactory.java:165)
22-Nov-2021 20:24:38         at org.apache.maven.surefire.booter.ProviderFactory.invokeProvider(ProviderFactory.java:85)
22-Nov-2021 20:24:38         at org.apache.maven.surefire.booter.ForkedBooter.runSuitesInProcess(ForkedBooter.java:103)
22-Nov-2021 20:24:38         at org.apache.maven.surefire.booter.ForkedBooter.main(ForkedBooter.java:74)
22-Nov-2021 20:24:39 Tests run: 3, Failures: 1, Errors: 2, Skipped: 0, Time elapsed: 627.311 sec <<< FAILURE!
22-Nov-2021 20:24:39 Running org.openmrs.reference.DeleteAllergyTest
22-Nov-2021 20:24:39 Tests run: 1, Failures: 1, Errors: 0, Skipped: 0, Time elapsed: 0.004 sec <<< FAILURE!
22-Nov-2021 20:24:39 Running org.openmrs.reference.SearchActiveVisitsTest
22-Nov-2021 20:24:39 Tests run: 1, Failures: 1, Errors: 0, Skipped: 0, Time elapsed: 0 sec <<< FAILURE!
22-Nov-2021 20:24:39 Running org.openmrs.reference.AddVisitTypeTest
22-Nov-2021 20:24:39 Tests run: 1, Failures: 1, Errors: 0, Skipped: 0, Time elapsed: 0.003 sec <<< FAILURE!
22-Nov-2021 20:24:39 Running org.openmrs.reference.FindPatientRecordTest
22-Nov-2021 20:24:39 Tests run: 1, Failures: 1, Errors: 0, Skipped: 0, Time elapsed: 0.001 sec <<< FAILURE!
22-Nov-2021 20:24:39 Running org.openmrs.reference.EditPersonTest
22-Nov-2021 20:24:39 Tests run: 2, Failures: 1, Errors: 1, Skipped: 0, Time elapsed: 0 sec <<< FAILURE!
22-Nov-2021 20:24:39 Running org.openmrs.reference.RetireLocationTest
22-Nov-2021 20:24:39 Tests run: 2, Failures: 1, Errors: 1, Skipped: 0, Time elapsed: 0.002 sec <<< FAILURE!
22-Nov-2021 20:24:39 Running org.openmrs.reference.XSSOnPhoneNumberFieldTest
22-Nov-2021 20:24:39 Tests run: 1, Failures: 1, Errors: 0, Skipped: 0, Time elapsed: 0.002 sec <<< FAILURE!
22-Nov-2021 20:24:39 Running org.openmrs.reference.TransferToWardServiceTest
22-Nov-2021 20:24:39 Tests run: 1, Failures: 1, Errors: 0, Skipped: 0, Time elapsed: 0.001 sec <<< FAILURE!
22-Nov-2021 20:24:39 Running org.openmrs.reference.EditVisitTypeTest
22-Nov-2021 20:24:39 Tests run: 2, Failures: 1, Errors: 1, Skipped: 0, Time elapsed: 0.004 sec <<< FAILURE!
22-Nov-2021 20:24:39 Running org.openmrs.reference.ComeBackToApplicationAfterLogoutTest
22-Nov-2021 20:24:39 Tests run: 1, Failures: 1, Errors: 0, Skipped: 0, Time elapsed: 0 sec <<< FAILURE!
22-Nov-2021 20:24:39 Running org.openmrs.reference.EditDemographicTest
22-Nov-2021 20:24:39 Tests run: 1, Failures: 1, Errors: 0, Skipped: 0, Time elapsed: 0 sec <<< FAILURE!
22-Nov-2021 20:24:39 Running org.openmrs.reference.DeleteVisitTypeTest
22-Nov-2021 20:24:39 Tests run: 2, Failures: 1, Errors: 1, Skipped: 0, Time elapsed: 0.001 sec <<< FAILURE!
22-Nov-2021 20:24:39 Running org.openmrs.reference.FormTest
22-Nov-2021 20:24:39 Tests run: 8, Failures: 4, Errors: 4, Skipped: 0, Time elapsed: 0.001 sec <<< FAILURE!
22-Nov-2021 20:24:39 Running org.openmrs.reference.RegisterUnidentifiedPatientTest
22-Nov-2021 20:24:39 Tests run: 2, Failures: 1, Errors: 1, Skipped: 0, Time elapsed: 0 sec <<< FAILURE!
22-Nov-2021 20:24:39 Running org.openmrs.reference.AddPatientAppointmentTest
22-Nov-2021 20:24:39 Tests run: 1, Failures: 1, Errors: 0, Skipped: 0, Time elapsed: 0 sec <<< FAILURE!
22-Nov-2021 20:24:39 Running org.openmrs.reference.AdmitExitInpatientTest
22-Nov-2021 20:24:39 Tests run: 1, Failures: 1, Errors: 0, Skipped: 0, Time elapsed: 0 sec <<< FAILURE!
22-Nov-2021 20:24:39 Running org.openmrs.reference.DeleteRequestAppointmentTest
22-Nov-2021 20:24:39 Tests run: 1, Failures: 1, Errors: 0, Skipped: 0, Time elapsed: 0.002 sec <<< FAILURE!
22-Nov-2021 20:24:39 Running org.openmrs.reference.EditAllergyTest
22-Nov-2021 20:24:39 Tests run: 1, Failures: 1, Errors: 0, Skipped: 0, Time elapsed: 0 sec <<< FAILURE!
22-Nov-2021 20:24:39 Running org.openmrs.reference.VisitNoteTest
22-Nov-2021 20:24:39 Tests run: 1, Failures: 1, Errors: 0, Skipped: 0, Time elapsed: 0.001 sec <<< FAILURE!
22-Nov-2021 20:24:39 Running org.openmrs.reference.CreatePersonTest
22-Nov-2021 20:24:39 Tests run: 1, Failures: 1, Errors: 0, Skipped: 0, Time elapsed: 0 sec <<< FAILURE!
22-Nov-2021 20:24:39 Running org.openmrs.reference.FindPatientByNameTest
22-Nov-2021 20:24:39 Tests run: 2, Failures: 1, Errors: 1, Skipped: 0, Time elapsed: 0 sec <<< FAILURE!
22-Nov-2021 20:24:39 Running org.openmrs.reference.AddUserTest
22-Nov-2021 20:24:39 Tests run: 1, Failures: 1, Errors: 0, Skipped: 0, Time elapsed: 0.001 sec <<< FAILURE!
22-Nov-2021 20:24:39 Running org.openmrs.reference.AddProviderTest
22-Nov-2021 20:24:39 Tests run: 2, Failures: 1, Errors: 1, Skipped: 0, Time elapsed: 0.002 sec <<< FAILURE!
22-Nov-2021 20:24:39 Running org.openmrs.reference.AddPastVisitTest
22-Nov-2021 20:24:39 Tests run: 1, Failures: 1, Errors: 0, Skipped: 0, Time elapsed: 0.02 sec <<< FAILURE!
22-Nov-2021 20:24:39 Running org.openmrs.reference.RecordMergeIssueTest
22-Nov-2021 20:24:39 Tests run: 2, Failures: 1, Errors: 1, Skipped: 0, Time elapsed: 0 sec <<< FAILURE!
22-Nov-2021 20:24:39 Running org.openmrs.reference.CaptureVitalsTest
22-Nov-2021 20:24:39 Tests run: 1, Failures: 1, Errors: 0, Skipped: 0, Time elapsed: 0 sec <<< FAILURE!
22-Nov-2021 20:24:39 Running org.openmrs.reference.NamePatientAccentedLetterTest
22-Nov-2021 20:24:39 Tests run: 2, Failures: 1, Errors: 1, Skipped: 0, Time elapsed: 0 sec <<< FAILURE!
22-Nov-2021 20:24:39 Running org.openmrs.reference.RetirePersonTest
22-Nov-2021 20:24:39 Tests run: 2, Failures: 1, Errors: 1, Skipped: 0, Time elapsed: 0 sec <<< FAILURE!
22-Nov-2021 20:24:39 Running org.openmrs.reference.EndVisitTest
22-Nov-2021 20:24:39 Tests run: 1, Failures: 1, Errors: 0, Skipped: 0, Time elapsed: 0 sec <<< FAILURE!
22-Nov-2021 20:24:39 Running org.openmrs.reference.DeleteAppointmentBlockTest
22-Nov-2021 20:24:39 Tests run: 1, Failures: 1, Errors: 0, Skipped: 0, Time elapsed: 0.001 sec <<< FAILURE!
22-Nov-2021 20:24:39 Running org.openmrs.reference.BookRequestAppointmentTest
22-Nov-2021 20:24:39 Tests run: 1, Failures: 1, Errors: 0, Skipped: 0, Time elapsed: 0 sec <<< FAILURE!
22-Nov-2021 20:24:39 Running org.openmrs.reference.AddDeleteServiceTest
22-Nov-2021 20:24:39 Tests run: 1, Failures: 1, Errors: 0, Skipped: 0, Time elapsed: 0 sec <<< FAILURE!
22-Nov-2021 20:24:39 Running org.openmrs.reference.AddEditAppointmentBlockTest
22-Nov-2021 20:24:39 Tests run: 1, Failures: 1, Errors: 0, Skipped: 0, Time elapsed: 0 sec <<< FAILURE!
22-Nov-2021 20:24:39 Running org.openmrs.reference.RetireProviderTest
22-Nov-2021 20:24:39 Tests run: 2, Failures: 1, Errors: 1, Skipped: 0, Time elapsed: 0 sec <<< FAILURE!
22-Nov-2021 20:24:39 Running org.openmrs.reference.MergePatientTest
22-Nov-2021 20:24:39 Tests run: 1, Failures: 1, Errors: 0, Skipped: 0, Time elapsed: 0.004 sec <<< FAILURE!
22-Nov-2021 20:24:39 Running org.openmrs.reference.AddDeleteLocationTest
22-Nov-2021 20:24:39 Tests run: 2, Failures: 1, Errors: 1, Skipped: 0, Time elapsed: 0.075 sec <<< FAILURE!
22-Nov-2021 20:24:39 Running org.openmrs.reference.DuplicatePatientRegisterTest
22-Nov-2021 20:24:39 Tests run: 2, Failures: 1, Errors: 1, Skipped: 0, Time elapsed: 0 sec <<< FAILURE!
22-Nov-2021 20:24:39 Running org.openmrs.reference.UsingBackButtonInMergePatientTest
22-Nov-2021 20:24:39 Tests run: 2, Failures: 1, Errors: 1, Skipped: 0, Time elapsed: 0 sec <<< FAILURE!
22-Nov-2021 20:24:39 Running org.openmrs.reference.AddDiagnosisToVisitNoteTest
22-Nov-2021 20:24:39 Tests run: 1, Failures: 1, Errors: 0, Skipped: 0, Time elapsed: 0 sec <<< FAILURE!
22-Nov-2021 20:24:39 Running org.openmrs.reference.MergeVisitsTest
22-Nov-2021 20:24:39 Tests run: 2, Failures: 1, Errors: 1, Skipped: 0, Time elapsed: 0.001 sec <<< FAILURE!
22-Nov-2021 20:24:39 Running org.openmrs.reference.CheckModulesTest
22-Nov-2021 20:24:39 Tests run: 1, Failures: 1, Errors: 0, Skipped: 0, Time elapsed: 0 sec <<< FAILURE!
22-Nov-2021 20:24:39 Running org.openmrs.reference.EditServiceTest
22-Nov-2021 20:24:39 Tests run: 1, Failures: 1, Errors: 0, Skipped: 0, Time elapsed: 0.002 sec <<< FAILURE!
22-Nov-2021 20:24:39 Running org.openmrs.reference.AddNewAllergyTest
22-Nov-2021 20:24:39 Tests run: 1, Failures: 1, Errors: 0, Skipped: 0, Time elapsed: 0.002 sec <<< FAILURE!
22-Nov-2021 20:24:39 Running org.openmrs.reference.LoginTest
22-Nov-2021 20:24:39 Tests run: 5, Failures: 5, Errors: 0, Skipped: 0, Time elapsed: 0.008 sec <<< FAILURE!
22-Nov-2021 20:24:39 Running org.openmrs.reference.DeleteProviderTest
22-Nov-2021 20:24:39 Tests run: 2, Failures: 1, Errors: 1, Skipped: 0, Time elapsed: 0.039 sec <<< FAILURE!
22-Nov-2021 20:24:39 Running org.openmrs.reference.RegisterPatientTest
22-Nov-2021 20:24:39 Tests run: 2, Failures: 1, Errors: 1, Skipped: 0, Time elapsed: 0.001 sec <<< FAILURE!
22-Nov-2021 20:24:39 Running org.openmrs.reference.ContactInfoTest
22-Nov-2021 20:24:39 Tests run: 1, Failures: 1, Errors: 0, Skipped: 0, Time elapsed: 0.002 sec <<< FAILURE!
22-Nov-2021 20:24:39 Running org.openmrs.reference.StartVisitTest
22-Nov-2021 20:24:39 Tests run: 1, Failures: 1, Errors: 0, Skipped: 0, Time elapsed: 0.002 sec <<< FAILURE!
22-Nov-2021 20:24:39 Running org.openmrs.reference.DeletePersonTest
22-Nov-2021 20:24:39 Tests run: 2, Failures: 1, Errors: 1, Skipped: 0, Time elapsed: 0.057 sec <<< FAILURE!
22-Nov-2021 20:24:39 Running org.openmrs.reference.EditProviderTest
22-Nov-2021 20:24:39 Tests run: 2, Failures: 1, Errors: 1, Skipped: 0, Time elapsed: 0.06 sec <<< FAILURE!
22-Nov-2021 20:24:39 Running org.openmrs.reference.RetireVisitTypeTest
22-Nov-2021 20:24:39 Tests run: 2, Failures: 1, Errors: 1, Skipped: 0, Time elapsed: 0.045 sec <<< FAILURE!
22-Nov-2021 20:24:40
22-Nov-2021 20:24:40 Results :
22-Nov-2021 20:24:40
22-Nov-2021 20:24:40 Failed tests:   unidentifiedPatientKeyboardTest(org.openmrs.reference.UnidentifiedPatientKeyboardTest): Test killed due to server failure
22-Nov-2021 20:24:40   deleteAllergyTest(org.openmrs.reference.DeleteAllergyTest): Test killed due to server failure
22-Nov-2021 20:24:40   searchActiveVisitsTest(org.openmrs.reference.SearchActiveVisitsTest): Test killed due to server failure
22-Nov-2021 20:24:40   addVisitTypeTest(org.openmrs.reference.AddVisitTypeTest): Test killed due to server failure
22-Nov-2021 20:24:40   findPatientRecordTest(org.openmrs.reference.FindPatientRecordTest): Test killed due to server failure
22-Nov-2021 20:24:40   editPersonTest(org.openmrs.reference.EditPersonTest): Test killed due to server failure
22-Nov-2021 20:24:40   retireLocationTest(org.openmrs.reference.RetireLocationTest): Test killed due to server failure
22-Nov-2021 20:24:40   xssOnPhoneNumberFieldTest(org.openmrs.reference.XSSOnPhoneNumberFieldTest): Test killed due to server failure
22-Nov-2021 20:24:40   transferToWardServiceTest(org.openmrs.reference.TransferToWardServiceTest): Test killed due to server failure
22-Nov-2021 20:24:40   editVisitTypeTest(org.openmrs.reference.EditVisitTypeTest): Test killed due to server failure
22-Nov-2021 20:24:40   comeBackToApplicationAfterLogoutTest(org.openmrs.reference.ComeBackToApplicationAfterLogoutTest): Test killed due to server failure
22-Nov-2021 20:24:40   editDemographicTest(org.openmrs.reference.EditDemographicTest): Test killed due to server failure
22-Nov-2021 20:24:40   deleteVisitTypeTest(org.openmrs.reference.DeleteVisitTypeTest): Test killed due to server failure
22-Nov-2021 20:24:40   deleteFormTest(org.openmrs.reference.FormTest): Test killed due to server failure
22-Nov-2021 20:24:40   editFormTest(org.openmrs.reference.FormTest): Test killed due to server failure
22-Nov-2021 20:24:40   initiateFormPresence(org.openmrs.reference.FormTest): Test killed due to server failure
22-Nov-2021 20:24:40   addFormTest(org.openmrs.reference.FormTest): Test killed due to server failure
22-Nov-2021 20:24:40   registerUnidentifiedPatientTest(org.openmrs.reference.RegisterUnidentifiedPatientTest): Test killed due to server failure
22-Nov-2021 20:24:40   addPatientAppointmentTest(org.openmrs.reference.AddPatientAppointmentTest): Test killed due to server failure
22-Nov-2021 20:24:40   admitExitInpatientTest(org.openmrs.reference.AdmitExitInpatientTest): Test killed due to server failure
22-Nov-2021 20:24:40   deleteRequestAppointmentTest(org.openmrs.reference.DeleteRequestAppointmentTest): Test killed due to server failure
22-Nov-2021 20:24:40   editAllergyTest(org.openmrs.reference.EditAllergyTest): Test killed due to server failure
22-Nov-2021 20:24:40   visitNoteTest(org.openmrs.reference.VisitNoteTest): Test killed due to server failure
22-Nov-2021 20:24:40   createPersonTest(org.openmrs.reference.CreatePersonTest): Test killed due to server failure
22-Nov-2021 20:24:40   findPatientByNameTest(org.openmrs.reference.FindPatientByNameTest): Test killed due to server failure
22-Nov-2021 20:24:40   addUserTest(org.openmrs.reference.AddUserTest): Test killed due to server failure
22-Nov-2021 20:24:40   addProviderTest(org.openmrs.reference.AddProviderTest): Test killed due to server failure
22-Nov-2021 20:24:40   addPastVisitTest(org.openmrs.reference.AddPastVisitTest): Test killed due to server failure
22-Nov-2021 20:24:40   recordMergeIssueTest(org.openmrs.reference.RecordMergeIssueTest): Test killed due to server failure
22-Nov-2021 20:24:40   captureVitalsTest(org.openmrs.reference.CaptureVitalsTest): Test killed due to server failure
22-Nov-2021 20:24:40   namePatientAccentedLetterTest(org.openmrs.reference.NamePatientAccentedLetterTest): Test killed due to server failure
22-Nov-2021 20:24:40   retirePersonTest(org.openmrs.reference.RetirePersonTest): Test killed due to server failure
22-Nov-2021 20:24:40   endVisitTest(org.openmrs.reference.EndVisitTest): Test killed due to server failure
22-Nov-2021 20:24:40   deleteAppointmentBlockTest(org.openmrs.reference.DeleteAppointmentBlockTest): Test killed due to server failure
22-Nov-2021 20:24:40   bookRequestAppointmentTest(org.openmrs.reference.BookRequestAppointmentTest): Test killed due to server failure
22-Nov-2021 20:24:40   addDeleteServiceTest(org.openmrs.reference.AddDeleteServiceTest): Test killed due to server failure
22-Nov-2021 20:24:40   addEditAppointmentBlockTest(org.openmrs.reference.AddEditAppointmentBlockTest): Test killed due to server failure
22-Nov-2021 20:24:40   retireProviderTest(org.openmrs.reference.RetireProviderTest): Test killed due to server failure
22-Nov-2021 20:24:40   mergePatientTest(org.openmrs.reference.MergePatientTest): Test killed due to server failure
22-Nov-2021 20:24:40   addLocationTest(org.openmrs.reference.AddDeleteLocationTest): Test killed due to server failure
22-Nov-2021 20:24:40   duplicatePatientRegisterTest(org.openmrs.reference.DuplicatePatientRegisterTest): Test killed due to server failure
22-Nov-2021 20:24:40   usingBackButtonInMergePatientTest(org.openmrs.reference.UsingBackButtonInMergePatientTest): Test killed due to server failure
22-Nov-2021 20:24:40   addDiagnosisToVisitNoteTest(org.openmrs.reference.AddDiagnosisToVisitNoteTest): Test killed due to server failure
22-Nov-2021 20:24:40   mergeVisitsTest(org.openmrs.reference.MergeVisitsTest): Test killed due to server failure
22-Nov-2021 20:24:40   checkModulesTest(org.openmrs.reference.CheckModulesTest): Test killed due to server failure
22-Nov-2021 20:24:40   editServiceTest(org.openmrs.reference.EditServiceTest): Test killed due to server failure
22-Nov-2021 20:24:40   addNewAllergyTest(org.openmrs.reference.AddNewAllergyTest): Test killed due to server failure
22-Nov-2021 20:24:40   verifyNurseModulesAvailableOnHomePage(org.openmrs.reference.LoginTest): Test killed due to server failure
22-Nov-2021 20:24:40   verifyModulesAvailableOnHomePage(org.openmrs.reference.LoginTest): Test killed due to server failure
22-Nov-2021 20:24:40   verifySysadminModulesAvailableOnHomePage(org.openmrs.reference.LoginTest): Test killed due to server failure
22-Nov-2021 20:24:40   verifyClerkModulesAvailableOnHomePage(org.openmrs.reference.LoginTest): Test killed due to server failure
22-Nov-2021 20:24:40   verifyDoctorModulesAvailableOnHomePage(org.openmrs.reference.LoginTest): Test killed due to server failure
22-Nov-2021 20:24:40   deleteProviderTest(org.openmrs.reference.DeleteProviderTest): Test killed due to server failure
22-Nov-2021 20:24:40   registerPatientTest(org.openmrs.reference.RegisterPatientTest): Test killed due to server failure
22-Nov-2021 20:24:40   contactInfoTest(org.openmrs.reference.ContactInfoTest): Test killed due to server failure
22-Nov-2021 20:24:40   startVisitTest(org.openmrs.reference.StartVisitTest): Test killed due to server failure
22-Nov-2021 20:24:40   deletePersonTest(org.openmrs.reference.DeletePersonTest): Test killed due to server failure
22-Nov-2021 20:24:40   editProviderTest(org.openmrs.reference.EditProviderTest): Test killed due to server failure
22-Nov-2021 20:24:40   retireVisitTypeTest(org.openmrs.reference.RetireVisitTypeTest): Test killed due to server failure
22-Nov-2021 20:24:40
22-Nov-2021 20:24:40 Tests in error:
22-Nov-2021 20:24:40   unidentifiedPatientKeyboardTest(org.openmrs.reference.UnidentifiedPatientKeyboardTest)
22-Nov-2021 20:24:40   unidentifiedPatientKeyboardTest(org.openmrs.reference.UnidentifiedPatientKeyboardTest): Session ID is null. Using WebDriver after calling quit()?(..)
22-Nov-2021 20:24:40   editPersonTest(org.openmrs.reference.EditPersonTest): Delete request failed: https://qa-refapp.openmrs.org/openmrs/ws/rest/v1/person/null?purge=true
22-Nov-2021 20:24:40   retireLocationTest(org.openmrs.reference.RetireLocationTest): Delete request failed: https://qa-refapp.openmrs.org/openmrs/ws/rest/v1/location/null?purge=true
22-Nov-2021 20:24:40   editVisitTypeTest(org.openmrs.reference.EditVisitTypeTest): Delete request failed: https://qa-refapp.openmrs.org/openmrs/ws/rest/v1/visittype/null?purge=true
22-Nov-2021 20:24:40   deleteVisitTypeTest(org.openmrs.reference.DeleteVisitTypeTest): Delete request failed: https://qa-refapp.openmrs.org/openmrs/ws/rest/v1/visittype/null?purge=true
22-Nov-2021 20:24:40   deleteFormTest(org.openmrs.reference.FormTest)
22-Nov-2021 20:24:40   editFormTest(org.openmrs.reference.FormTest)
22-Nov-2021 20:24:40   initiateFormPresence(org.openmrs.reference.FormTest)
22-Nov-2021 20:24:40   addFormTest(org.openmrs.reference.FormTest)
22-Nov-2021 20:24:40   registerUnidentifiedPatientTest(org.openmrs.reference.RegisterUnidentifiedPatientTest)
22-Nov-2021 20:24:40   findPatientByNameTest(org.openmrs.reference.FindPatientByNameTest)
22-Nov-2021 20:24:40   addProviderTest(org.openmrs.reference.AddProviderTest): Delete request failed: https://qa-refapp.openmrs.org/openmrs/ws/rest/v1/person/null?purge=true
22-Nov-2021 20:24:40   recordMergeIssueTest(org.openmrs.reference.RecordMergeIssueTest)
22-Nov-2021 20:24:40   namePatientAccentedLetterTest(org.openmrs.reference.NamePatientAccentedLetterTest)
22-Nov-2021 20:24:40   retirePersonTest(org.openmrs.reference.RetirePersonTest): Delete request failed: https://qa-refapp.openmrs.org/openmrs/ws/rest/v1/person/null?purge=true
22-Nov-2021 20:24:40   retireProviderTest(org.openmrs.reference.RetireProviderTest): Delete request failed: https://qa-refapp.openmrs.org/openmrs/ws/rest/v1/provider/null?purge=true
22-Nov-2021 20:24:40   addLocationTest(org.openmrs.reference.AddDeleteLocationTest): Delete request failed: https://qa-refapp.openmrs.org/openmrs/ws/rest/v1//locationtag/null?purge=true
22-Nov-2021 20:24:40   duplicatePatientRegisterTest(org.openmrs.reference.DuplicatePatientRegisterTest)
22-Nov-2021 20:24:40   usingBackButtonInMergePatientTest(org.openmrs.reference.UsingBackButtonInMergePatientTest)
22-Nov-2021 20:24:40   mergeVisitsTest(org.openmrs.reference.MergeVisitsTest)
22-Nov-2021 20:24:40   deleteProviderTest(org.openmrs.reference.DeleteProviderTest): Delete request failed: https://qa-refapp.openmrs.org/openmrs/ws/rest/v1/provider/null?purge=true
22-Nov-2021 20:24:40   registerPatientTest(org.openmrs.reference.RegisterPatientTest)
22-Nov-2021 20:24:40   deletePersonTest(org.openmrs.reference.DeletePersonTest): Delete request failed: https://qa-refapp.openmrs.org/openmrs/ws/rest/v1/person/null?purge=true
22-Nov-2021 20:24:40   editProviderTest(org.openmrs.reference.EditProviderTest): Delete request failed: https://qa-refapp.openmrs.org/openmrs/ws/rest/v1/provider/null?purge=true
22-Nov-2021 20:24:40   retireVisitTypeTest(org.openmrs.reference.RetireVisitTypeTest): Delete request failed: https://qa-refapp.openmrs.org/openmrs/ws/rest/v1/visittype/null?purge=true
22-Nov-2021 20:24:40
22-Nov-2021 20:24:40 Tests run: 85, Failures: 59, Errors: 26, Skipped: 0
22-Nov-2021 20:24:40
22-Nov-2021 20:24:40 [INFO] ------------------------------------------------------------------------
22-Nov-2021 20:24:40 [INFO] Reactor Summary:
22-Nov-2021 20:24:40 [INFO]
22-Nov-2021 20:24:40 [INFO] Reference Application Distribution ................. SUCCESS [  0.301 s]
22-Nov-2021 20:24:40 [INFO] Reference Application Distribution Package ......... SUCCESS [01:44 min]
22-Nov-2021 20:24:40 [INFO] Reference Application Distribution UI Tests ........ FAILURE [10:34 min]
22-Nov-2021 20:24:40 [INFO] ------------------------------------------------------------------------
22-Nov-2021 20:24:40 [INFO] BUILD FAILURE
22-Nov-2021 20:24:40 [INFO] ------------------------------------------------------------------------
22-Nov-2021 20:24:40 [INFO] Total time: 12:19 min
22-Nov-2021 20:24:40 [INFO] Finished at: 2021-11-22T20:24:40+00:00
22-Nov-2021 20:24:40 [INFO] Final Memory: 55M/408M
22-Nov-2021 20:24:40 [INFO] ------------------------------------------------------------------------
22-Nov-2021 20:24:40 [ERROR] Failed to execute goal org.apache.maven.plugins:maven-surefire-plugin:2.12:test (default-test) on project referenceapplication-ui-tests: There are test failures.
22-Nov-2021 20:24:40 [ERROR]
22-Nov-2021 20:24:40 [ERROR] Please refer to /home/bamboo-agent/bamboo-agent/xml-data/build-dir/REFAPP-UI-FRAMEWORK/ui-tests/target/surefire-reports for the individual test results.
22-Nov-2021 20:24:40 [ERROR] -> [Help 1]
22-Nov-2021 20:24:40 org.apache.maven.lifecycle.LifecycleExecutionException: Failed to execute goal org.apache.maven.plugins:maven-surefire-plugin:2.12:test (default-test) on project referenceapplication-ui-tests: There are test failures.
22-Nov-2021 20:24:40
22-Nov-2021 20:24:40 Please refer to /home/bamboo-agent/bamboo-agent/xml-data/build-dir/REFAPP-UI-FRAMEWORK/ui-tests/target/surefire-reports for the individual test results.
22-Nov-2021 20:24:40         at org.apache.maven.lifecycle.internal.MojoExecutor.execute(MojoExecutor.java:212)
22-Nov-2021 20:24:40         at org.apache.maven.lifecycle.internal.MojoExecutor.execute(MojoExecutor.java:153)
22-Nov-2021 20:24:40         at org.apache.maven.lifecycle.internal.MojoExecutor.execute(MojoExecutor.java:145)
22-Nov-2021 20:24:40         at org.apache.maven.lifecycle.internal.LifecycleModuleBuilder.buildProject(LifecycleModuleBuilder.java:116)
22-Nov-2021 20:24:40         at org.apache.maven.lifecycle.internal.LifecycleModuleBuilder.buildProject(LifecycleModuleBuilder.java:80)
22-Nov-2021 20:24:40         at org.apache.maven.lifecycle.internal.builder.singlethreaded.SingleThreadedBuilder.build(SingleThreadedBuilder.java:51)
22-Nov-2021 20:24:40         at org.apache.maven.lifecycle.internal.LifecycleStarter.execute(LifecycleStarter.java:128)
22-Nov-2021 20:24:40         at org.apache.maven.DefaultMaven.doExecute(DefaultMaven.java:307)
22-Nov-2021 20:24:40         at org.apache.maven.DefaultMaven.doExecute(DefaultMaven.java:193)
22-Nov-2021 20:24:40         at org.apache.maven.DefaultMaven.execute(DefaultMaven.java:106)
22-Nov-2021 20:24:40         at org.apache.maven.cli.MavenCli.execute(MavenCli.java:863)
22-Nov-2021 20:24:40         at org.apache.maven.cli.MavenCli.doMain(MavenCli.java:288)
22-Nov-2021 20:24:40         at org.apache.maven.cli.MavenCli.main(MavenCli.java:199)
22-Nov-2021 20:24:40         at sun.reflect.NativeMethodAccessorImpl.invoke0(Native Method)
22-Nov-2021 20:24:40         at sun.reflect.NativeMethodAccessorImpl.invoke(NativeMethodAccessorImpl.java:62)
22-Nov-2021 20:24:40         at sun.reflect.DelegatingMethodAccessorImpl.invoke(DelegatingMethodAccessorImpl.java:43)
22-Nov-2021 20:24:40         at java.lang.reflect.Method.invoke(Method.java:498)
22-Nov-2021 20:24:40         at org.codehaus.plexus.classworlds.launcher.Launcher.launchEnhanced(Launcher.java:289)
22-Nov-2021 20:24:40         at org.codehaus.plexus.classworlds.launcher.Launcher.launch(Launcher.java:229)
22-Nov-2021 20:24:40         at org.codehaus.plexus.classworlds.launcher.Launcher.mainWithExitCode(Launcher.java:415)
22-Nov-2021 20:24:40         at org.codehaus.plexus.classworlds.launcher.Launcher.main(Launcher.java:356)
22-Nov-2021 20:24:40 Caused by: org.apache.maven.plugin.MojoFailureException: There are test failures.
22-Nov-2021 20:24:40
22-Nov-2021 20:24:40 Please refer to /home/bamboo-agent/bamboo-agent/xml-data/build-dir/REFAPP-UI-FRAMEWORK/ui-tests/target/surefire-reports for the individual test results.
22-Nov-2021 20:24:40         at org.apache.maven.plugin.surefire.SurefireHelper.reportExecution(SurefireHelper.java:83)
22-Nov-2021 20:24:40         at org.apache.maven.plugin.surefire.SurefirePlugin.writeSummary(SurefirePlugin.java:673)
22-Nov-2021 20:24:40         at org.apache.maven.plugin.surefire.SurefirePlugin.handleSummary(SurefirePlugin.java:647)
22-Nov-2021 20:24:40         at org.apache.maven.plugin.surefire.AbstractSurefireMojo.executeAfterPreconditionsChecked(AbstractSurefireMojo.java:137)
22-Nov-2021 20:24:40         at org.apache.maven.plugin.surefire.AbstractSurefireMojo.execute(AbstractSurefireMojo.java:98)
22-Nov-2021 20:24:40         at org.apache.maven.plugin.DefaultBuildPluginManager.executeMojo(DefaultBuildPluginManager.java:134)
22-Nov-2021 20:24:40         at org.apache.maven.lifecycle.internal.MojoExecutor.execute(MojoExecutor.java:207)
22-Nov-2021 20:24:40         ... 20 more
22-Nov-2021 20:24:40 [ERROR]
22-Nov-2021 20:24:40 [ERROR] Re-run Maven using the -X switch to enable full debug logging.
22-Nov-2021 20:24:40 [ERROR]
22-Nov-2021 20:24:40 [ERROR] For more information about the errors and possible solutions, please read the following articles:
22-Nov-2021 20:24:40 [ERROR] [Help 1] http://cwiki.apache.org/confluence/display/MAVEN/MojoFailureException
22-Nov-2021 20:24:40 [ERROR]
22-Nov-2021 20:24:40 [ERROR] After correcting the problems, you can resume the build with the command
22-Nov-2021 20:24:40 [ERROR]   mvn <goals> -rf :referenceapplication-ui-tests
22-Nov-2021 20:24:40 Failing task since return code of [/usr/share/apache-maven-3.3.9/bin/mvn --batch-mode -Djava.io.tmpdir=/home/bamboo-agent/bamboo-agent/.agent_tmp/REFAPP-UI-FRAMEWORK clean install -DskipTests=false -e] was 1 while expected 0
22-Nov-2021 20:24:40 Parsing test results under /home/bamboo-agent/bamboo-agent/xml-data/build-dir/REFAPP-UI-FRAMEWORK...
22-Nov-2021 20:24:41 Finished task 'Build distribution' with result: Failed
22-Nov-2021 20:24:41 Running post build plugin 'Docker Container Cleanup'
22-Nov-2021 20:24:41 Running post build plugin 'NCover Results Collector'
22-Nov-2021 20:24:41 Running post build plugin 'Clover Results Collector'
22-Nov-2021 20:24:41 Running post build plugin 'Sauce OnDemand Post Runner'
22-Nov-2021 20:24:41 Running post build plugin 'npm Cache Cleanup'
22-Nov-2021 20:24:41 Running post build plugin 'Artifact Copier'
22-Nov-2021 20:24:41 Finalising the build...
22-Nov-2021 20:24:41 Stopping timer.
22-Nov-2021 20:24:41 Build REFAPP-UI-FRAMEWORK-739 completed.
22-Nov-2021 20:24:41 Running on server: post build plugin 'NCover Results Collector'
22-Nov-2021 20:24:41 Running on server: post build plugin 'Build Hanging Detection Configuration'
22-Nov-2021 20:24:41 Running on server: post build plugin 'Clover Delta Calculator'
22-Nov-2021 20:24:41 Running on server: post build plugin 'Maven Dependencies Postprocessor'
22-Nov-2021 20:24:41 All post build plugins have finished
22-Nov-2021 20:24:41 Generating build results summary...
22-Nov-2021 20:24:41 Saving build results to disk...
22-Nov-2021 20:24:41 Logging substituted variables...
22-Nov-2021 20:24:42 Indexing build results...
22-Nov-2021 20:24:42 Finished building REFAPP-UI-FRAMEWORK-739.