UI tests for the reference application

Build: #740 failed

Job: Run QA UI Tests failed

Stages & jobs

  1. Ref App UI Testing

Job result summary

Completed
Duration
14 minutes
Agent
yak.openmrs.org
Revisions
Distribution
7d80d87370d7c6b53bed7a167252700d43a4a441 7d80d87370d7c6b53bed7a167252700d43a4a441
UI Test Framework
8838c8eeee749c044f9846bcb0a31a7065db1260 8838c8eeee749c044f9846bcb0a31a7065db1260
Total tests
59
Failing since
#739 (Code changes detected – )
Fixed in
#742 (Scheduled)

Tests

  • 59 tests in total
  • 2 tests failed
  • 57 tests were fixed
  • 13 minutes taken in total.
Existing test failures 2
Status Test Failing since Duration
org.openqa.selenium.remote.UnreachableBrowserException: Error communicating with the remote browser. It may have died. Build info: version: '4.0.0-alpha-6', revision: '5f43a29cfc' System info: host: 'tg-asc170002-yak', ip: '10.0.1.14', os.name: 'Linux', os.arch: 'amd64', os.version: '4.4.0-210-generic', java.version: '1.8.0_292' Driver info: driver.version: RemoteWebDriver Capabilities {acceptInsecureCerts: false, browserName: chrome, browserVersion: 90.0.4430.72, chrome: {chromedriverVersion: 90.0.4430.24 (4c6d850f087da..., userDataDir: /tmp/.com.google.Chrome.R0mmX9}, goog:chromeOptions: {debuggerAddress: localhost:44338}, javascriptEnabled: true, networkConnectionEnabled: false, pageLoadStrategy: normal, platform: LINUX, platformName: LINUX, proxy: Proxy(), setWindowRect: true, strictFileInteractability: false, timeouts: {implicit: 0, pageLoad: 300000, script: 30000}, unhandledPromptBehavior: dismiss and notify, webauthn:extension:largeBlob: true, webauthn:virtualAuthenticators: true} Session ID: 209f4029f2bec2d14367141e353f079c
org.openqa.selenium.remote.UnreachableBrowserException: Error communicating with the remote browser. It may have died.
Build info: version: '4.0.0-alpha-6', revision: '5f43a29cfc'
System info: host: 'tg-asc170002-yak', ip: '10.0.1.14', os.name: 'Linux', os.arch: 'amd64', os.version: '4.4.0-210-generic', java.version: '1.8.0_292'
Driver info: driver.version: RemoteWebDriver
Capabilities {acceptInsecureCerts: false, browserName: chrome, browserVersion: 90.0.4430.72, chrome: {chromedriverVersion: 90.0.4430.24 (4c6d850f087da..., userDataDir: /tmp/.com.google.Chrome.R0mmX9}, goog:chromeOptions: {debuggerAddress: localhost:44338}, javascriptEnabled: true, networkConnectionEnabled: false, pageLoadStrategy: normal, platform: LINUX, platformName: LINUX, proxy: Proxy(), setWindowRect: true, strictFileInteractability: false, timeouts: {implicit: 0, pageLoad: 300000, script: 30000}, unhandledPromptBehavior: dismiss and notify, webauthn:extension:largeBlob: true, webauthn:virtualAuthenticators: true}
Session ID: 209f4029f2bec2d14367141e353f079c
	at org.openqa.selenium.remote.RemoteWebDriver.execute(RemoteWebDriver.java:603)
(35 more lines...)
org.openqa.selenium.remote.UnreachableBrowserException: Error communicating with the remote browser. It may have died. Build info: version: '4.0.0-alpha-6', revision: '5f43a29cfc' System info: host: 'tg-asc170002-yak', ip: '10.0.1.14', os.name: 'Linux', os.arch: 'amd64', os.version: '4.4.0-210-generic', java.version: '1.8.0_292' Driver info: driver.version: RemoteWebDriver Capabilities {acceptInsecureCerts: false, browserName: chrome, browserVersion: 90.0.4430.72, chrome: {chromedriverVersion: 90.0.4430.24 (4c6d850f087da..., userDataDir: /tmp/.com.google.Chrome.eszWlF}, goog:chromeOptions: {debuggerAddress: localhost:37628}, javascriptEnabled: true, networkConnectionEnabled: false, pageLoadStrategy: normal, platform: LINUX, platformName: LINUX, proxy: Proxy(), setWindowRect: true, strictFileInteractability: false, timeouts: {implicit: 0, pageLoad: 300000, script: 30000}, unhandledPromptBehavior: dismiss and notify, webauthn:extension:largeBlob: true, webauthn:virtualAuthenticators: true} Session ID: de14e70fc0354bb8cd29d13ee6927054
org.openqa.selenium.remote.UnreachableBrowserException: Error communicating with the remote browser. It may have died.
Build info: version: '4.0.0-alpha-6', revision: '5f43a29cfc'
System info: host: 'tg-asc170002-yak', ip: '10.0.1.14', os.name: 'Linux', os.arch: 'amd64', os.version: '4.4.0-210-generic', java.version: '1.8.0_292'
Driver info: driver.version: RemoteWebDriver
Capabilities {acceptInsecureCerts: false, browserName: chrome, browserVersion: 90.0.4430.72, chrome: {chromedriverVersion: 90.0.4430.24 (4c6d850f087da..., userDataDir: /tmp/.com.google.Chrome.eszWlF}, goog:chromeOptions: {debuggerAddress: localhost:37628}, javascriptEnabled: true, networkConnectionEnabled: false, pageLoadStrategy: normal, platform: LINUX, platformName: LINUX, proxy: Proxy(), setWindowRect: true, strictFileInteractability: false, timeouts: {implicit: 0, pageLoad: 300000, script: 30000}, unhandledPromptBehavior: dismiss and notify, webauthn:extension:largeBlob: true, webauthn:virtualAuthenticators: true}
Session ID: de14e70fc0354bb8cd29d13ee6927054
	at org.openqa.selenium.remote.RemoteWebDriver.execute(RemoteWebDriver.java:603)
(35 more lines...)
Fixed tests 57
Status Test Failing since Duration
Successful AddDeleteLocationTest addLocationTest History
Failing since build #739 (Code changes detected) 4 secs
Successful AddDeleteServiceTest addDeleteServiceTest History
Failing since build #739 (Code changes detected) 6 secs
Successful AddDiagnosisToVisitNoteTest addDiagnosisToVisitNoteTest History
Failing since build #739 (Code changes detected) 11 secs
Successful AddEditAppointmentBlockTest addEditAppointmentBlockTest History
Failing since build #739 (Code changes detected) 7 secs
Successful AddNewAllergyTest addNewAllergyTest History
Failing since build #739 (Code changes detected) 7 secs
Successful AddPastVisitTest addPastVisitTest History
Failing since build #739 (Code changes detected) 9 secs
Successful AddProviderTest addProviderTest History
Failing since build #739 (Code changes detected) 12 secs
Successful AddUserTest addUserTest History
Failing since build #739 (Code changes detected) 15 secs
Successful AddVisitTypeTest addVisitTypeTest History
Failing since build #739 (Code changes detected) 17 secs
Successful AdmitExitInpatientTest admitExitInpatientTest History
Failing since build #739 (Code changes detected) 14 secs
Successful CaptureVitalsTest captureVitalsTest History
Failing since build #739 (Code changes detected) 10 secs
Successful CheckModulesTest checkModulesTest History
Failing since build #739 (Code changes detected) 9 secs
Successful ComeBackToApplicationAfterLogoutTest comeBackToApplicationAfterLogoutTest History
Failing since build #739 (Code changes detected) 2 secs
Successful ContactInfoTest contactInfoTest History
Failing since build #739 (Code changes detected) 12 secs
Successful CreatePersonTest createPersonTest History
Failing since build #739 (Code changes detected) 8 secs
Successful DeleteAllergyTest deleteAllergyTest History
Failing since build #739 (Code changes detected) 11 secs
Successful DeleteAppointmentBlockTest deleteAppointmentBlockTest History
Failing since build #739 (Code changes detected) 5 secs
Successful DeletePersonTest deletePersonTest History
Failing since build #739 (Code changes detected) 4 secs
Successful DeleteProviderTest deleteProviderTest History
Failing since build #739 (Code changes detected) 4 secs
Successful DeleteRequestAppointmentTest deleteRequestAppointmentTest History
Failing since build #739 (Code changes detected) 16 secs
Successful DeleteVisitTypeTest deleteVisitTypeTest History
Failing since build #739 (Code changes detected) 4 secs
Successful DuplicatePatientRegisterTest duplicatePatientRegisterTest History
Failing since build #739 (Code changes detected) 12 secs
Successful EditAllergyTest editAllergyTest History
Failing since build #739 (Code changes detected) 10 secs
Successful EditDemographicTest editDemographicTest History
Failing since build #739 (Code changes detected) 10 secs
Successful EditPersonTest editPersonTest History
Failing since build #739 (Code changes detected) 13 secs
Successful EditProviderTest editProviderTest History
Failing since build #739 (Code changes detected) 4 secs
Successful EditServiceTest editServiceTest History
Failing since build #739 (Code changes detected) 6 secs
Successful EditVisitTypeTest editVisitTypeTest History
Failing since build #739 (Code changes detected) 3 secs
Successful EndVisitTest endVisitTest History
Failing since build #739 (Code changes detected) 11 secs
Successful FindPatientByNameTest findPatientByNameTest History
Failing since build #739 (Code changes detected) 7 secs
Successful FindPatientRecordTest findPatientRecordTest History
Failing since build #739 (Code changes detected) 5 secs
Successful FormTest addFormTest History
Failing since build #739 (Code changes detected) 5 secs
Successful FormTest deleteFormTest History
Failing since build #739 (Code changes detected) 11 secs
Successful FormTest editFormTest History
Failing since build #739 (Code changes detected) 6 secs
Successful FormTest initiateFormPresence History
Failing since build #739 (Code changes detected) 4 secs
Successful LoginTest verifyClerkModulesAvailableOnHomePage History
Failing since build #739 (Code changes detected) 2 secs
Successful LoginTest verifyDoctorModulesAvailableOnHomePage History
Failing since build #739 (Code changes detected) 2 secs
Successful LoginTest verifyModulesAvailableOnHomePage History
Failing since build #739 (Code changes detected) 1 sec
Successful LoginTest verifyNurseModulesAvailableOnHomePage History
Failing since build #739 (Code changes detected) 3 secs
Successful LoginTest verifySysadminModulesAvailableOnHomePage History
Failing since build #739 (Code changes detected) 2 secs
Successful MergePatientTest mergePatientTest History
Failing since build #739 (Code changes detected) 8 secs
Successful MergeVisitsTest mergeVisitsTest History
Failing since build #739 (Code changes detected) 12 secs
Successful NamePatientAccentedLetterTest namePatientAccentedLetterTest History
Failing since build #739 (Code changes detected) 8 secs
Successful RecordMergeIssueTest recordMergeIssueTest History
Failing since build #739 (Code changes detected) 13 secs
Successful RegisterPatientTest registerPatientTest History
Failing since build #739 (Code changes detected) 8 secs
Successful RegisterUnidentifiedPatientTest registerUnidentifiedPatientTest History
Failing since build #739 (Code changes detected) 6 secs
Successful RetireLocationTest retireLocationTest History
Failing since build #739 (Code changes detected) 3 secs
Successful RetirePersonTest retirePersonTest History
Failing since build #739 (Code changes detected) 5 secs
Successful RetireProviderTest retireProviderTest History
Failing since build #739 (Code changes detected) 5 secs
Successful RetireVisitTypeTest retireVisitTypeTest History
Failing since build #739 (Code changes detected) 3 secs