UI tests for the reference application

Build: #740 failed

Job: Run QA UI Tests failed

Stages & jobs

  1. Ref App UI Testing

Build log

The build generated 1,227 lines of output.The output is too long and has been truncated to the last 1,000 lines. Download or view full build log

22-Nov-2021 21:53:37 [INFO] Configured Artifact: org.openmrs.module:formentryapp-omod:1.4.2:jar
22-Nov-2021 21:53:37 [INFO] Configured Artifact: org.openmrs.module:idgen-omod:4.7.0:jar
22-Nov-2021 21:53:37 [INFO] Configured Artifact: org.openmrs.module:metadatamapping-omod:1.4.0:jar
22-Nov-2021 21:53:37 [INFO] Configured Artifact: org.openmrs.module:htmlformentryui-omod:2.2.0-SNAPSHOT:jar
22-Nov-2021 21:53:37 [INFO] Downloading: http://mavenrepo.openmrs.org/nexus/content/repositories/public/org/openmrs/module/htmlformentryui-omod/2.2.0-SNAPSHOT/maven-metadata.xml
22-Nov-2021 21:53:38 [INFO] Downloaded: http://mavenrepo.openmrs.org/nexus/content/repositories/public/org/openmrs/module/htmlformentryui-omod/2.2.0-SNAPSHOT/maven-metadata.xml (1004 B at 1.4 KB/sec)
22-Nov-2021 21:53:38 [INFO] Downloading: http://mavenrepo.openmrs.org/nexus/content/repositories/public/org/openmrs/module/htmlformentryui-omod/2.2.0-SNAPSHOT/htmlformentryui-omod-2.2.0-20211122.202407-18.jar
22-Nov-2021 21:53:40 [INFO] Downloaded: http://mavenrepo.openmrs.org/nexus/content/repositories/public/org/openmrs/module/htmlformentryui-omod/2.2.0-SNAPSHOT/htmlformentryui-omod-2.2.0-20211122.202407-18.jar (1431 KB at 825.2 KB/sec)
22-Nov-2021 21:53:40 [INFO] Configured Artifact: org.openmrs.module:referencedemodata-omod:1.4.7:jar
22-Nov-2021 21:53:40 [INFO] Configured Artifact: org.openmrs.module:emrapi-omod:1.32.0:jar
22-Nov-2021 21:53:40 [INFO] Configured Artifact: org.openmrs.module:referenceapplication-omod:2.13.0-SNAPSHOT:jar
22-Nov-2021 21:53:40 [INFO] Downloading: http://mavenrepo.openmrs.org/nexus/content/repositories/public/org/openmrs/module/referenceapplication-omod/2.13.0-SNAPSHOT/maven-metadata.xml
22-Nov-2021 21:53:41 [INFO] Downloaded: http://mavenrepo.openmrs.org/nexus/content/repositories/public/org/openmrs/module/referenceapplication-omod/2.13.0-SNAPSHOT/maven-metadata.xml (799 B at 1.2 KB/sec)
22-Nov-2021 21:53:41 [INFO] Downloading: http://mavenrepo.openmrs.org/nexus/content/repositories/public/org/openmrs/module/referenceapplication-omod/2.13.0-SNAPSHOT/referenceapplication-omod-2.13.0-20211122.202837-40.jar
22-Nov-2021 21:53:41 [INFO] Downloaded: http://mavenrepo.openmrs.org/nexus/content/repositories/public/org/openmrs/module/referenceapplication-omod/2.13.0-SNAPSHOT/referenceapplication-omod-2.13.0-20211122.202837-40.jar (1902 KB at 2662.6 KB/sec)
22-Nov-2021 21:53:41 [INFO] Configured Artifact: org.openmrs.module:htmlformentry-omod:4.3.0-SNAPSHOT:jar
22-Nov-2021 21:53:41 [INFO] Downloading: http://mavenrepo.openmrs.org/nexus/content/repositories/public/org/openmrs/module/htmlformentry-omod/4.3.0-SNAPSHOT/maven-metadata.xml
22-Nov-2021 21:53:42 [INFO] Downloaded: http://mavenrepo.openmrs.org/nexus/content/repositories/public/org/openmrs/module/htmlformentry-omod/4.3.0-SNAPSHOT/maven-metadata.xml (998 B at 1.5 KB/sec)
22-Nov-2021 21:53:42 [INFO] Downloading: http://mavenrepo.openmrs.org/nexus/content/repositories/public/org/openmrs/module/htmlformentry-omod/4.3.0-SNAPSHOT/htmlformentry-omod-4.3.0-20211122.152344-5.jar
22-Nov-2021 21:53:43 [INFO] Downloaded: http://mavenrepo.openmrs.org/nexus/content/repositories/public/org/openmrs/module/htmlformentry-omod/4.3.0-SNAPSHOT/htmlformentry-omod-4.3.0-20211122.152344-5.jar (2359 KB at 2831.4 KB/sec)
22-Nov-2021 21:53:43 [INFO] Configured Artifact: org.openmrs.module:appframework-omod:2.16.0:jar
22-Nov-2021 21:53:43 [INFO] Configured Artifact: org.openmrs.module:referencemetadata-omod:2.12.0:jar
22-Nov-2021 21:53:43 [INFO] Configured Artifact: org.openmrs.module:reportingui-omod:1.8.0:jar
22-Nov-2021 21:53:43 [INFO] Configured Artifact: org.openmrs.module:coreapps-omod:1.35.0:jar
22-Nov-2021 21:53:43 [INFO] Configured Artifact: org.openmrs.module:reportingcompatibility-omod:2.0.8:jar
22-Nov-2021 21:53:43 [INFO] Configured Artifact: org.openmrs.module:reporting-omod:1.23.0:jar
22-Nov-2021 21:53:43 [INFO] Configured Artifact: org.openmrs.module:adminui-omod:1.6.0:jar
22-Nov-2021 21:53:43 [INFO] Configured Artifact: org.openmrs.module:registrationcore-omod:1.11.0:jar
22-Nov-2021 21:53:43 [INFO] Configured Artifact: org.openmrs.module:appointmentscheduling-omod:1.17.0-SNAPSHOT:jar
22-Nov-2021 21:53:43 [INFO] Downloading: http://mavenrepo.openmrs.org/nexus/content/repositories/public/org/openmrs/module/appointmentscheduling-omod/1.17.0-SNAPSHOT/maven-metadata.xml
22-Nov-2021 21:53:44 [INFO] Downloaded: http://mavenrepo.openmrs.org/nexus/content/repositories/public/org/openmrs/module/appointmentscheduling-omod/1.17.0-SNAPSHOT/maven-metadata.xml (797 B at 1.2 KB/sec)
22-Nov-2021 21:53:44 [INFO] Downloading: http://mavenrepo.openmrs.org/nexus/content/repositories/public/org/openmrs/module/appointmentscheduling-omod/1.17.0-SNAPSHOT/appointmentscheduling-omod-1.17.0-20211104.173619-2.jar
22-Nov-2021 21:53:44 [INFO] Downloaded: http://mavenrepo.openmrs.org/nexus/content/repositories/public/org/openmrs/module/appointmentscheduling-omod/1.17.0-SNAPSHOT/appointmentscheduling-omod-1.17.0-20211104.173619-2.jar (1539 KB at 1906.4 KB/sec)
22-Nov-2021 21:53:44 [INFO] Configured Artifact: org.openmrs.module:atlas-omod:2.2.5:omod
22-Nov-2021 21:53:44 [INFO] Configured Artifact: org.openmrs.module:calculation-omod:1.3.0:jar
22-Nov-2021 21:53:44 [INFO] Configured Artifact: org.openmrs.module:webservices.rest-omod:2.34.0-SNAPSHOT:jar
22-Nov-2021 21:53:44 [INFO] Downloading: http://mavenrepo.openmrs.org/nexus/content/repositories/public/org/openmrs/module/webservices.rest-omod/2.34.0-SNAPSHOT/maven-metadata.xml
22-Nov-2021 21:53:45 [INFO] Downloaded: http://mavenrepo.openmrs.org/nexus/content/repositories/public/org/openmrs/module/webservices.rest-omod/2.34.0-SNAPSHOT/maven-metadata.xml (1005 B at 1.5 KB/sec)
22-Nov-2021 21:53:45 [INFO] Downloading: http://mavenrepo.openmrs.org/nexus/content/repositories/public/org/openmrs/module/webservices.rest-omod/2.34.0-SNAPSHOT/webservices.rest-omod-2.34.0-20211122.201017-1.jar
22-Nov-2021 21:53:46 [INFO] Downloaded: http://mavenrepo.openmrs.org/nexus/content/repositories/public/org/openmrs/module/webservices.rest-omod/2.34.0-SNAPSHOT/webservices.rest-omod-2.34.0-20211122.201017-1.jar (6753 KB at 5548.7 KB/sec)
22-Nov-2021 21:53:46 [INFO] Configured Artifact: org.openmrs.module:spa-omod:1.0.8:jar
22-Nov-2021 21:53:46 [INFO] Configured Artifact: org.openmrs.module:uicommons-omod:2.19.0:jar
22-Nov-2021 21:53:46 [INFO] Configured Artifact: org.openmrs.module:uiframework-omod:3.23.0-SNAPSHOT:jar
22-Nov-2021 21:53:46 [INFO] Downloading: http://mavenrepo.openmrs.org/nexus/content/repositories/public/org/openmrs/module/uiframework-omod/3.23.0-SNAPSHOT/maven-metadata.xml
22-Nov-2021 21:53:47 [INFO] Downloaded: http://mavenrepo.openmrs.org/nexus/content/repositories/public/org/openmrs/module/uiframework-omod/3.23.0-SNAPSHOT/maven-metadata.xml (1000 B at 1.4 KB/sec)
22-Nov-2021 21:53:47 [INFO] Downloading: http://mavenrepo.openmrs.org/nexus/content/repositories/public/org/openmrs/module/uiframework-omod/3.23.0-SNAPSHOT/uiframework-omod-3.23.0-20211104.111012-6.jar
22-Nov-2021 21:53:48 [INFO] Downloaded: http://mavenrepo.openmrs.org/nexus/content/repositories/public/org/openmrs/module/uiframework-omod/3.23.0-SNAPSHOT/uiframework-omod-3.23.0-20211104.111012-6.jar (2667 KB at 3174.5 KB/sec)
22-Nov-2021 21:53:48 [INFO] Configured Artifact: org.openmrs.module:metadatasharing-omod:1.8.0:jar
22-Nov-2021 21:53:48 [INFO] Copying addresshierarchy-omod-2.14.2.jar to /home/bamboo-agent/bamboo-agent/xml-data/build-dir/REFAPP-UI-FRAMEWORK/package/target/distro/web/modules/addresshierarchy-2.14.2.omod
22-Nov-2021 21:53:48 [INFO] Copying legacyui-omod-1.10.0-SNAPSHOT.jar to /home/bamboo-agent/bamboo-agent/xml-data/build-dir/REFAPP-UI-FRAMEWORK/package/target/distro/web/modules/legacyui-1.10.0-SNAPSHOT.omod
22-Nov-2021 21:53:48 [INFO] Copying openconceptlab-omod-1.2.9.jar to /home/bamboo-agent/bamboo-agent/xml-data/build-dir/REFAPP-UI-FRAMEWORK/package/target/distro/web/modules/openconceptlab-1.2.9.omod
22-Nov-2021 21:53:48 [INFO] Copying metadatadeploy-omod-1.13.0.jar to /home/bamboo-agent/bamboo-agent/xml-data/build-dir/REFAPP-UI-FRAMEWORK/package/target/distro/web/modules/metadatadeploy-1.13.0.omod
22-Nov-2021 21:53:48 [INFO] Copying reportingrest-omod-1.12.0.jar to /home/bamboo-agent/bamboo-agent/xml-data/build-dir/REFAPP-UI-FRAMEWORK/package/target/distro/web/modules/reportingrest-1.12.0.omod
22-Nov-2021 21:53:48 [INFO] Copying owa-omod-1.13.0.jar to /home/bamboo-agent/bamboo-agent/xml-data/build-dir/REFAPP-UI-FRAMEWORK/package/target/distro/web/modules/owa-1.13.0.omod
22-Nov-2021 21:53:48 [INFO] Copying fhir2-omod-1.3.0.jar to /home/bamboo-agent/bamboo-agent/xml-data/build-dir/REFAPP-UI-FRAMEWORK/package/target/distro/web/modules/fhir2-1.3.0.omod
22-Nov-2021 21:53:49 [INFO] Copying serialization.xstream-omod-0.2.15.omod to /home/bamboo-agent/bamboo-agent/xml-data/build-dir/REFAPP-UI-FRAMEWORK/package/target/distro/web/modules/serialization.xstream-0.2.15.omod
22-Nov-2021 21:53:49 [INFO] Copying registrationapp-omod-1.24.0.jar to /home/bamboo-agent/bamboo-agent/xml-data/build-dir/REFAPP-UI-FRAMEWORK/package/target/distro/web/modules/registrationapp-1.24.0.omod
22-Nov-2021 21:53:49 [INFO] Copying event-omod-2.10.0.jar to /home/bamboo-agent/bamboo-agent/xml-data/build-dir/REFAPP-UI-FRAMEWORK/package/target/distro/web/modules/event-2.10.0.omod
22-Nov-2021 21:53:49 [INFO] Copying uilibrary-omod-2.0.7.jar to /home/bamboo-agent/bamboo-agent/xml-data/build-dir/REFAPP-UI-FRAMEWORK/package/target/distro/web/modules/uilibrary-2.0.7.omod
22-Nov-2021 21:53:49 [INFO] Copying htmlwidgets-omod-1.10.0.jar to /home/bamboo-agent/bamboo-agent/xml-data/build-dir/REFAPP-UI-FRAMEWORK/package/target/distro/web/modules/htmlwidgets-1.10.0.omod
22-Nov-2021 21:53:49 [INFO] Copying dataexchange-omod-1.3.7.jar to /home/bamboo-agent/bamboo-agent/xml-data/build-dir/REFAPP-UI-FRAMEWORK/package/target/distro/web/modules/dataexchange-1.3.7.omod
22-Nov-2021 21:53:50 [INFO] Copying appui-omod-1.15.0.jar to /home/bamboo-agent/bamboo-agent/xml-data/build-dir/REFAPP-UI-FRAMEWORK/package/target/distro/web/modules/appui-1.15.0.omod
22-Nov-2021 21:53:50 [INFO] Copying allergyui-omod-1.8.4.jar to /home/bamboo-agent/bamboo-agent/xml-data/build-dir/REFAPP-UI-FRAMEWORK/package/target/distro/web/modules/allergyui-1.8.4.omod
22-Nov-2021 21:53:50 [INFO] Copying providermanagement-omod-2.13.0.jar to /home/bamboo-agent/bamboo-agent/xml-data/build-dir/REFAPP-UI-FRAMEWORK/package/target/distro/web/modules/providermanagement-2.13.0.omod
22-Nov-2021 21:53:50 [INFO] Copying appointmentschedulingui-omod-1.12.0.jar to /home/bamboo-agent/bamboo-agent/xml-data/build-dir/REFAPP-UI-FRAMEWORK/package/target/distro/web/modules/appointmentschedulingui-1.12.0.omod
22-Nov-2021 21:53:50 [INFO] Copying attachments-omod-2.5.0.jar to /home/bamboo-agent/bamboo-agent/xml-data/build-dir/REFAPP-UI-FRAMEWORK/package/target/distro/web/modules/attachments-2.5.0.omod
22-Nov-2021 21:53:50 [INFO] Copying formentryapp-omod-1.4.2.jar to /home/bamboo-agent/bamboo-agent/xml-data/build-dir/REFAPP-UI-FRAMEWORK/package/target/distro/web/modules/formentryapp-1.4.2.omod
22-Nov-2021 21:53:50 [INFO] Copying idgen-omod-4.7.0.jar to /home/bamboo-agent/bamboo-agent/xml-data/build-dir/REFAPP-UI-FRAMEWORK/package/target/distro/web/modules/idgen-4.7.0.omod
22-Nov-2021 21:53:50 [INFO] Copying metadatamapping-omod-1.4.0.jar to /home/bamboo-agent/bamboo-agent/xml-data/build-dir/REFAPP-UI-FRAMEWORK/package/target/distro/web/modules/metadatamapping-1.4.0.omod
22-Nov-2021 21:53:50 [INFO] Copying htmlformentryui-omod-2.2.0-SNAPSHOT.jar to /home/bamboo-agent/bamboo-agent/xml-data/build-dir/REFAPP-UI-FRAMEWORK/package/target/distro/web/modules/htmlformentryui-2.2.0-SNAPSHOT.omod
22-Nov-2021 21:53:50 [INFO] Copying referencedemodata-omod-1.4.7.jar to /home/bamboo-agent/bamboo-agent/xml-data/build-dir/REFAPP-UI-FRAMEWORK/package/target/distro/web/modules/referencedemodata-1.4.7.omod
22-Nov-2021 21:53:50 [INFO] Copying emrapi-omod-1.32.0.jar to /home/bamboo-agent/bamboo-agent/xml-data/build-dir/REFAPP-UI-FRAMEWORK/package/target/distro/web/modules/emrapi-1.32.0.omod
22-Nov-2021 21:53:50 [INFO] Copying referenceapplication-omod-2.13.0-SNAPSHOT.jar to /home/bamboo-agent/bamboo-agent/xml-data/build-dir/REFAPP-UI-FRAMEWORK/package/target/distro/web/modules/referenceapplication-2.13.0-SNAPSHOT.omod
22-Nov-2021 21:53:50 [INFO] Copying htmlformentry-omod-4.3.0-SNAPSHOT.jar to /home/bamboo-agent/bamboo-agent/xml-data/build-dir/REFAPP-UI-FRAMEWORK/package/target/distro/web/modules/htmlformentry-4.3.0-SNAPSHOT.omod
22-Nov-2021 21:53:50 [INFO] Copying appframework-omod-2.16.0.jar to /home/bamboo-agent/bamboo-agent/xml-data/build-dir/REFAPP-UI-FRAMEWORK/package/target/distro/web/modules/appframework-2.16.0.omod
22-Nov-2021 21:53:50 [INFO] Copying referencemetadata-omod-2.12.0.jar to /home/bamboo-agent/bamboo-agent/xml-data/build-dir/REFAPP-UI-FRAMEWORK/package/target/distro/web/modules/referencemetadata-2.12.0.omod
22-Nov-2021 21:53:50 [INFO] Copying reportingui-omod-1.8.0.jar to /home/bamboo-agent/bamboo-agent/xml-data/build-dir/REFAPP-UI-FRAMEWORK/package/target/distro/web/modules/reportingui-1.8.0.omod
22-Nov-2021 21:53:51 [INFO] Copying coreapps-omod-1.35.0.jar to /home/bamboo-agent/bamboo-agent/xml-data/build-dir/REFAPP-UI-FRAMEWORK/package/target/distro/web/modules/coreapps-1.35.0.omod
22-Nov-2021 21:53:51 [INFO] Copying reportingcompatibility-omod-2.0.8.jar to /home/bamboo-agent/bamboo-agent/xml-data/build-dir/REFAPP-UI-FRAMEWORK/package/target/distro/web/modules/reportingcompatibility-2.0.8.omod
22-Nov-2021 21:53:51 [INFO] Copying reporting-omod-1.23.0.jar to /home/bamboo-agent/bamboo-agent/xml-data/build-dir/REFAPP-UI-FRAMEWORK/package/target/distro/web/modules/reporting-1.23.0.omod
22-Nov-2021 21:53:51 [INFO] Copying adminui-omod-1.6.0.jar to /home/bamboo-agent/bamboo-agent/xml-data/build-dir/REFAPP-UI-FRAMEWORK/package/target/distro/web/modules/adminui-1.6.0.omod
22-Nov-2021 21:53:51 [INFO] Copying registrationcore-omod-1.11.0.jar to /home/bamboo-agent/bamboo-agent/xml-data/build-dir/REFAPP-UI-FRAMEWORK/package/target/distro/web/modules/registrationcore-1.11.0.omod
22-Nov-2021 21:53:51 [INFO] Copying appointmentscheduling-omod-1.17.0-SNAPSHOT.jar to /home/bamboo-agent/bamboo-agent/xml-data/build-dir/REFAPP-UI-FRAMEWORK/package/target/distro/web/modules/appointmentscheduling-1.17.0-SNAPSHOT.omod
22-Nov-2021 21:53:51 [INFO] Copying atlas-omod-2.2.5.omod to /home/bamboo-agent/bamboo-agent/xml-data/build-dir/REFAPP-UI-FRAMEWORK/package/target/distro/web/modules/atlas-2.2.5.omod
22-Nov-2021 21:53:51 [INFO] Copying calculation-omod-1.3.0.jar to /home/bamboo-agent/bamboo-agent/xml-data/build-dir/REFAPP-UI-FRAMEWORK/package/target/distro/web/modules/calculation-1.3.0.omod
22-Nov-2021 21:53:51 [INFO] Copying webservices.rest-omod-2.34.0-SNAPSHOT.jar to /home/bamboo-agent/bamboo-agent/xml-data/build-dir/REFAPP-UI-FRAMEWORK/package/target/distro/web/modules/webservices.rest-2.34.0-SNAPSHOT.omod
22-Nov-2021 21:53:51 [INFO] Copying spa-omod-1.0.8.jar to /home/bamboo-agent/bamboo-agent/xml-data/build-dir/REFAPP-UI-FRAMEWORK/package/target/distro/web/modules/spa-1.0.8.omod
22-Nov-2021 21:53:51 [INFO] Copying uicommons-omod-2.19.0.jar to /home/bamboo-agent/bamboo-agent/xml-data/build-dir/REFAPP-UI-FRAMEWORK/package/target/distro/web/modules/uicommons-2.19.0.omod
22-Nov-2021 21:53:51 [INFO] Copying uiframework-omod-3.23.0-SNAPSHOT.jar to /home/bamboo-agent/bamboo-agent/xml-data/build-dir/REFAPP-UI-FRAMEWORK/package/target/distro/web/modules/uiframework-3.23.0-SNAPSHOT.omod
22-Nov-2021 21:53:51 [INFO] Copying metadatasharing-omod-1.8.0.jar to /home/bamboo-agent/bamboo-agent/xml-data/build-dir/REFAPP-UI-FRAMEWORK/package/target/distro/web/modules/metadatasharing-1.8.0.omod
22-Nov-2021 21:53:51
22-Nov-2021 21:53:51 Downloading OWAs...
22-Nov-2021 21:53:51
22-Nov-2021 21:53:51
22-Nov-2021 21:53:51 Downloading OWA: org.openmrs.owa:openmrs-owa-sysadmin:1.2
22-Nov-2021 21:53:51 [INFO] Configured Artifact: org.openmrs.owa:sysadmin:1.2:zip
22-Nov-2021 21:53:51 [INFO] Copying sysadmin-1.2.zip to /home/bamboo-agent/bamboo-agent/xml-data/build-dir/REFAPP-UI-FRAMEWORK/package/target/distro/web/owa/sysadmin-1.2.zip
22-Nov-2021 21:53:51
22-Nov-2021 21:53:51 Creating Docker Compose configuration...
22-Nov-2021 21:53:51
22-Nov-2021 21:53:53
22-Nov-2021 21:53:53 The 'referenceapplication' distribution created! To start up the server run 'docker-compose up' from /home/bamboo-agent/bamboo-agent/xml-data/build-dir/REFAPP-UI-FRAMEWORK/package/target/distro
22-Nov-2021 21:53:53
22-Nov-2021 21:53:53 [INFO]
22-Nov-2021 21:53:53 [INFO] --- openmrs-sdk-maven-plugin:4.0.0:build-distro (build-bundled-distro) @ referenceapplication-package ---
22-Nov-2021 21:53:53
22-Nov-2021 21:53:53 Downloading modules...
22-Nov-2021 21:53:53
22-Nov-2021 21:53:53 [INFO] Configured Artifact: org.openmrs.web:openmrs-webapp:2.4.1:war
22-Nov-2021 21:53:53 [INFO] Copying openmrs-webapp-2.4.1.war to /home/bamboo-agent/bamboo-agent/xml-data/build-dir/REFAPP-UI-FRAMEWORK/package/target/bundled-distro/web/openmrs-2.4.1.war
22-Nov-2021 21:53:53 file:/home/bamboo-agent/bamboo-agent/xml-data/build-dir/REFAPP-UI-FRAMEWORK/package/target/bundled-distro/web/openmrs-2.4.1.war
22-Nov-2021 21:53:53 target:/home/bamboo-agent/bamboo-agent/xml-data/build-dir/REFAPP-UI-FRAMEWORK/package/target/bundled-distro/web
22-Nov-2021 21:53:53 [INFO] Configured Artifact: org.openmrs.module:addresshierarchy-omod:2.14.2:jar
22-Nov-2021 21:53:53 [INFO] Configured Artifact: org.openmrs.module:legacyui-omod:1.10.0-SNAPSHOT:jar
22-Nov-2021 21:53:53 [INFO] Configured Artifact: org.openmrs.module:openconceptlab-omod:1.2.9:jar
22-Nov-2021 21:53:53 [INFO] Configured Artifact: org.openmrs.module:metadatadeploy-omod:1.13.0:jar
22-Nov-2021 21:53:53 [INFO] Configured Artifact: org.openmrs.module:reportingrest-omod:1.12.0:jar
22-Nov-2021 21:53:53 [INFO] Configured Artifact: org.openmrs.module:owa-omod:1.13.0:jar
22-Nov-2021 21:53:53 [INFO] Configured Artifact: org.openmrs.module:fhir2-omod:1.3.0:jar
22-Nov-2021 21:53:53 [INFO] Configured Artifact: org.openmrs.module:serialization.xstream-omod:0.2.15:omod
22-Nov-2021 21:53:53 [INFO] Configured Artifact: org.openmrs.module:registrationapp-omod:1.24.0:jar
22-Nov-2021 21:53:53 [INFO] Configured Artifact: org.openmrs:event-omod:2.10.0:jar
22-Nov-2021 21:53:53 [INFO] Configured Artifact: org.openmrs.module:uilibrary-omod:2.0.7:jar
22-Nov-2021 21:53:53 [INFO] Configured Artifact: org.openmrs.module:htmlwidgets-omod:1.10.0:jar
22-Nov-2021 21:53:53 [INFO] Configured Artifact: org.openmrs.module:dataexchange-omod:1.3.7:jar
22-Nov-2021 21:53:53 [INFO] Configured Artifact: org.openmrs.module:appui-omod:1.15.0:jar
22-Nov-2021 21:53:53 [INFO] Configured Artifact: org.openmrs.module:allergyui-omod:1.8.4:jar
22-Nov-2021 21:53:53 [INFO] Configured Artifact: org.openmrs.module:providermanagement-omod:2.13.0:jar
22-Nov-2021 21:53:53 [INFO] Configured Artifact: org.openmrs.module:appointmentschedulingui-omod:1.12.0:jar
22-Nov-2021 21:53:53 [INFO] Configured Artifact: org.openmrs.module:attachments-omod:2.5.0:jar
22-Nov-2021 21:53:53 [INFO] Configured Artifact: org.openmrs.module:formentryapp-omod:1.4.2:jar
22-Nov-2021 21:53:53 [INFO] Configured Artifact: org.openmrs.module:idgen-omod:4.7.0:jar
22-Nov-2021 21:53:53 [INFO] Configured Artifact: org.openmrs.module:metadatamapping-omod:1.4.0:jar
22-Nov-2021 21:53:53 [INFO] Configured Artifact: org.openmrs.module:htmlformentryui-omod:2.2.0-SNAPSHOT:jar
22-Nov-2021 21:53:53 [INFO] Configured Artifact: org.openmrs.module:referencedemodata-omod:1.4.7:jar
22-Nov-2021 21:53:53 [INFO] Configured Artifact: org.openmrs.module:emrapi-omod:1.32.0:jar
22-Nov-2021 21:53:53 [INFO] Configured Artifact: org.openmrs.module:referenceapplication-omod:2.13.0-SNAPSHOT:jar
22-Nov-2021 21:53:53 [INFO] Configured Artifact: org.openmrs.module:htmlformentry-omod:4.3.0-SNAPSHOT:jar
22-Nov-2021 21:53:53 [INFO] Configured Artifact: org.openmrs.module:appframework-omod:2.16.0:jar
22-Nov-2021 21:53:53 [INFO] Configured Artifact: org.openmrs.module:referencemetadata-omod:2.12.0:jar
22-Nov-2021 21:53:53 [INFO] Configured Artifact: org.openmrs.module:reportingui-omod:1.8.0:jar
22-Nov-2021 21:53:53 [INFO] Configured Artifact: org.openmrs.module:coreapps-omod:1.35.0:jar
22-Nov-2021 21:53:53 [INFO] Configured Artifact: org.openmrs.module:reportingcompatibility-omod:2.0.8:jar
22-Nov-2021 21:53:53 [INFO] Configured Artifact: org.openmrs.module:reporting-omod:1.23.0:jar
22-Nov-2021 21:53:53 [INFO] Configured Artifact: org.openmrs.module:adminui-omod:1.6.0:jar
22-Nov-2021 21:53:53 [INFO] Configured Artifact: org.openmrs.module:registrationcore-omod:1.11.0:jar
22-Nov-2021 21:53:53 [INFO] Configured Artifact: org.openmrs.module:appointmentscheduling-omod:1.17.0-SNAPSHOT:jar
22-Nov-2021 21:53:53 [INFO] Configured Artifact: org.openmrs.module:atlas-omod:2.2.5:omod
22-Nov-2021 21:53:53 [INFO] Configured Artifact: org.openmrs.module:calculation-omod:1.3.0:jar
22-Nov-2021 21:53:53 [INFO] Configured Artifact: org.openmrs.module:webservices.rest-omod:2.34.0-SNAPSHOT:jar
22-Nov-2021 21:53:53 [INFO] Configured Artifact: org.openmrs.module:spa-omod:1.0.8:jar
22-Nov-2021 21:53:53 [INFO] Configured Artifact: org.openmrs.module:uicommons-omod:2.19.0:jar
22-Nov-2021 21:53:53 [INFO] Configured Artifact: org.openmrs.module:uiframework-omod:3.23.0-SNAPSHOT:jar
22-Nov-2021 21:53:53 [INFO] Configured Artifact: org.openmrs.module:metadatasharing-omod:1.8.0:jar
22-Nov-2021 21:53:53 [INFO] Copying addresshierarchy-omod-2.14.2.jar to /home/bamboo-agent/bamboo-agent/xml-data/build-dir/REFAPP-UI-FRAMEWORK/package/target/bundled-distro/web/WEB-INF/bundledModules/addresshierarchy-2.14.2.omod
22-Nov-2021 21:53:53 [INFO] Copying legacyui-omod-1.10.0-SNAPSHOT.jar to /home/bamboo-agent/bamboo-agent/xml-data/build-dir/REFAPP-UI-FRAMEWORK/package/target/bundled-distro/web/WEB-INF/bundledModules/legacyui-1.10.0-SNAPSHOT.omod
22-Nov-2021 21:53:53 [INFO] Copying openconceptlab-omod-1.2.9.jar to /home/bamboo-agent/bamboo-agent/xml-data/build-dir/REFAPP-UI-FRAMEWORK/package/target/bundled-distro/web/WEB-INF/bundledModules/openconceptlab-1.2.9.omod
22-Nov-2021 21:53:53 [INFO] Copying metadatadeploy-omod-1.13.0.jar to /home/bamboo-agent/bamboo-agent/xml-data/build-dir/REFAPP-UI-FRAMEWORK/package/target/bundled-distro/web/WEB-INF/bundledModules/metadatadeploy-1.13.0.omod
22-Nov-2021 21:53:53 [INFO] Copying reportingrest-omod-1.12.0.jar to /home/bamboo-agent/bamboo-agent/xml-data/build-dir/REFAPP-UI-FRAMEWORK/package/target/bundled-distro/web/WEB-INF/bundledModules/reportingrest-1.12.0.omod
22-Nov-2021 21:53:53 [INFO] Copying owa-omod-1.13.0.jar to /home/bamboo-agent/bamboo-agent/xml-data/build-dir/REFAPP-UI-FRAMEWORK/package/target/bundled-distro/web/WEB-INF/bundledModules/owa-1.13.0.omod
22-Nov-2021 21:53:53 [INFO] Copying fhir2-omod-1.3.0.jar to /home/bamboo-agent/bamboo-agent/xml-data/build-dir/REFAPP-UI-FRAMEWORK/package/target/bundled-distro/web/WEB-INF/bundledModules/fhir2-1.3.0.omod
22-Nov-2021 21:53:53 [INFO] Copying serialization.xstream-omod-0.2.15.omod to /home/bamboo-agent/bamboo-agent/xml-data/build-dir/REFAPP-UI-FRAMEWORK/package/target/bundled-distro/web/WEB-INF/bundledModules/serialization.xstream-0.2.15.omod
22-Nov-2021 21:53:53 [INFO] Copying registrationapp-omod-1.24.0.jar to /home/bamboo-agent/bamboo-agent/xml-data/build-dir/REFAPP-UI-FRAMEWORK/package/target/bundled-distro/web/WEB-INF/bundledModules/registrationapp-1.24.0.omod
22-Nov-2021 21:53:53 [INFO] Copying event-omod-2.10.0.jar to /home/bamboo-agent/bamboo-agent/xml-data/build-dir/REFAPP-UI-FRAMEWORK/package/target/bundled-distro/web/WEB-INF/bundledModules/event-2.10.0.omod
22-Nov-2021 21:53:53 [INFO] Copying uilibrary-omod-2.0.7.jar to /home/bamboo-agent/bamboo-agent/xml-data/build-dir/REFAPP-UI-FRAMEWORK/package/target/bundled-distro/web/WEB-INF/bundledModules/uilibrary-2.0.7.omod
22-Nov-2021 21:53:53 [INFO] Copying htmlwidgets-omod-1.10.0.jar to /home/bamboo-agent/bamboo-agent/xml-data/build-dir/REFAPP-UI-FRAMEWORK/package/target/bundled-distro/web/WEB-INF/bundledModules/htmlwidgets-1.10.0.omod
22-Nov-2021 21:53:53 [INFO] Copying dataexchange-omod-1.3.7.jar to /home/bamboo-agent/bamboo-agent/xml-data/build-dir/REFAPP-UI-FRAMEWORK/package/target/bundled-distro/web/WEB-INF/bundledModules/dataexchange-1.3.7.omod
22-Nov-2021 21:53:53 [INFO] Copying appui-omod-1.15.0.jar to /home/bamboo-agent/bamboo-agent/xml-data/build-dir/REFAPP-UI-FRAMEWORK/package/target/bundled-distro/web/WEB-INF/bundledModules/appui-1.15.0.omod
22-Nov-2021 21:53:53 [INFO] Copying allergyui-omod-1.8.4.jar to /home/bamboo-agent/bamboo-agent/xml-data/build-dir/REFAPP-UI-FRAMEWORK/package/target/bundled-distro/web/WEB-INF/bundledModules/allergyui-1.8.4.omod
22-Nov-2021 21:53:53 [INFO] Copying providermanagement-omod-2.13.0.jar to /home/bamboo-agent/bamboo-agent/xml-data/build-dir/REFAPP-UI-FRAMEWORK/package/target/bundled-distro/web/WEB-INF/bundledModules/providermanagement-2.13.0.omod
22-Nov-2021 21:53:53 [INFO] Copying appointmentschedulingui-omod-1.12.0.jar to /home/bamboo-agent/bamboo-agent/xml-data/build-dir/REFAPP-UI-FRAMEWORK/package/target/bundled-distro/web/WEB-INF/bundledModules/appointmentschedulingui-1.12.0.omod
22-Nov-2021 21:53:53 [INFO] Copying attachments-omod-2.5.0.jar to /home/bamboo-agent/bamboo-agent/xml-data/build-dir/REFAPP-UI-FRAMEWORK/package/target/bundled-distro/web/WEB-INF/bundledModules/attachments-2.5.0.omod
22-Nov-2021 21:53:53 [INFO] Copying formentryapp-omod-1.4.2.jar to /home/bamboo-agent/bamboo-agent/xml-data/build-dir/REFAPP-UI-FRAMEWORK/package/target/bundled-distro/web/WEB-INF/bundledModules/formentryapp-1.4.2.omod
22-Nov-2021 21:53:53 [INFO] Copying idgen-omod-4.7.0.jar to /home/bamboo-agent/bamboo-agent/xml-data/build-dir/REFAPP-UI-FRAMEWORK/package/target/bundled-distro/web/WEB-INF/bundledModules/idgen-4.7.0.omod
22-Nov-2021 21:53:53 [INFO] Copying metadatamapping-omod-1.4.0.jar to /home/bamboo-agent/bamboo-agent/xml-data/build-dir/REFAPP-UI-FRAMEWORK/package/target/bundled-distro/web/WEB-INF/bundledModules/metadatamapping-1.4.0.omod
22-Nov-2021 21:53:53 [INFO] Copying htmlformentryui-omod-2.2.0-SNAPSHOT.jar to /home/bamboo-agent/bamboo-agent/xml-data/build-dir/REFAPP-UI-FRAMEWORK/package/target/bundled-distro/web/WEB-INF/bundledModules/htmlformentryui-2.2.0-SNAPSHOT.omod
22-Nov-2021 21:53:53 [INFO] Copying referencedemodata-omod-1.4.7.jar to /home/bamboo-agent/bamboo-agent/xml-data/build-dir/REFAPP-UI-FRAMEWORK/package/target/bundled-distro/web/WEB-INF/bundledModules/referencedemodata-1.4.7.omod
22-Nov-2021 21:53:53 [INFO] Copying emrapi-omod-1.32.0.jar to /home/bamboo-agent/bamboo-agent/xml-data/build-dir/REFAPP-UI-FRAMEWORK/package/target/bundled-distro/web/WEB-INF/bundledModules/emrapi-1.32.0.omod
22-Nov-2021 21:53:53 [INFO] Copying referenceapplication-omod-2.13.0-SNAPSHOT.jar to /home/bamboo-agent/bamboo-agent/xml-data/build-dir/REFAPP-UI-FRAMEWORK/package/target/bundled-distro/web/WEB-INF/bundledModules/referenceapplication-2.13.0-SNAPSHOT.omod
22-Nov-2021 21:53:53 [INFO] Copying htmlformentry-omod-4.3.0-SNAPSHOT.jar to /home/bamboo-agent/bamboo-agent/xml-data/build-dir/REFAPP-UI-FRAMEWORK/package/target/bundled-distro/web/WEB-INF/bundledModules/htmlformentry-4.3.0-SNAPSHOT.omod
22-Nov-2021 21:53:53 [INFO] Copying appframework-omod-2.16.0.jar to /home/bamboo-agent/bamboo-agent/xml-data/build-dir/REFAPP-UI-FRAMEWORK/package/target/bundled-distro/web/WEB-INF/bundledModules/appframework-2.16.0.omod
22-Nov-2021 21:53:53 [INFO] Copying referencemetadata-omod-2.12.0.jar to /home/bamboo-agent/bamboo-agent/xml-data/build-dir/REFAPP-UI-FRAMEWORK/package/target/bundled-distro/web/WEB-INF/bundledModules/referencemetadata-2.12.0.omod
22-Nov-2021 21:53:53 [INFO] Copying reportingui-omod-1.8.0.jar to /home/bamboo-agent/bamboo-agent/xml-data/build-dir/REFAPP-UI-FRAMEWORK/package/target/bundled-distro/web/WEB-INF/bundledModules/reportingui-1.8.0.omod
22-Nov-2021 21:53:53 [INFO] Copying coreapps-omod-1.35.0.jar to /home/bamboo-agent/bamboo-agent/xml-data/build-dir/REFAPP-UI-FRAMEWORK/package/target/bundled-distro/web/WEB-INF/bundledModules/coreapps-1.35.0.omod
22-Nov-2021 21:53:53 [INFO] Copying reportingcompatibility-omod-2.0.8.jar to /home/bamboo-agent/bamboo-agent/xml-data/build-dir/REFAPP-UI-FRAMEWORK/package/target/bundled-distro/web/WEB-INF/bundledModules/reportingcompatibility-2.0.8.omod
22-Nov-2021 21:53:53 [INFO] Copying reporting-omod-1.23.0.jar to /home/bamboo-agent/bamboo-agent/xml-data/build-dir/REFAPP-UI-FRAMEWORK/package/target/bundled-distro/web/WEB-INF/bundledModules/reporting-1.23.0.omod
22-Nov-2021 21:53:53 [INFO] Copying adminui-omod-1.6.0.jar to /home/bamboo-agent/bamboo-agent/xml-data/build-dir/REFAPP-UI-FRAMEWORK/package/target/bundled-distro/web/WEB-INF/bundledModules/adminui-1.6.0.omod
22-Nov-2021 21:53:53 [INFO] Copying registrationcore-omod-1.11.0.jar to /home/bamboo-agent/bamboo-agent/xml-data/build-dir/REFAPP-UI-FRAMEWORK/package/target/bundled-distro/web/WEB-INF/bundledModules/registrationcore-1.11.0.omod
22-Nov-2021 21:53:53 [INFO] Copying appointmentscheduling-omod-1.17.0-SNAPSHOT.jar to /home/bamboo-agent/bamboo-agent/xml-data/build-dir/REFAPP-UI-FRAMEWORK/package/target/bundled-distro/web/WEB-INF/bundledModules/appointmentscheduling-1.17.0-SNAPSHOT.omod
22-Nov-2021 21:53:53 [INFO] Copying atlas-omod-2.2.5.omod to /home/bamboo-agent/bamboo-agent/xml-data/build-dir/REFAPP-UI-FRAMEWORK/package/target/bundled-distro/web/WEB-INF/bundledModules/atlas-2.2.5.omod
22-Nov-2021 21:53:53 [INFO] Copying calculation-omod-1.3.0.jar to /home/bamboo-agent/bamboo-agent/xml-data/build-dir/REFAPP-UI-FRAMEWORK/package/target/bundled-distro/web/WEB-INF/bundledModules/calculation-1.3.0.omod
22-Nov-2021 21:53:53 [INFO] Copying webservices.rest-omod-2.34.0-SNAPSHOT.jar to /home/bamboo-agent/bamboo-agent/xml-data/build-dir/REFAPP-UI-FRAMEWORK/package/target/bundled-distro/web/WEB-INF/bundledModules/webservices.rest-2.34.0-SNAPSHOT.omod
22-Nov-2021 21:53:53 [INFO] Copying spa-omod-1.0.8.jar to /home/bamboo-agent/bamboo-agent/xml-data/build-dir/REFAPP-UI-FRAMEWORK/package/target/bundled-distro/web/WEB-INF/bundledModules/spa-1.0.8.omod
22-Nov-2021 21:53:53 [INFO] Copying uicommons-omod-2.19.0.jar to /home/bamboo-agent/bamboo-agent/xml-data/build-dir/REFAPP-UI-FRAMEWORK/package/target/bundled-distro/web/WEB-INF/bundledModules/uicommons-2.19.0.omod
22-Nov-2021 21:53:53 [INFO] Copying uiframework-omod-3.23.0-SNAPSHOT.jar to /home/bamboo-agent/bamboo-agent/xml-data/build-dir/REFAPP-UI-FRAMEWORK/package/target/bundled-distro/web/WEB-INF/bundledModules/uiframework-3.23.0-SNAPSHOT.omod
22-Nov-2021 21:53:53 [INFO] Copying metadatasharing-omod-1.8.0.jar to /home/bamboo-agent/bamboo-agent/xml-data/build-dir/REFAPP-UI-FRAMEWORK/package/target/bundled-distro/web/WEB-INF/bundledModules/metadatasharing-1.8.0.omod
22-Nov-2021 21:53:53
22-Nov-2021 21:53:53 Downloading OWAs...
22-Nov-2021 21:53:53
22-Nov-2021 21:53:53
22-Nov-2021 21:53:53 Downloading OWA: org.openmrs.owa:openmrs-owa-sysadmin:1.2
22-Nov-2021 21:53:53 [INFO] Configured Artifact: org.openmrs.owa:sysadmin:1.2:zip
22-Nov-2021 21:53:53 [INFO] Copying sysadmin-1.2.zip to /home/bamboo-agent/bamboo-agent/xml-data/build-dir/REFAPP-UI-FRAMEWORK/package/target/bundled-distro/web/WEB-INF/bundledOwas/sysadmin-1.2.zip
22-Nov-2021 21:53:55
22-Nov-2021 21:53:55 Creating Docker Compose configuration...
22-Nov-2021 21:53:55
22-Nov-2021 21:53:56
22-Nov-2021 21:53:56 The 'referenceapplication' distribution created! To start up the server run 'docker-compose up' from /home/bamboo-agent/bamboo-agent/xml-data/build-dir/REFAPP-UI-FRAMEWORK/package/target/bundled-distro
22-Nov-2021 21:53:56
22-Nov-2021 21:53:56 [INFO]
22-Nov-2021 21:53:56 [INFO] --- maven-compiler-plugin:3.1:compile (default-compile) @ referenceapplication-package ---
22-Nov-2021 21:53:56 [INFO] No sources to compile
22-Nov-2021 21:53:56 [INFO]
22-Nov-2021 21:53:56 [INFO] --- maven-resources-plugin:2.6:testResources (default-testResources) @ referenceapplication-package ---
22-Nov-2021 21:53:56 [INFO] Using 'UTF-8' encoding to copy filtered resources.
22-Nov-2021 21:53:56 [INFO] skip non existing resourceDirectory /home/bamboo-agent/bamboo-agent/xml-data/build-dir/REFAPP-UI-FRAMEWORK/package/src/test/resources
22-Nov-2021 21:53:56 [INFO] skip non existing resourceDirectory /home/bamboo-agent/bamboo-agent/xml-data/build-dir/REFAPP-UI-FRAMEWORK/package/src/test/resources
22-Nov-2021 21:53:56 [INFO]
22-Nov-2021 21:53:56 [INFO] --- maven-compiler-plugin:3.1:testCompile (default-testCompile) @ referenceapplication-package ---
22-Nov-2021 21:53:56 [INFO] No sources to compile
22-Nov-2021 21:53:56 [INFO]
22-Nov-2021 21:53:56 [INFO] --- maven-surefire-plugin:2.12:test (default-test) @ referenceapplication-package ---
22-Nov-2021 21:53:57 [INFO] No tests to run.
22-Nov-2021 21:53:57 [INFO] Surefire report directory: /home/bamboo-agent/bamboo-agent/xml-data/build-dir/REFAPP-UI-FRAMEWORK/package/target/surefire-reports
22-Nov-2021 21:53:57
22-Nov-2021 21:53:57 -------------------------------------------------------
22-Nov-2021 21:53:57 T E S T S
22-Nov-2021 21:53:57 -------------------------------------------------------
22-Nov-2021 21:54:00
22-Nov-2021 21:54:00 Results :
22-Nov-2021 21:54:00
22-Nov-2021 21:54:00 Tests run: 0, Failures: 0, Errors: 0, Skipped: 0
22-Nov-2021 21:54:00
22-Nov-2021 21:54:00 [INFO]
22-Nov-2021 21:54:00 [INFO] --- maven-jar-plugin:2.4:jar (default-jar) @ referenceapplication-package ---
22-Nov-2021 21:54:00 [INFO] Building jar: /home/bamboo-agent/bamboo-agent/xml-data/build-dir/REFAPP-UI-FRAMEWORK/package/target/referenceapplication-package-2.13.0-SNAPSHOT.jar
22-Nov-2021 21:54:00 [INFO]
22-Nov-2021 21:54:00 [INFO] --- maven-assembly-plugin:2.3:single (make-assembly) @ referenceapplication-package ---
22-Nov-2021 21:54:01 [INFO] Reading assembly descriptor: /home/bamboo-agent/bamboo-agent/xml-data/build-dir/REFAPP-UI-FRAMEWORK/package/src/main/assembly/assembly.xml
22-Nov-2021 21:54:01 [INFO] Building zip: /home/bamboo-agent/bamboo-agent/xml-data/build-dir/REFAPP-UI-FRAMEWORK/package/target/referenceapplication-package-2.13.0-SNAPSHOT-addons.zip
22-Nov-2021 21:54:05 [INFO]
22-Nov-2021 21:54:05 [INFO] --- build-helper-maven-plugin:3.0.0:attach-artifact (attach-artifacts) @ referenceapplication-package ---
22-Nov-2021 21:54:06 [INFO]
22-Nov-2021 21:54:06 [INFO] --- maven-jar-plugin:2.4:test-jar (default) @ referenceapplication-package ---
22-Nov-2021 21:54:06 [WARNING] JAR will be empty - no content was marked for inclusion!
22-Nov-2021 21:54:06 [INFO] Building jar: /home/bamboo-agent/bamboo-agent/xml-data/build-dir/REFAPP-UI-FRAMEWORK/package/target/referenceapplication-package-2.13.0-SNAPSHOT-tests.jar
22-Nov-2021 21:54:06 [INFO]
22-Nov-2021 21:54:06 [INFO] --- maven-install-plugin:2.4:install (default-install) @ referenceapplication-package ---
22-Nov-2021 21:54:06 [INFO] Installing /home/bamboo-agent/bamboo-agent/xml-data/build-dir/REFAPP-UI-FRAMEWORK/package/target/referenceapplication-package-2.13.0-SNAPSHOT.jar to /home/bamboo-agent/.m2/repository/org/openmrs/distro/referenceapplication-package/2.13.0-SNAPSHOT/referenceapplication-package-2.13.0-SNAPSHOT.jar
22-Nov-2021 21:54:06 [INFO] Installing /home/bamboo-agent/bamboo-agent/xml-data/build-dir/REFAPP-UI-FRAMEWORK/package/pom.xml to /home/bamboo-agent/.m2/repository/org/openmrs/distro/referenceapplication-package/2.13.0-SNAPSHOT/referenceapplication-package-2.13.0-SNAPSHOT.pom
22-Nov-2021 21:54:06 [INFO] Installing /home/bamboo-agent/bamboo-agent/xml-data/build-dir/REFAPP-UI-FRAMEWORK/package/target/referenceapplication-package-2.13.0-SNAPSHOT-addons.zip to /home/bamboo-agent/.m2/repository/org/openmrs/distro/referenceapplication-package/2.13.0-SNAPSHOT/referenceapplication-package-2.13.0-SNAPSHOT-addons.zip
22-Nov-2021 21:54:06 [INFO] Installing /home/bamboo-agent/bamboo-agent/xml-data/build-dir/REFAPP-UI-FRAMEWORK/package/target/bundled-distro/web/openmrs.war to /home/bamboo-agent/.m2/repository/org/openmrs/distro/referenceapplication-package/2.13.0-SNAPSHOT/referenceapplication-package-2.13.0-SNAPSHOT.war
22-Nov-2021 21:54:07 [INFO] Installing /home/bamboo-agent/bamboo-agent/xml-data/build-dir/REFAPP-UI-FRAMEWORK/package/target/referenceapplication-package-2.13.0-SNAPSHOT-tests.jar to /home/bamboo-agent/.m2/repository/org/openmrs/distro/referenceapplication-package/2.13.0-SNAPSHOT/referenceapplication-package-2.13.0-SNAPSHOT-tests.jar
22-Nov-2021 21:54:08 [INFO]                                                                         
22-Nov-2021 21:54:08 [INFO] ------------------------------------------------------------------------
22-Nov-2021 21:54:08 [INFO] Building Reference Application Distribution UI Tests 2.13.0-SNAPSHOT
22-Nov-2021 21:54:08 [INFO] ------------------------------------------------------------------------
22-Nov-2021 21:54:08 [INFO]
22-Nov-2021 21:54:08 [INFO] --- maven-clean-plugin:2.5:clean (default-clean) @ referenceapplication-ui-tests ---
22-Nov-2021 21:54:08 [INFO]
22-Nov-2021 21:54:08 [INFO] --- maven-resources-plugin:2.6:resources (default-resources) @ referenceapplication-ui-tests ---
22-Nov-2021 21:54:08 [INFO] Using 'UTF-8' encoding to copy filtered resources.
22-Nov-2021 21:54:08 [INFO] skip non existing resourceDirectory /home/bamboo-agent/bamboo-agent/xml-data/build-dir/REFAPP-UI-FRAMEWORK/ui-tests/src/main/resources
22-Nov-2021 21:54:08 [INFO]
22-Nov-2021 21:54:08 [INFO] --- maven-compiler-plugin:3.1:compile (default-compile) @ referenceapplication-ui-tests ---
22-Nov-2021 21:54:08 [INFO] No sources to compile
22-Nov-2021 21:54:08 [INFO]
22-Nov-2021 21:54:08 [INFO] --- maven-resources-plugin:2.6:testResources (default-testResources) @ referenceapplication-ui-tests ---
22-Nov-2021 21:54:08 [INFO] Using 'UTF-8' encoding to copy filtered resources.
22-Nov-2021 21:54:08 [INFO] Copying 2 resources
22-Nov-2021 21:54:08 [INFO] Copying 2 resources
22-Nov-2021 21:54:08 [INFO]
22-Nov-2021 21:54:08 [INFO] --- maven-compiler-plugin:3.1:testCompile (default-testCompile) @ referenceapplication-ui-tests ---
22-Nov-2021 21:54:09 [INFO] Changes detected - recompiling the module!
22-Nov-2021 21:54:09 [INFO] Compiling 120 source files to /home/bamboo-agent/bamboo-agent/xml-data/build-dir/REFAPP-UI-FRAMEWORK/ui-tests/target/test-classes
22-Nov-2021 21:54:12 [WARNING] /home/bamboo-agent/bamboo-agent/xml-data/build-dir/REFAPP-UI-FRAMEWORK/ui-tests/src/test/java/org/openmrs/reference/AddDeleteLocationTest.java: Some input files use or override a deprecated API.
22-Nov-2021 21:54:12 [WARNING] /home/bamboo-agent/bamboo-agent/xml-data/build-dir/REFAPP-UI-FRAMEWORK/ui-tests/src/test/java/org/openmrs/reference/AddDeleteLocationTest.java: Recompile with -Xlint:deprecation for details.
22-Nov-2021 21:54:12 [WARNING] /home/bamboo-agent/bamboo-agent/xml-data/build-dir/REFAPP-UI-FRAMEWORK/ui-tests/src/test/java/org/openmrs/reference/AddRolesToUserTest.java: /home/bamboo-agent/bamboo-agent/xml-data/build-dir/REFAPP-UI-FRAMEWORK/ui-tests/src/test/java/org/openmrs/reference/AddRolesToUserTest.java uses unchecked or unsafe operations.
22-Nov-2021 21:54:12 [WARNING] /home/bamboo-agent/bamboo-agent/xml-data/build-dir/REFAPP-UI-FRAMEWORK/ui-tests/src/test/java/org/openmrs/reference/AddRolesToUserTest.java: Recompile with -Xlint:unchecked for details.
22-Nov-2021 21:54:12 [INFO]
22-Nov-2021 21:54:12 [INFO] --- maven-antrun-plugin:1.8:run (make-mac-chromedriver-executable) @ referenceapplication-ui-tests ---
22-Nov-2021 21:54:12 [INFO] Executing tasks
22-Nov-2021 21:54:12
22-Nov-2021 21:54:12 main:
22-Nov-2021 21:54:12 [INFO] An Ant BuildException has occured: /home/bamboo-agent/bamboo-agent/xml-data/build-dir/REFAPP-UI-FRAMEWORK/ui-tests/target/test-classes/chromedriver/mac does not exist.
22-Nov-2021 21:54:12 around Ant part ...<chmod file="target/test-classes/chromedriver/mac/chromedriver" perm="755"/>... @ 4:79 in /home/bamboo-agent/bamboo-agent/xml-data/build-dir/REFAPP-UI-FRAMEWORK/ui-tests/target/antrun/build-main.xml
22-Nov-2021 21:54:12 /home/bamboo-agent/bamboo-agent/xml-data/build-dir/REFAPP-UI-FRAMEWORK/ui-tests/target/antrun/build-main.xml:4: /home/bamboo-agent/bamboo-agent/xml-data/build-dir/REFAPP-UI-FRAMEWORK/ui-tests/target/test-classes/chromedriver/mac does not exist.
22-Nov-2021 21:54:12         at org.apache.tools.ant.types.AbstractFileSet.getDirectoryScanner(AbstractFileSet.java:484)
22-Nov-2021 21:54:12         at org.apache.tools.ant.taskdefs.ExecuteOn.runExec(ExecuteOn.java:369)
22-Nov-2021 21:54:12         at org.apache.tools.ant.taskdefs.ExecTask.execute(ExecTask.java:495)
22-Nov-2021 21:54:12         at org.apache.tools.ant.taskdefs.Chmod.execute(Chmod.java:181)
22-Nov-2021 21:54:12         at org.apache.tools.ant.UnknownElement.execute(UnknownElement.java:292)
22-Nov-2021 21:54:12         at sun.reflect.NativeMethodAccessorImpl.invoke0(Native Method)
22-Nov-2021 21:54:12         at sun.reflect.NativeMethodAccessorImpl.invoke(NativeMethodAccessorImpl.java:62)
22-Nov-2021 21:54:12         at sun.reflect.DelegatingMethodAccessorImpl.invoke(DelegatingMethodAccessorImpl.java:43)
22-Nov-2021 21:54:12         at java.lang.reflect.Method.invoke(Method.java:498)
22-Nov-2021 21:54:12         at org.apache.tools.ant.dispatch.DispatchUtils.execute(DispatchUtils.java:106)
22-Nov-2021 21:54:12         at org.apache.tools.ant.Task.perform(Task.java:348)
22-Nov-2021 21:54:12         at org.apache.tools.ant.Target.execute(Target.java:435)
22-Nov-2021 21:54:12         at org.apache.tools.ant.Target.performTasks(Target.java:456)
22-Nov-2021 21:54:12         at org.apache.tools.ant.Project.executeSortedTargets(Project.java:1393)
22-Nov-2021 21:54:12         at org.apache.tools.ant.Project.executeTarget(Project.java:1364)
22-Nov-2021 21:54:12         at org.apache.maven.plugin.antrun.AntRunMojo.execute(AntRunMojo.java:313)
22-Nov-2021 21:54:12         at org.apache.maven.plugin.DefaultBuildPluginManager.executeMojo(DefaultBuildPluginManager.java:134)
22-Nov-2021 21:54:12         at org.apache.maven.lifecycle.internal.MojoExecutor.execute(MojoExecutor.java:207)
22-Nov-2021 21:54:12         at org.apache.maven.lifecycle.internal.MojoExecutor.execute(MojoExecutor.java:153)
22-Nov-2021 21:54:12         at org.apache.maven.lifecycle.internal.MojoExecutor.execute(MojoExecutor.java:145)
22-Nov-2021 21:54:12         at org.apache.maven.lifecycle.internal.LifecycleModuleBuilder.buildProject(LifecycleModuleBuilder.java:116)
22-Nov-2021 21:54:12         at org.apache.maven.lifecycle.internal.LifecycleModuleBuilder.buildProject(LifecycleModuleBuilder.java:80)
22-Nov-2021 21:54:12         at org.apache.maven.lifecycle.internal.builder.singlethreaded.SingleThreadedBuilder.build(SingleThreadedBuilder.java:51)
22-Nov-2021 21:54:12         at org.apache.maven.lifecycle.internal.LifecycleStarter.execute(LifecycleStarter.java:128)
22-Nov-2021 21:54:12         at org.apache.maven.DefaultMaven.doExecute(DefaultMaven.java:307)
22-Nov-2021 21:54:12         at org.apache.maven.DefaultMaven.doExecute(DefaultMaven.java:193)
22-Nov-2021 21:54:12         at org.apache.maven.DefaultMaven.execute(DefaultMaven.java:106)
22-Nov-2021 21:54:12         at org.apache.maven.cli.MavenCli.execute(MavenCli.java:863)
22-Nov-2021 21:54:12         at org.apache.maven.cli.MavenCli.doMain(MavenCli.java:288)
22-Nov-2021 21:54:12         at org.apache.maven.cli.MavenCli.main(MavenCli.java:199)
22-Nov-2021 21:54:12         at sun.reflect.NativeMethodAccessorImpl.invoke0(Native Method)
22-Nov-2021 21:54:12         at sun.reflect.NativeMethodAccessorImpl.invoke(NativeMethodAccessorImpl.java:62)
22-Nov-2021 21:54:12         at sun.reflect.DelegatingMethodAccessorImpl.invoke(DelegatingMethodAccessorImpl.java:43)
22-Nov-2021 21:54:12         at java.lang.reflect.Method.invoke(Method.java:498)
22-Nov-2021 21:54:12         at org.codehaus.plexus.classworlds.launcher.Launcher.launchEnhanced(Launcher.java:289)
22-Nov-2021 21:54:12         at org.codehaus.plexus.classworlds.launcher.Launcher.launch(Launcher.java:229)
22-Nov-2021 21:54:12         at org.codehaus.plexus.classworlds.launcher.Launcher.mainWithExitCode(Launcher.java:415)
22-Nov-2021 21:54:12         at org.codehaus.plexus.classworlds.launcher.Launcher.main(Launcher.java:356)
22-Nov-2021 21:54:12 [INFO]
22-Nov-2021 21:54:12 [INFO] --- maven-antrun-plugin:1.8:run (make-linux-chromedriver-executable) @ referenceapplication-ui-tests ---
22-Nov-2021 21:54:12 [INFO] Executing tasks
22-Nov-2021 21:54:12
22-Nov-2021 21:54:12 main:
22-Nov-2021 21:54:12 [INFO] Executed tasks
22-Nov-2021 21:54:12 [INFO]
22-Nov-2021 21:54:12 [INFO] --- maven-antrun-plugin:1.8:run (make-mac-firefoxdriver-executable) @ referenceapplication-ui-tests ---
22-Nov-2021 21:54:12 [INFO] Executing tasks
22-Nov-2021 21:54:12
22-Nov-2021 21:54:12 main:
22-Nov-2021 21:54:12 [INFO] An Ant BuildException has occured: /home/bamboo-agent/bamboo-agent/xml-data/build-dir/REFAPP-UI-FRAMEWORK/ui-tests/target/test-classes/firefoxdriver/mac does not exist.
22-Nov-2021 21:54:12 around Ant part ...<chmod file="target/test-classes/firefoxdriver/mac/geckodriver" perm="755"/>... @ 4:79 in /home/bamboo-agent/bamboo-agent/xml-data/build-dir/REFAPP-UI-FRAMEWORK/ui-tests/target/antrun/build-main.xml
22-Nov-2021 21:54:12 /home/bamboo-agent/bamboo-agent/xml-data/build-dir/REFAPP-UI-FRAMEWORK/ui-tests/target/antrun/build-main.xml:4: /home/bamboo-agent/bamboo-agent/xml-data/build-dir/REFAPP-UI-FRAMEWORK/ui-tests/target/test-classes/firefoxdriver/mac does not exist.
22-Nov-2021 21:54:12         at org.apache.tools.ant.types.AbstractFileSet.getDirectoryScanner(AbstractFileSet.java:484)
22-Nov-2021 21:54:12         at org.apache.tools.ant.taskdefs.ExecuteOn.runExec(ExecuteOn.java:369)
22-Nov-2021 21:54:12         at org.apache.tools.ant.taskdefs.ExecTask.execute(ExecTask.java:495)
22-Nov-2021 21:54:12         at org.apache.tools.ant.taskdefs.Chmod.execute(Chmod.java:181)
22-Nov-2021 21:54:12         at org.apache.tools.ant.UnknownElement.execute(UnknownElement.java:292)
22-Nov-2021 21:54:12         at sun.reflect.NativeMethodAccessorImpl.invoke0(Native Method)
22-Nov-2021 21:54:12         at sun.reflect.NativeMethodAccessorImpl.invoke(NativeMethodAccessorImpl.java:62)
22-Nov-2021 21:54:12         at sun.reflect.DelegatingMethodAccessorImpl.invoke(DelegatingMethodAccessorImpl.java:43)
22-Nov-2021 21:54:12         at java.lang.reflect.Method.invoke(Method.java:498)
22-Nov-2021 21:54:12         at org.apache.tools.ant.dispatch.DispatchUtils.execute(DispatchUtils.java:106)
22-Nov-2021 21:54:12         at org.apache.tools.ant.Task.perform(Task.java:348)
22-Nov-2021 21:54:12         at org.apache.tools.ant.Target.execute(Target.java:435)
22-Nov-2021 21:54:12         at org.apache.tools.ant.Target.performTasks(Target.java:456)
22-Nov-2021 21:54:12         at org.apache.tools.ant.Project.executeSortedTargets(Project.java:1393)
22-Nov-2021 21:54:12         at org.apache.tools.ant.Project.executeTarget(Project.java:1364)
22-Nov-2021 21:54:12         at org.apache.maven.plugin.antrun.AntRunMojo.execute(AntRunMojo.java:313)
22-Nov-2021 21:54:12         at org.apache.maven.plugin.DefaultBuildPluginManager.executeMojo(DefaultBuildPluginManager.java:134)
22-Nov-2021 21:54:12         at org.apache.maven.lifecycle.internal.MojoExecutor.execute(MojoExecutor.java:207)
22-Nov-2021 21:54:12         at org.apache.maven.lifecycle.internal.MojoExecutor.execute(MojoExecutor.java:153)
22-Nov-2021 21:54:12         at org.apache.maven.lifecycle.internal.MojoExecutor.execute(MojoExecutor.java:145)
22-Nov-2021 21:54:12         at org.apache.maven.lifecycle.internal.LifecycleModuleBuilder.buildProject(LifecycleModuleBuilder.java:116)
22-Nov-2021 21:54:12         at org.apache.maven.lifecycle.internal.LifecycleModuleBuilder.buildProject(LifecycleModuleBuilder.java:80)
22-Nov-2021 21:54:12         at org.apache.maven.lifecycle.internal.builder.singlethreaded.SingleThreadedBuilder.build(SingleThreadedBuilder.java:51)
22-Nov-2021 21:54:12         at org.apache.maven.lifecycle.internal.LifecycleStarter.execute(LifecycleStarter.java:128)
22-Nov-2021 21:54:12         at org.apache.maven.DefaultMaven.doExecute(DefaultMaven.java:307)
22-Nov-2021 21:54:12         at org.apache.maven.DefaultMaven.doExecute(DefaultMaven.java:193)
22-Nov-2021 21:54:12         at org.apache.maven.DefaultMaven.execute(DefaultMaven.java:106)
22-Nov-2021 21:54:12         at org.apache.maven.cli.MavenCli.execute(MavenCli.java:863)
22-Nov-2021 21:54:12         at org.apache.maven.cli.MavenCli.doMain(MavenCli.java:288)
22-Nov-2021 21:54:12         at org.apache.maven.cli.MavenCli.main(MavenCli.java:199)
22-Nov-2021 21:54:12         at sun.reflect.NativeMethodAccessorImpl.invoke0(Native Method)
22-Nov-2021 21:54:12         at sun.reflect.NativeMethodAccessorImpl.invoke(NativeMethodAccessorImpl.java:62)
22-Nov-2021 21:54:12         at sun.reflect.DelegatingMethodAccessorImpl.invoke(DelegatingMethodAccessorImpl.java:43)
22-Nov-2021 21:54:12         at java.lang.reflect.Method.invoke(Method.java:498)
22-Nov-2021 21:54:12         at org.codehaus.plexus.classworlds.launcher.Launcher.launchEnhanced(Launcher.java:289)
22-Nov-2021 21:54:12         at org.codehaus.plexus.classworlds.launcher.Launcher.launch(Launcher.java:229)
22-Nov-2021 21:54:12         at org.codehaus.plexus.classworlds.launcher.Launcher.mainWithExitCode(Launcher.java:415)
22-Nov-2021 21:54:12         at org.codehaus.plexus.classworlds.launcher.Launcher.main(Launcher.java:356)
22-Nov-2021 21:54:12 [INFO]
22-Nov-2021 21:54:12 [INFO] --- maven-antrun-plugin:1.8:run (make-linux-firefoxdriver-executable) @ referenceapplication-ui-tests ---
22-Nov-2021 21:54:12 [INFO] Executing tasks
22-Nov-2021 21:54:12
22-Nov-2021 21:54:12 main:
22-Nov-2021 21:54:12 [INFO] Executed tasks
22-Nov-2021 21:54:12 [INFO]
22-Nov-2021 21:54:12 [INFO] --- maven-surefire-plugin:2.12:test (default-test) @ referenceapplication-ui-tests ---
22-Nov-2021 21:54:12 [INFO] Surefire report directory: /home/bamboo-agent/bamboo-agent/xml-data/build-dir/REFAPP-UI-FRAMEWORK/ui-tests/target/surefire-reports
22-Nov-2021 21:54:12
22-Nov-2021 21:54:12 -------------------------------------------------------
22-Nov-2021 21:54:12 T E S T S
22-Nov-2021 21:54:12 -------------------------------------------------------
22-Nov-2021 21:54:13 Running org.openmrs.reference.UnidentifiedPatientKeyboardTest
22-Nov-2021 21:54:13 Running locally...
22-Nov-2021 21:54:19 Starting ChromeDriver 90.0.4430.24 (4c6d850f087da467d926e8eddb76550aed655991-refs/branch-heads/4430@{#429}) on port 17992
22-Nov-2021 21:54:19 Only local connections are allowed.
22-Nov-2021 21:54:19 Please see https://chromedriver.chromium.org/security-considerations for suggestions on keeping ChromeDriver safe.
22-Nov-2021 21:54:19 ChromeDriver was started successfully.
22-Nov-2021 21:54:33 Nov 22, 2021 9:54:33 PM org.openqa.selenium.remote.ProtocolHandshake createSession
22-Nov-2021 21:54:33 INFO: Detected dialect: W3C
22-Nov-2021 21:54:48 Tests run: 1, Failures: 0, Errors: 0, Skipped: 0, Time elapsed: 35.41 sec
22-Nov-2021 21:54:48 Running org.openmrs.reference.DeleteAllergyTest
22-Nov-2021 21:54:48 Running locally...
22-Nov-2021 21:54:48 Starting ChromeDriver 90.0.4430.24 (4c6d850f087da467d926e8eddb76550aed655991-refs/branch-heads/4430@{#429}) on port 24213
22-Nov-2021 21:54:48 Only local connections are allowed.
22-Nov-2021 21:54:48 Please see https://chromedriver.chromium.org/security-considerations for suggestions on keeping ChromeDriver safe.
22-Nov-2021 21:54:48 ChromeDriver was started successfully.
22-Nov-2021 21:54:49 Nov 22, 2021 9:54:49 PM org.openqa.selenium.remote.ProtocolHandshake createSession
22-Nov-2021 21:54:49 INFO: Detected dialect: W3C
22-Nov-2021 21:55:00 Tests run: 1, Failures: 0, Errors: 0, Skipped: 0, Time elapsed: 11.993 sec
22-Nov-2021 21:55:00 Running org.openmrs.reference.SearchActiveVisitsTest
22-Nov-2021 21:55:00 Running locally...
22-Nov-2021 21:55:00 Starting ChromeDriver 90.0.4430.24 (4c6d850f087da467d926e8eddb76550aed655991-refs/branch-heads/4430@{#429}) on port 20176
22-Nov-2021 21:55:00 Only local connections are allowed.
22-Nov-2021 21:55:00 Please see https://chromedriver.chromium.org/security-considerations for suggestions on keeping ChromeDriver safe.
22-Nov-2021 21:55:00 ChromeDriver was started successfully.
22-Nov-2021 21:55:01 Nov 22, 2021 9:55:01 PM org.openqa.selenium.remote.ProtocolHandshake createSession
22-Nov-2021 21:55:01 INFO: Detected dialect: W3C
22-Nov-2021 21:55:06 Tests run: 1, Failures: 0, Errors: 0, Skipped: 0, Time elapsed: 5.569 sec
22-Nov-2021 21:55:06 Running org.openmrs.reference.AddVisitTypeTest
22-Nov-2021 21:55:06 Running locally...
22-Nov-2021 21:55:06 Starting ChromeDriver 90.0.4430.24 (4c6d850f087da467d926e8eddb76550aed655991-refs/branch-heads/4430@{#429}) on port 20712
22-Nov-2021 21:55:06 Only local connections are allowed.
22-Nov-2021 21:55:06 Please see https://chromedriver.chromium.org/security-considerations for suggestions on keeping ChromeDriver safe.
22-Nov-2021 21:55:06 ChromeDriver was started successfully.
22-Nov-2021 21:55:06 Nov 22, 2021 9:55:06 PM org.openqa.selenium.remote.ProtocolHandshake createSession
22-Nov-2021 21:55:06 INFO: Detected dialect: W3C
22-Nov-2021 21:55:23 Tests run: 1, Failures: 0, Errors: 0, Skipped: 0, Time elapsed: 17.28 sec
22-Nov-2021 21:55:23 Running org.openmrs.reference.FindPatientRecordTest
22-Nov-2021 21:55:23 Running locally...
22-Nov-2021 21:55:23 Starting ChromeDriver 90.0.4430.24 (4c6d850f087da467d926e8eddb76550aed655991-refs/branch-heads/4430@{#429}) on port 25917
22-Nov-2021 21:55:23 Only local connections are allowed.
22-Nov-2021 21:55:23 Please see https://chromedriver.chromium.org/security-considerations for suggestions on keeping ChromeDriver safe.
22-Nov-2021 21:55:23 ChromeDriver was started successfully.
22-Nov-2021 21:55:23 Nov 22, 2021 9:55:23 PM org.openqa.selenium.remote.ProtocolHandshake createSession
22-Nov-2021 21:55:23 INFO: Detected dialect: W3C
22-Nov-2021 21:55:28 Tests run: 1, Failures: 0, Errors: 0, Skipped: 0, Time elapsed: 5.112 sec
22-Nov-2021 21:55:28 Running org.openmrs.reference.EditPersonTest
22-Nov-2021 21:55:28 Running locally...
22-Nov-2021 21:55:28 Starting ChromeDriver 90.0.4430.24 (4c6d850f087da467d926e8eddb76550aed655991-refs/branch-heads/4430@{#429}) on port 4478
22-Nov-2021 21:55:28 Only local connections are allowed.
22-Nov-2021 21:55:28 Please see https://chromedriver.chromium.org/security-considerations for suggestions on keeping ChromeDriver safe.
22-Nov-2021 21:55:28 ChromeDriver was started successfully.
22-Nov-2021 21:55:28 Nov 22, 2021 9:55:28 PM org.openqa.selenium.remote.ProtocolHandshake createSession
22-Nov-2021 21:55:28 INFO: Detected dialect: W3C
22-Nov-2021 21:55:42 Tests run: 1, Failures: 0, Errors: 0, Skipped: 0, Time elapsed: 13.995 sec
22-Nov-2021 21:55:42 Running org.openmrs.reference.RetireLocationTest
22-Nov-2021 21:55:42 Running locally...
22-Nov-2021 21:55:42 Starting ChromeDriver 90.0.4430.24 (4c6d850f087da467d926e8eddb76550aed655991-refs/branch-heads/4430@{#429}) on port 23723
22-Nov-2021 21:55:42 Only local connections are allowed.
22-Nov-2021 21:55:42 Please see https://chromedriver.chromium.org/security-considerations for suggestions on keeping ChromeDriver safe.
22-Nov-2021 21:55:42 ChromeDriver was started successfully.
22-Nov-2021 21:55:42 Nov 22, 2021 9:55:42 PM org.openqa.selenium.remote.ProtocolHandshake createSession
22-Nov-2021 21:55:42 INFO: Detected dialect: W3C
22-Nov-2021 21:55:46 Tests run: 1, Failures: 0, Errors: 0, Skipped: 0, Time elapsed: 3.771 sec
22-Nov-2021 21:55:46 Running org.openmrs.reference.XSSOnPhoneNumberFieldTest
22-Nov-2021 21:55:46 Running locally...
22-Nov-2021 21:55:46 Starting ChromeDriver 90.0.4430.24 (4c6d850f087da467d926e8eddb76550aed655991-refs/branch-heads/4430@{#429}) on port 4830
22-Nov-2021 21:55:46 Only local connections are allowed.
22-Nov-2021 21:55:46 Please see https://chromedriver.chromium.org/security-considerations for suggestions on keeping ChromeDriver safe.
22-Nov-2021 21:55:46 ChromeDriver was started successfully.
22-Nov-2021 21:55:46 Nov 22, 2021 9:55:46 PM org.openqa.selenium.remote.ProtocolHandshake createSession
22-Nov-2021 21:55:46 INFO: Detected dialect: W3C
22-Nov-2021 21:55:57 Tests run: 1, Failures: 0, Errors: 0, Skipped: 0, Time elapsed: 11.304 sec
22-Nov-2021 21:55:57 Running org.openmrs.reference.TransferToWardServiceTest
22-Nov-2021 21:55:57 Running locally...
22-Nov-2021 21:55:57 Starting ChromeDriver 90.0.4430.24 (4c6d850f087da467d926e8eddb76550aed655991-refs/branch-heads/4430@{#429}) on port 17818
22-Nov-2021 21:55:57 Only local connections are allowed.
22-Nov-2021 21:55:57 Please see https://chromedriver.chromium.org/security-considerations for suggestions on keeping ChromeDriver safe.
22-Nov-2021 21:55:57 ChromeDriver was started successfully.
22-Nov-2021 21:55:58 Nov 22, 2021 9:55:58 PM org.openqa.selenium.remote.ProtocolHandshake createSession
22-Nov-2021 21:55:58 INFO: Detected dialect: W3C
22-Nov-2021 21:56:14 Tests run: 1, Failures: 0, Errors: 0, Skipped: 0, Time elapsed: 16.863 sec
22-Nov-2021 21:56:14 Running org.openmrs.reference.EditVisitTypeTest
22-Nov-2021 21:56:14 Running locally...
22-Nov-2021 21:56:14 Starting ChromeDriver 90.0.4430.24 (4c6d850f087da467d926e8eddb76550aed655991-refs/branch-heads/4430@{#429}) on port 12199
22-Nov-2021 21:56:14 Only local connections are allowed.
22-Nov-2021 21:56:14 Please see https://chromedriver.chromium.org/security-considerations for suggestions on keeping ChromeDriver safe.
22-Nov-2021 21:56:14 ChromeDriver was started successfully.
22-Nov-2021 21:56:14 Nov 22, 2021 9:56:14 PM org.openqa.selenium.remote.ProtocolHandshake createSession
22-Nov-2021 21:56:14 INFO: Detected dialect: W3C
22-Nov-2021 21:56:18 Tests run: 1, Failures: 0, Errors: 0, Skipped: 0, Time elapsed: 3.859 sec
22-Nov-2021 21:56:18 Running org.openmrs.reference.ComeBackToApplicationAfterLogoutTest
22-Nov-2021 21:56:18 Running locally...
22-Nov-2021 21:56:18 Starting ChromeDriver 90.0.4430.24 (4c6d850f087da467d926e8eddb76550aed655991-refs/branch-heads/4430@{#429}) on port 28381
22-Nov-2021 21:56:18 Only local connections are allowed.
22-Nov-2021 21:56:18 Please see https://chromedriver.chromium.org/security-considerations for suggestions on keeping ChromeDriver safe.
22-Nov-2021 21:56:18 ChromeDriver was started successfully.
22-Nov-2021 21:56:18 Nov 22, 2021 9:56:18 PM org.openqa.selenium.remote.ProtocolHandshake createSession
22-Nov-2021 21:56:18 INFO: Detected dialect: W3C
22-Nov-2021 21:56:20 Tests run: 1, Failures: 0, Errors: 0, Skipped: 0, Time elapsed: 2.128 sec
22-Nov-2021 21:56:20 Running org.openmrs.reference.EditDemographicTest
22-Nov-2021 21:56:20 Running locally...
22-Nov-2021 21:56:20 Starting ChromeDriver 90.0.4430.24 (4c6d850f087da467d926e8eddb76550aed655991-refs/branch-heads/4430@{#429}) on port 7747
22-Nov-2021 21:56:20 Only local connections are allowed.
22-Nov-2021 21:56:20 Please see https://chromedriver.chromium.org/security-considerations for suggestions on keeping ChromeDriver safe.
22-Nov-2021 21:56:20 ChromeDriver was started successfully.
22-Nov-2021 21:56:20 Nov 22, 2021 9:56:20 PM org.openqa.selenium.remote.ProtocolHandshake createSession
22-Nov-2021 21:56:20 INFO: Detected dialect: W3C
22-Nov-2021 21:56:30 Tests run: 1, Failures: 0, Errors: 0, Skipped: 0, Time elapsed: 10.056 sec
22-Nov-2021 21:56:30 Running org.openmrs.reference.DeleteVisitTypeTest
22-Nov-2021 21:56:30 Running locally...
22-Nov-2021 21:56:30 Starting ChromeDriver 90.0.4430.24 (4c6d850f087da467d926e8eddb76550aed655991-refs/branch-heads/4430@{#429}) on port 15011
22-Nov-2021 21:56:30 Only local connections are allowed.
22-Nov-2021 21:56:30 Please see https://chromedriver.chromium.org/security-considerations for suggestions on keeping ChromeDriver safe.
22-Nov-2021 21:56:30 ChromeDriver was started successfully.
22-Nov-2021 21:56:31 Nov 22, 2021 9:56:31 PM org.openqa.selenium.remote.ProtocolHandshake createSession
22-Nov-2021 21:56:31 INFO: Detected dialect: W3C
22-Nov-2021 21:56:34 Tests run: 1, Failures: 0, Errors: 0, Skipped: 0, Time elapsed: 4.013 sec
22-Nov-2021 21:56:34 Running org.openmrs.reference.FormTest
22-Nov-2021 21:56:34 Running locally...
22-Nov-2021 21:56:34 Starting ChromeDriver 90.0.4430.24 (4c6d850f087da467d926e8eddb76550aed655991-refs/branch-heads/4430@{#429}) on port 32550
22-Nov-2021 21:56:34 Only local connections are allowed.
22-Nov-2021 21:56:34 Please see https://chromedriver.chromium.org/security-considerations for suggestions on keeping ChromeDriver safe.
22-Nov-2021 21:56:34 ChromeDriver was started successfully.
22-Nov-2021 21:56:35 Nov 22, 2021 9:56:35 PM org.openqa.selenium.remote.ProtocolHandshake createSession
22-Nov-2021 21:56:35 INFO: Detected dialect: W3C
22-Nov-2021 21:56:46 Running locally...
22-Nov-2021 21:56:46 Starting ChromeDriver 90.0.4430.24 (4c6d850f087da467d926e8eddb76550aed655991-refs/branch-heads/4430@{#429}) on port 29400
22-Nov-2021 21:56:46 Only local connections are allowed.
22-Nov-2021 21:56:46 Please see https://chromedriver.chromium.org/security-considerations for suggestions on keeping ChromeDriver safe.
22-Nov-2021 21:56:46 ChromeDriver was started successfully.
22-Nov-2021 21:56:46 Nov 22, 2021 9:56:46 PM org.openqa.selenium.remote.ProtocolHandshake createSession
22-Nov-2021 21:56:46 INFO: Detected dialect: W3C
22-Nov-2021 21:56:53 Running locally...
22-Nov-2021 21:56:53 Starting ChromeDriver 90.0.4430.24 (4c6d850f087da467d926e8eddb76550aed655991-refs/branch-heads/4430@{#429}) on port 4746
22-Nov-2021 21:56:53 Only local connections are allowed.
22-Nov-2021 21:56:53 Please see https://chromedriver.chromium.org/security-considerations for suggestions on keeping ChromeDriver safe.
22-Nov-2021 21:56:53 ChromeDriver was started successfully.
22-Nov-2021 21:56:53 Nov 22, 2021 9:56:53 PM org.openqa.selenium.remote.ProtocolHandshake createSession
22-Nov-2021 21:56:53 INFO: Detected dialect: W3C
22-Nov-2021 21:56:57 Running locally...
22-Nov-2021 21:56:57 Starting ChromeDriver 90.0.4430.24 (4c6d850f087da467d926e8eddb76550aed655991-refs/branch-heads/4430@{#429}) on port 13258
22-Nov-2021 21:56:57 Only local connections are allowed.
22-Nov-2021 21:56:57 Please see https://chromedriver.chromium.org/security-considerations for suggestions on keeping ChromeDriver safe.
22-Nov-2021 21:56:57 ChromeDriver was started successfully.
22-Nov-2021 21:56:57 Nov 22, 2021 9:56:57 PM org.openqa.selenium.remote.ProtocolHandshake createSession
22-Nov-2021 21:56:57 INFO: Detected dialect: W3C
22-Nov-2021 21:57:02 Tests run: 4, Failures: 0, Errors: 0, Skipped: 0, Time elapsed: 27.497 sec
22-Nov-2021 21:57:02 Running org.openmrs.reference.RegisterUnidentifiedPatientTest
22-Nov-2021 21:57:02 Running locally...
22-Nov-2021 21:57:02 Starting ChromeDriver 90.0.4430.24 (4c6d850f087da467d926e8eddb76550aed655991-refs/branch-heads/4430@{#429}) on port 23243
22-Nov-2021 21:57:02 Only local connections are allowed.
22-Nov-2021 21:57:02 Please see https://chromedriver.chromium.org/security-considerations for suggestions on keeping ChromeDriver safe.
22-Nov-2021 21:57:02 ChromeDriver was started successfully.
22-Nov-2021 21:57:02 Nov 22, 2021 9:57:02 PM org.openqa.selenium.remote.ProtocolHandshake createSession
22-Nov-2021 21:57:02 INFO: Detected dialect: W3C
22-Nov-2021 21:57:08 Tests run: 1, Failures: 0, Errors: 0, Skipped: 0, Time elapsed: 6.108 sec
22-Nov-2021 21:57:08 Running org.openmrs.reference.AddPatientAppointmentTest
22-Nov-2021 21:57:08 Running locally...
22-Nov-2021 21:57:08 Starting ChromeDriver 90.0.4430.24 (4c6d850f087da467d926e8eddb76550aed655991-refs/branch-heads/4430@{#429}) on port 31902
22-Nov-2021 21:57:08 Only local connections are allowed.
22-Nov-2021 21:57:08 Please see https://chromedriver.chromium.org/security-considerations for suggestions on keeping ChromeDriver safe.
22-Nov-2021 21:57:08 ChromeDriver was started successfully.
22-Nov-2021 21:57:08 Nov 22, 2021 9:57:08 PM org.openqa.selenium.remote.ProtocolHandshake createSession
22-Nov-2021 21:57:08 INFO: Detected dialect: W3C
22-Nov-2021 21:59:21 Tests run: 2, Failures: 0, Errors: 2, Skipped: 0, Time elapsed: 133.47 sec <<< FAILURE!
22-Nov-2021 21:59:21 Running org.openmrs.reference.AdmitExitInpatientTest
22-Nov-2021 21:59:21 Running locally...
22-Nov-2021 21:59:21 Starting ChromeDriver 90.0.4430.24 (4c6d850f087da467d926e8eddb76550aed655991-refs/branch-heads/4430@{#429}) on port 20886
22-Nov-2021 21:59:21 Only local connections are allowed.
22-Nov-2021 21:59:21 Please see https://chromedriver.chromium.org/security-considerations for suggestions on keeping ChromeDriver safe.
22-Nov-2021 21:59:21 ChromeDriver was started successfully.
22-Nov-2021 21:59:22 Nov 22, 2021 9:59:22 PM org.openqa.selenium.remote.ProtocolHandshake createSession
22-Nov-2021 21:59:22 INFO: Detected dialect: W3C
22-Nov-2021 21:59:36 Tests run: 1, Failures: 0, Errors: 0, Skipped: 0, Time elapsed: 14.597 sec
22-Nov-2021 21:59:36 Running org.openmrs.reference.DeleteRequestAppointmentTest
22-Nov-2021 21:59:36 Running locally...
22-Nov-2021 21:59:36 Starting ChromeDriver 90.0.4430.24 (4c6d850f087da467d926e8eddb76550aed655991-refs/branch-heads/4430@{#429}) on port 21237
22-Nov-2021 21:59:36 Only local connections are allowed.
22-Nov-2021 21:59:36 Please see https://chromedriver.chromium.org/security-considerations for suggestions on keeping ChromeDriver safe.
22-Nov-2021 21:59:36 ChromeDriver was started successfully.
22-Nov-2021 21:59:36 Nov 22, 2021 9:59:36 PM org.openqa.selenium.remote.ProtocolHandshake createSession
22-Nov-2021 21:59:36 INFO: Detected dialect: W3C
22-Nov-2021 21:59:52 Tests run: 1, Failures: 0, Errors: 0, Skipped: 0, Time elapsed: 16.23 sec
22-Nov-2021 21:59:52 Running org.openmrs.reference.EditAllergyTest
22-Nov-2021 21:59:52 Running locally...
22-Nov-2021 21:59:52 Starting ChromeDriver 90.0.4430.24 (4c6d850f087da467d926e8eddb76550aed655991-refs/branch-heads/4430@{#429}) on port 12318
22-Nov-2021 21:59:52 Only local connections are allowed.
22-Nov-2021 21:59:52 Please see https://chromedriver.chromium.org/security-considerations for suggestions on keeping ChromeDriver safe.
22-Nov-2021 21:59:52 ChromeDriver was started successfully.
22-Nov-2021 21:59:53 Nov 22, 2021 9:59:53 PM org.openqa.selenium.remote.ProtocolHandshake createSession
22-Nov-2021 21:59:53 INFO: Detected dialect: W3C
22-Nov-2021 22:00:03 Tests run: 1, Failures: 0, Errors: 0, Skipped: 0, Time elapsed: 10.666 sec
22-Nov-2021 22:00:03 Running org.openmrs.reference.VisitNoteTest
22-Nov-2021 22:00:03 Running locally...
22-Nov-2021 22:00:03 Starting ChromeDriver 90.0.4430.24 (4c6d850f087da467d926e8eddb76550aed655991-refs/branch-heads/4430@{#429}) on port 9484
22-Nov-2021 22:00:03 Only local connections are allowed.
22-Nov-2021 22:00:03 Please see https://chromedriver.chromium.org/security-considerations for suggestions on keeping ChromeDriver safe.
22-Nov-2021 22:00:03 ChromeDriver was started successfully.
22-Nov-2021 22:00:03 Nov 22, 2021 10:00:03 PM org.openqa.selenium.remote.ProtocolHandshake createSession
22-Nov-2021 22:00:03 INFO: Detected dialect: W3C
22-Nov-2021 22:00:30 Tests run: 1, Failures: 0, Errors: 0, Skipped: 0, Time elapsed: 27.268 sec
22-Nov-2021 22:00:30 Running org.openmrs.reference.CreatePersonTest
22-Nov-2021 22:00:30 Running locally...
22-Nov-2021 22:00:30 Starting ChromeDriver 90.0.4430.24 (4c6d850f087da467d926e8eddb76550aed655991-refs/branch-heads/4430@{#429}) on port 16760
22-Nov-2021 22:00:30 Only local connections are allowed.
22-Nov-2021 22:00:30 Please see https://chromedriver.chromium.org/security-considerations for suggestions on keeping ChromeDriver safe.
22-Nov-2021 22:00:30 ChromeDriver was started successfully.
22-Nov-2021 22:00:30 Nov 22, 2021 10:00:30 PM org.openqa.selenium.remote.ProtocolHandshake createSession
22-Nov-2021 22:00:30 INFO: Detected dialect: W3C
22-Nov-2021 22:00:39 Tests run: 1, Failures: 0, Errors: 0, Skipped: 0, Time elapsed: 8.615 sec
22-Nov-2021 22:00:39 Running org.openmrs.reference.FindPatientByNameTest
22-Nov-2021 22:00:39 Running locally...
22-Nov-2021 22:00:39 Starting ChromeDriver 90.0.4430.24 (4c6d850f087da467d926e8eddb76550aed655991-refs/branch-heads/4430@{#429}) on port 18487
22-Nov-2021 22:00:39 Only local connections are allowed.
22-Nov-2021 22:00:39 Please see https://chromedriver.chromium.org/security-considerations for suggestions on keeping ChromeDriver safe.
22-Nov-2021 22:00:39 ChromeDriver was started successfully.
22-Nov-2021 22:00:39 Nov 22, 2021 10:00:39 PM org.openqa.selenium.remote.ProtocolHandshake createSession
22-Nov-2021 22:00:39 INFO: Detected dialect: W3C
22-Nov-2021 22:00:46 Tests run: 1, Failures: 0, Errors: 0, Skipped: 0, Time elapsed: 7.416 sec
22-Nov-2021 22:00:46 Running org.openmrs.reference.AddUserTest
22-Nov-2021 22:00:46 Running locally...
22-Nov-2021 22:00:46 Starting ChromeDriver 90.0.4430.24 (4c6d850f087da467d926e8eddb76550aed655991-refs/branch-heads/4430@{#429}) on port 29634
22-Nov-2021 22:00:46 Only local connections are allowed.
22-Nov-2021 22:00:46 Please see https://chromedriver.chromium.org/security-considerations for suggestions on keeping ChromeDriver safe.
22-Nov-2021 22:00:46 ChromeDriver was started successfully.
22-Nov-2021 22:00:46 Nov 22, 2021 10:00:46 PM org.openqa.selenium.remote.ProtocolHandshake createSession
22-Nov-2021 22:00:46 INFO: Detected dialect: W3C
22-Nov-2021 22:01:02 Tests run: 1, Failures: 0, Errors: 0, Skipped: 0, Time elapsed: 15.482 sec
22-Nov-2021 22:01:02 Running org.openmrs.reference.AddProviderTest
22-Nov-2021 22:01:02 Running locally...
22-Nov-2021 22:01:02 Starting ChromeDriver 90.0.4430.24 (4c6d850f087da467d926e8eddb76550aed655991-refs/branch-heads/4430@{#429}) on port 28845
22-Nov-2021 22:01:02 Only local connections are allowed.
22-Nov-2021 22:01:02 Please see https://chromedriver.chromium.org/security-considerations for suggestions on keeping ChromeDriver safe.
22-Nov-2021 22:01:02 ChromeDriver was started successfully.
22-Nov-2021 22:01:02 Nov 22, 2021 10:01:02 PM org.openqa.selenium.remote.ProtocolHandshake createSession
22-Nov-2021 22:01:02 INFO: Detected dialect: W3C
22-Nov-2021 22:01:14 Tests run: 1, Failures: 0, Errors: 0, Skipped: 0, Time elapsed: 12.53 sec
22-Nov-2021 22:01:14 Running org.openmrs.reference.AddPastVisitTest
22-Nov-2021 22:01:14 Running locally...
22-Nov-2021 22:01:14 Starting ChromeDriver 90.0.4430.24 (4c6d850f087da467d926e8eddb76550aed655991-refs/branch-heads/4430@{#429}) on port 15302
22-Nov-2021 22:01:14 Only local connections are allowed.
22-Nov-2021 22:01:14 Please see https://chromedriver.chromium.org/security-considerations for suggestions on keeping ChromeDriver safe.
22-Nov-2021 22:01:14 ChromeDriver was started successfully.
22-Nov-2021 22:01:14 Nov 22, 2021 10:01:14 PM org.openqa.selenium.remote.ProtocolHandshake createSession
22-Nov-2021 22:01:14 INFO: Detected dialect: W3C
22-Nov-2021 22:01:24 Tests run: 1, Failures: 0, Errors: 0, Skipped: 0, Time elapsed: 9.976 sec
22-Nov-2021 22:01:24 Running org.openmrs.reference.RecordMergeIssueTest
22-Nov-2021 22:01:24 Running locally...
22-Nov-2021 22:01:24 Starting ChromeDriver 90.0.4430.24 (4c6d850f087da467d926e8eddb76550aed655991-refs/branch-heads/4430@{#429}) on port 11687
22-Nov-2021 22:01:24 Only local connections are allowed.
22-Nov-2021 22:01:24 Please see https://chromedriver.chromium.org/security-considerations for suggestions on keeping ChromeDriver safe.
22-Nov-2021 22:01:24 ChromeDriver was started successfully.
22-Nov-2021 22:01:25 Nov 22, 2021 10:01:25 PM org.openqa.selenium.remote.ProtocolHandshake createSession
22-Nov-2021 22:01:25 INFO: Detected dialect: W3C
22-Nov-2021 22:01:38 Tests run: 1, Failures: 0, Errors: 0, Skipped: 0, Time elapsed: 13.791 sec
22-Nov-2021 22:01:38 Running org.openmrs.reference.CaptureVitalsTest
22-Nov-2021 22:01:38 Running locally...
22-Nov-2021 22:01:38 Starting ChromeDriver 90.0.4430.24 (4c6d850f087da467d926e8eddb76550aed655991-refs/branch-heads/4430@{#429}) on port 28582
22-Nov-2021 22:01:38 Only local connections are allowed.
22-Nov-2021 22:01:38 Please see https://chromedriver.chromium.org/security-considerations for suggestions on keeping ChromeDriver safe.
22-Nov-2021 22:01:38 ChromeDriver was started successfully.
22-Nov-2021 22:01:38 Nov 22, 2021 10:01:38 PM org.openqa.selenium.remote.ProtocolHandshake createSession
22-Nov-2021 22:01:38 INFO: Detected dialect: W3C
22-Nov-2021 22:01:49 Tests run: 1, Failures: 0, Errors: 0, Skipped: 0, Time elapsed: 10.859 sec
22-Nov-2021 22:01:49 Running org.openmrs.reference.NamePatientAccentedLetterTest
22-Nov-2021 22:01:49 Running locally...
22-Nov-2021 22:01:49 Starting ChromeDriver 90.0.4430.24 (4c6d850f087da467d926e8eddb76550aed655991-refs/branch-heads/4430@{#429}) on port 2202
22-Nov-2021 22:01:49 Only local connections are allowed.
22-Nov-2021 22:01:49 Please see https://chromedriver.chromium.org/security-considerations for suggestions on keeping ChromeDriver safe.
22-Nov-2021 22:01:49 ChromeDriver was started successfully.
22-Nov-2021 22:01:49 Nov 22, 2021 10:01:49 PM org.openqa.selenium.remote.ProtocolHandshake createSession
22-Nov-2021 22:01:49 INFO: Detected dialect: W3C
22-Nov-2021 22:01:57 Tests run: 1, Failures: 0, Errors: 0, Skipped: 0, Time elapsed: 8.246 sec
22-Nov-2021 22:01:57 Running org.openmrs.reference.RetirePersonTest
22-Nov-2021 22:01:57 Running locally...
22-Nov-2021 22:01:57 Starting ChromeDriver 90.0.4430.24 (4c6d850f087da467d926e8eddb76550aed655991-refs/branch-heads/4430@{#429}) on port 26062
22-Nov-2021 22:01:57 Only local connections are allowed.
22-Nov-2021 22:01:57 Please see https://chromedriver.chromium.org/security-considerations for suggestions on keeping ChromeDriver safe.
22-Nov-2021 22:01:57 ChromeDriver was started successfully.
22-Nov-2021 22:01:57 Nov 22, 2021 10:01:57 PM org.openqa.selenium.remote.ProtocolHandshake createSession
22-Nov-2021 22:01:57 INFO: Detected dialect: W3C
22-Nov-2021 22:02:02 Tests run: 1, Failures: 0, Errors: 0, Skipped: 0, Time elapsed: 5.02 sec
22-Nov-2021 22:02:02 Running org.openmrs.reference.EndVisitTest
22-Nov-2021 22:02:02 Running locally...
22-Nov-2021 22:02:02 Starting ChromeDriver 90.0.4430.24 (4c6d850f087da467d926e8eddb76550aed655991-refs/branch-heads/4430@{#429}) on port 25360
22-Nov-2021 22:02:02 Only local connections are allowed.
22-Nov-2021 22:02:02 Please see https://chromedriver.chromium.org/security-considerations for suggestions on keeping ChromeDriver safe.
22-Nov-2021 22:02:02 ChromeDriver was started successfully.
22-Nov-2021 22:02:02 Nov 22, 2021 10:02:02 PM org.openqa.selenium.remote.ProtocolHandshake createSession
22-Nov-2021 22:02:02 INFO: Detected dialect: W3C
22-Nov-2021 22:02:14 Tests run: 1, Failures: 0, Errors: 0, Skipped: 0, Time elapsed: 11.791 sec
22-Nov-2021 22:02:14 Running org.openmrs.reference.DeleteAppointmentBlockTest
22-Nov-2021 22:02:14 Running locally...
22-Nov-2021 22:02:14 Starting ChromeDriver 90.0.4430.24 (4c6d850f087da467d926e8eddb76550aed655991-refs/branch-heads/4430@{#429}) on port 5085
22-Nov-2021 22:02:14 Only local connections are allowed.
22-Nov-2021 22:02:14 Please see https://chromedriver.chromium.org/security-considerations for suggestions on keeping ChromeDriver safe.
22-Nov-2021 22:02:14 ChromeDriver was started successfully.
22-Nov-2021 22:02:14 Nov 22, 2021 10:02:14 PM org.openqa.selenium.remote.ProtocolHandshake createSession
22-Nov-2021 22:02:14 INFO: Detected dialect: W3C
22-Nov-2021 22:02:20 Tests run: 1, Failures: 0, Errors: 0, Skipped: 0, Time elapsed: 5.941 sec
22-Nov-2021 22:02:20 Running org.openmrs.reference.BookRequestAppointmentTest
22-Nov-2021 22:02:20 Running locally...
22-Nov-2021 22:02:20 Starting ChromeDriver 90.0.4430.24 (4c6d850f087da467d926e8eddb76550aed655991-refs/branch-heads/4430@{#429}) on port 16399
22-Nov-2021 22:02:20 Only local connections are allowed.
22-Nov-2021 22:02:20 Please see https://chromedriver.chromium.org/security-considerations for suggestions on keeping ChromeDriver safe.
22-Nov-2021 22:02:20 ChromeDriver was started successfully.
22-Nov-2021 22:02:20 Nov 22, 2021 10:02:20 PM org.openqa.selenium.remote.ProtocolHandshake createSession
22-Nov-2021 22:02:20 INFO: Detected dialect: W3C
22-Nov-2021 22:04:38 Tests run: 2, Failures: 0, Errors: 2, Skipped: 0, Time elapsed: 137.98 sec <<< FAILURE!
22-Nov-2021 22:04:38 Running org.openmrs.reference.AddDeleteServiceTest
22-Nov-2021 22:04:38 Running locally...
22-Nov-2021 22:04:38 Starting ChromeDriver 90.0.4430.24 (4c6d850f087da467d926e8eddb76550aed655991-refs/branch-heads/4430@{#429}) on port 5467
22-Nov-2021 22:04:38 Only local connections are allowed.
22-Nov-2021 22:04:38 Please see https://chromedriver.chromium.org/security-considerations for suggestions on keeping ChromeDriver safe.
22-Nov-2021 22:04:38 ChromeDriver was started successfully.
22-Nov-2021 22:04:38 Nov 22, 2021 10:04:38 PM org.openqa.selenium.remote.ProtocolHandshake createSession
22-Nov-2021 22:04:38 INFO: Detected dialect: W3C
22-Nov-2021 22:04:44 Tests run: 1, Failures: 0, Errors: 0, Skipped: 0, Time elapsed: 6.192 sec
22-Nov-2021 22:04:44 Running org.openmrs.reference.AddEditAppointmentBlockTest
22-Nov-2021 22:04:44 Running locally...
22-Nov-2021 22:04:44 Starting ChromeDriver 90.0.4430.24 (4c6d850f087da467d926e8eddb76550aed655991-refs/branch-heads/4430@{#429}) on port 26407
22-Nov-2021 22:04:44 Only local connections are allowed.
22-Nov-2021 22:04:44 Please see https://chromedriver.chromium.org/security-considerations for suggestions on keeping ChromeDriver safe.
22-Nov-2021 22:04:44 ChromeDriver was started successfully.
22-Nov-2021 22:04:44 Nov 22, 2021 10:04:44 PM org.openqa.selenium.remote.ProtocolHandshake createSession
22-Nov-2021 22:04:44 INFO: Detected dialect: W3C
22-Nov-2021 22:04:51 Tests run: 1, Failures: 0, Errors: 0, Skipped: 0, Time elapsed: 7.003 sec
22-Nov-2021 22:04:51 Running org.openmrs.reference.RetireProviderTest
22-Nov-2021 22:04:51 Running locally...
22-Nov-2021 22:04:51 Starting ChromeDriver 90.0.4430.24 (4c6d850f087da467d926e8eddb76550aed655991-refs/branch-heads/4430@{#429}) on port 6933
22-Nov-2021 22:04:51 Only local connections are allowed.
22-Nov-2021 22:04:51 Please see https://chromedriver.chromium.org/security-considerations for suggestions on keeping ChromeDriver safe.
22-Nov-2021 22:04:51 ChromeDriver was started successfully.
22-Nov-2021 22:04:51 Nov 22, 2021 10:04:51 PM org.openqa.selenium.remote.ProtocolHandshake createSession
22-Nov-2021 22:04:51 INFO: Detected dialect: W3C
22-Nov-2021 22:04:57 Tests run: 1, Failures: 0, Errors: 0, Skipped: 0, Time elapsed: 5.61 sec
22-Nov-2021 22:04:57 Running org.openmrs.reference.MergePatientTest
22-Nov-2021 22:04:57 Running locally...
22-Nov-2021 22:04:57 Starting ChromeDriver 90.0.4430.24 (4c6d850f087da467d926e8eddb76550aed655991-refs/branch-heads/4430@{#429}) on port 28319
22-Nov-2021 22:04:57 Only local connections are allowed.
22-Nov-2021 22:04:57 Please see https://chromedriver.chromium.org/security-considerations for suggestions on keeping ChromeDriver safe.
22-Nov-2021 22:04:57 ChromeDriver was started successfully.
22-Nov-2021 22:04:57 Nov 22, 2021 10:04:57 PM org.openqa.selenium.remote.ProtocolHandshake createSession
22-Nov-2021 22:04:57 INFO: Detected dialect: W3C
22-Nov-2021 22:05:05 Tests run: 1, Failures: 0, Errors: 0, Skipped: 0, Time elapsed: 8.442 sec
22-Nov-2021 22:05:05 Running org.openmrs.reference.AddDeleteLocationTest
22-Nov-2021 22:05:05 Running locally...
22-Nov-2021 22:05:05 Starting ChromeDriver 90.0.4430.24 (4c6d850f087da467d926e8eddb76550aed655991-refs/branch-heads/4430@{#429}) on port 29050
22-Nov-2021 22:05:05 Only local connections are allowed.
22-Nov-2021 22:05:05 Please see https://chromedriver.chromium.org/security-considerations for suggestions on keeping ChromeDriver safe.
22-Nov-2021 22:05:05 ChromeDriver was started successfully.
22-Nov-2021 22:05:05 Nov 22, 2021 10:05:05 PM org.openqa.selenium.remote.ProtocolHandshake createSession
22-Nov-2021 22:05:05 INFO: Detected dialect: W3C
22-Nov-2021 22:05:09 Tests run: 1, Failures: 0, Errors: 0, Skipped: 0, Time elapsed: 4.447 sec
22-Nov-2021 22:05:09 Running org.openmrs.reference.DuplicatePatientRegisterTest
22-Nov-2021 22:05:09 Running locally...
22-Nov-2021 22:05:09 Starting ChromeDriver 90.0.4430.24 (4c6d850f087da467d926e8eddb76550aed655991-refs/branch-heads/4430@{#429}) on port 26813
22-Nov-2021 22:05:09 Only local connections are allowed.
22-Nov-2021 22:05:09 Please see https://chromedriver.chromium.org/security-considerations for suggestions on keeping ChromeDriver safe.
22-Nov-2021 22:05:10 ChromeDriver was started successfully.
22-Nov-2021 22:05:10 Nov 22, 2021 10:05:10 PM org.openqa.selenium.remote.ProtocolHandshake createSession
22-Nov-2021 22:05:10 INFO: Detected dialect: W3C
22-Nov-2021 22:05:22 Tests run: 1, Failures: 0, Errors: 0, Skipped: 0, Time elapsed: 12.152 sec
22-Nov-2021 22:05:22 Running org.openmrs.reference.UsingBackButtonInMergePatientTest
22-Nov-2021 22:05:22 Running locally...
22-Nov-2021 22:05:22 Starting ChromeDriver 90.0.4430.24 (4c6d850f087da467d926e8eddb76550aed655991-refs/branch-heads/4430@{#429}) on port 11427
22-Nov-2021 22:05:22 Only local connections are allowed.
22-Nov-2021 22:05:22 Please see https://chromedriver.chromium.org/security-considerations for suggestions on keeping ChromeDriver safe.
22-Nov-2021 22:05:22 ChromeDriver was started successfully.
22-Nov-2021 22:05:22 Nov 22, 2021 10:05:22 PM org.openqa.selenium.remote.ProtocolHandshake createSession
22-Nov-2021 22:05:22 INFO: Detected dialect: W3C
22-Nov-2021 22:05:35 Tests run: 1, Failures: 0, Errors: 0, Skipped: 0, Time elapsed: 13.415 sec
22-Nov-2021 22:05:35 Running org.openmrs.reference.AddDiagnosisToVisitNoteTest
22-Nov-2021 22:05:35 Running locally...
22-Nov-2021 22:05:35 Starting ChromeDriver 90.0.4430.24 (4c6d850f087da467d926e8eddb76550aed655991-refs/branch-heads/4430@{#429}) on port 5288
22-Nov-2021 22:05:35 Only local connections are allowed.
22-Nov-2021 22:05:35 Please see https://chromedriver.chromium.org/security-considerations for suggestions on keeping ChromeDriver safe.
22-Nov-2021 22:05:35 ChromeDriver was started successfully.
22-Nov-2021 22:05:35 Nov 22, 2021 10:05:35 PM org.openqa.selenium.remote.ProtocolHandshake createSession
22-Nov-2021 22:05:35 INFO: Detected dialect: W3C
22-Nov-2021 22:05:47 Tests run: 1, Failures: 0, Errors: 0, Skipped: 0, Time elapsed: 11.93 sec
22-Nov-2021 22:05:47 Running org.openmrs.reference.MergeVisitsTest
22-Nov-2021 22:05:47 Running locally...
22-Nov-2021 22:05:47 Starting ChromeDriver 90.0.4430.24 (4c6d850f087da467d926e8eddb76550aed655991-refs/branch-heads/4430@{#429}) on port 25628
22-Nov-2021 22:05:47 Only local connections are allowed.
22-Nov-2021 22:05:47 Please see https://chromedriver.chromium.org/security-considerations for suggestions on keeping ChromeDriver safe.
22-Nov-2021 22:05:47 ChromeDriver was started successfully.
22-Nov-2021 22:05:47 Nov 22, 2021 10:05:47 PM org.openqa.selenium.remote.ProtocolHandshake createSession
22-Nov-2021 22:05:47 INFO: Detected dialect: W3C
22-Nov-2021 22:06:00 Tests run: 1, Failures: 0, Errors: 0, Skipped: 0, Time elapsed: 12.765 sec
22-Nov-2021 22:06:00 Running org.openmrs.reference.CheckModulesTest
22-Nov-2021 22:06:00 Running locally...
22-Nov-2021 22:06:00 Starting ChromeDriver 90.0.4430.24 (4c6d850f087da467d926e8eddb76550aed655991-refs/branch-heads/4430@{#429}) on port 8089
22-Nov-2021 22:06:00 Only local connections are allowed.
22-Nov-2021 22:06:00 Please see https://chromedriver.chromium.org/security-considerations for suggestions on keeping ChromeDriver safe.
22-Nov-2021 22:06:00 ChromeDriver was started successfully.
22-Nov-2021 22:06:00 Nov 22, 2021 10:06:00 PM org.openqa.selenium.remote.ProtocolHandshake createSession
22-Nov-2021 22:06:00 INFO: Detected dialect: W3C
22-Nov-2021 22:06:09 Tests run: 1, Failures: 0, Errors: 0, Skipped: 0, Time elapsed: 9.556 sec
22-Nov-2021 22:06:09 Running org.openmrs.reference.EditServiceTest
22-Nov-2021 22:06:09 Running locally...
22-Nov-2021 22:06:09 Starting ChromeDriver 90.0.4430.24 (4c6d850f087da467d926e8eddb76550aed655991-refs/branch-heads/4430@{#429}) on port 25878
22-Nov-2021 22:06:09 Only local connections are allowed.
22-Nov-2021 22:06:09 Please see https://chromedriver.chromium.org/security-considerations for suggestions on keeping ChromeDriver safe.
22-Nov-2021 22:06:09 ChromeDriver was started successfully.
22-Nov-2021 22:06:10 Nov 22, 2021 10:06:10 PM org.openqa.selenium.remote.ProtocolHandshake createSession
22-Nov-2021 22:06:10 INFO: Detected dialect: W3C
22-Nov-2021 22:06:16 Tests run: 1, Failures: 0, Errors: 0, Skipped: 0, Time elapsed: 6.926 sec
22-Nov-2021 22:06:16 Running org.openmrs.reference.AddNewAllergyTest
22-Nov-2021 22:06:16 Running locally...
22-Nov-2021 22:06:16 Starting ChromeDriver 90.0.4430.24 (4c6d850f087da467d926e8eddb76550aed655991-refs/branch-heads/4430@{#429}) on port 3787
22-Nov-2021 22:06:16 Only local connections are allowed.
22-Nov-2021 22:06:16 Please see https://chromedriver.chromium.org/security-considerations for suggestions on keeping ChromeDriver safe.
22-Nov-2021 22:06:16 ChromeDriver was started successfully.
22-Nov-2021 22:06:17 Nov 22, 2021 10:06:17 PM org.openqa.selenium.remote.ProtocolHandshake createSession
22-Nov-2021 22:06:17 INFO: Detected dialect: W3C
22-Nov-2021 22:06:24 Tests run: 1, Failures: 0, Errors: 0, Skipped: 0, Time elapsed: 7.858 sec
22-Nov-2021 22:06:24 Running org.openmrs.reference.LoginTest
22-Nov-2021 22:06:24 Running locally...
22-Nov-2021 22:06:24 Starting ChromeDriver 90.0.4430.24 (4c6d850f087da467d926e8eddb76550aed655991-refs/branch-heads/4430@{#429}) on port 15294
22-Nov-2021 22:06:24 Only local connections are allowed.
22-Nov-2021 22:06:24 Please see https://chromedriver.chromium.org/security-considerations for suggestions on keeping ChromeDriver safe.
22-Nov-2021 22:06:24 ChromeDriver was started successfully.
22-Nov-2021 22:06:24 Nov 22, 2021 10:06:24 PM org.openqa.selenium.remote.ProtocolHandshake createSession
22-Nov-2021 22:06:24 INFO: Detected dialect: W3C
22-Nov-2021 22:06:27 Running locally...
22-Nov-2021 22:06:27 Starting ChromeDriver 90.0.4430.24 (4c6d850f087da467d926e8eddb76550aed655991-refs/branch-heads/4430@{#429}) on port 1323
22-Nov-2021 22:06:27 Only local connections are allowed.
22-Nov-2021 22:06:27 Please see https://chromedriver.chromium.org/security-considerations for suggestions on keeping ChromeDriver safe.
22-Nov-2021 22:06:27 ChromeDriver was started successfully.
22-Nov-2021 22:06:28 Nov 22, 2021 10:06:28 PM org.openqa.selenium.remote.ProtocolHandshake createSession
22-Nov-2021 22:06:28 INFO: Detected dialect: W3C
22-Nov-2021 22:06:29 Running locally...
22-Nov-2021 22:06:29 Starting ChromeDriver 90.0.4430.24 (4c6d850f087da467d926e8eddb76550aed655991-refs/branch-heads/4430@{#429}) on port 26092
22-Nov-2021 22:06:29 Only local connections are allowed.
22-Nov-2021 22:06:29 Please see https://chromedriver.chromium.org/security-considerations for suggestions on keeping ChromeDriver safe.
22-Nov-2021 22:06:29 ChromeDriver was started successfully.
22-Nov-2021 22:06:29 Nov 22, 2021 10:06:29 PM org.openqa.selenium.remote.ProtocolHandshake createSession
22-Nov-2021 22:06:29 INFO: Detected dialect: W3C
22-Nov-2021 22:06:32 Running locally...
22-Nov-2021 22:06:32 Starting ChromeDriver 90.0.4430.24 (4c6d850f087da467d926e8eddb76550aed655991-refs/branch-heads/4430@{#429}) on port 22837
22-Nov-2021 22:06:32 Only local connections are allowed.
22-Nov-2021 22:06:32 Please see https://chromedriver.chromium.org/security-considerations for suggestions on keeping ChromeDriver safe.
22-Nov-2021 22:06:32 ChromeDriver was started successfully.
22-Nov-2021 22:06:32 Nov 22, 2021 10:06:32 PM org.openqa.selenium.remote.ProtocolHandshake createSession
22-Nov-2021 22:06:32 INFO: Detected dialect: W3C
22-Nov-2021 22:06:35 Running locally...
22-Nov-2021 22:06:35 Starting ChromeDriver 90.0.4430.24 (4c6d850f087da467d926e8eddb76550aed655991-refs/branch-heads/4430@{#429}) on port 10434
22-Nov-2021 22:06:35 Only local connections are allowed.
22-Nov-2021 22:06:35 Please see https://chromedriver.chromium.org/security-considerations for suggestions on keeping ChromeDriver safe.
22-Nov-2021 22:06:35 ChromeDriver was started successfully.
22-Nov-2021 22:06:35 Nov 22, 2021 10:06:35 PM org.openqa.selenium.remote.ProtocolHandshake createSession
22-Nov-2021 22:06:35 INFO: Detected dialect: W3C
22-Nov-2021 22:06:37 Tests run: 5, Failures: 0, Errors: 0, Skipped: 0, Time elapsed: 13.087 sec
22-Nov-2021 22:06:37 Running org.openmrs.reference.DeleteProviderTest
22-Nov-2021 22:06:37 Running locally...
22-Nov-2021 22:06:37 Starting ChromeDriver 90.0.4430.24 (4c6d850f087da467d926e8eddb76550aed655991-refs/branch-heads/4430@{#429}) on port 32061
22-Nov-2021 22:06:37 Only local connections are allowed.
22-Nov-2021 22:06:37 Please see https://chromedriver.chromium.org/security-considerations for suggestions on keeping ChromeDriver safe.
22-Nov-2021 22:06:37 ChromeDriver was started successfully.
22-Nov-2021 22:06:37 Nov 22, 2021 10:06:37 PM org.openqa.selenium.remote.ProtocolHandshake createSession
22-Nov-2021 22:06:37 INFO: Detected dialect: W3C
22-Nov-2021 22:06:42 Tests run: 1, Failures: 0, Errors: 0, Skipped: 0, Time elapsed: 4.573 sec
22-Nov-2021 22:06:42 Running org.openmrs.reference.RegisterPatientTest
22-Nov-2021 22:06:42 Running locally...
22-Nov-2021 22:06:42 Starting ChromeDriver 90.0.4430.24 (4c6d850f087da467d926e8eddb76550aed655991-refs/branch-heads/4430@{#429}) on port 28875
22-Nov-2021 22:06:42 Only local connections are allowed.
22-Nov-2021 22:06:42 Please see https://chromedriver.chromium.org/security-considerations for suggestions on keeping ChromeDriver safe.
22-Nov-2021 22:06:42 ChromeDriver was started successfully.
22-Nov-2021 22:06:42 Nov 22, 2021 10:06:42 PM org.openqa.selenium.remote.ProtocolHandshake createSession
22-Nov-2021 22:06:42 INFO: Detected dialect: W3C
22-Nov-2021 22:06:50 Tests run: 1, Failures: 0, Errors: 0, Skipped: 0, Time elapsed: 8.211 sec
22-Nov-2021 22:06:50 Running org.openmrs.reference.ContactInfoTest
22-Nov-2021 22:06:50 Running locally...
22-Nov-2021 22:06:50 Starting ChromeDriver 90.0.4430.24 (4c6d850f087da467d926e8eddb76550aed655991-refs/branch-heads/4430@{#429}) on port 18153
22-Nov-2021 22:06:50 Only local connections are allowed.
22-Nov-2021 22:06:50 Please see https://chromedriver.chromium.org/security-considerations for suggestions on keeping ChromeDriver safe.
22-Nov-2021 22:06:50 ChromeDriver was started successfully.
22-Nov-2021 22:06:50 Nov 22, 2021 10:06:50 PM org.openqa.selenium.remote.ProtocolHandshake createSession
22-Nov-2021 22:06:50 INFO: Detected dialect: W3C
22-Nov-2021 22:07:02 Tests run: 1, Failures: 0, Errors: 0, Skipped: 0, Time elapsed: 12.046 sec
22-Nov-2021 22:07:02 Running org.openmrs.reference.StartVisitTest
22-Nov-2021 22:07:02 Running locally...
22-Nov-2021 22:07:02 Starting ChromeDriver 90.0.4430.24 (4c6d850f087da467d926e8eddb76550aed655991-refs/branch-heads/4430@{#429}) on port 15721
22-Nov-2021 22:07:02 Only local connections are allowed.
22-Nov-2021 22:07:02 Please see https://chromedriver.chromium.org/security-considerations for suggestions on keeping ChromeDriver safe.
22-Nov-2021 22:07:02 ChromeDriver was started successfully.
22-Nov-2021 22:07:02 Nov 22, 2021 10:07:02 PM org.openqa.selenium.remote.ProtocolHandshake createSession
22-Nov-2021 22:07:02 INFO: Detected dialect: W3C
22-Nov-2021 22:07:10 Tests run: 1, Failures: 0, Errors: 0, Skipped: 0, Time elapsed: 8.429 sec
22-Nov-2021 22:07:10 Running org.openmrs.reference.DeletePersonTest
22-Nov-2021 22:07:10 Running locally...
22-Nov-2021 22:07:10 Starting ChromeDriver 90.0.4430.24 (4c6d850f087da467d926e8eddb76550aed655991-refs/branch-heads/4430@{#429}) on port 22309
22-Nov-2021 22:07:10 Only local connections are allowed.
22-Nov-2021 22:07:10 Please see https://chromedriver.chromium.org/security-considerations for suggestions on keeping ChromeDriver safe.
22-Nov-2021 22:07:10 ChromeDriver was started successfully.
22-Nov-2021 22:07:11 Nov 22, 2021 10:07:11 PM org.openqa.selenium.remote.ProtocolHandshake createSession
22-Nov-2021 22:07:11 INFO: Detected dialect: W3C
22-Nov-2021 22:07:15 Tests run: 1, Failures: 0, Errors: 0, Skipped: 0, Time elapsed: 4.519 sec
22-Nov-2021 22:07:15 Running org.openmrs.reference.EditProviderTest
22-Nov-2021 22:07:15 Running locally...
22-Nov-2021 22:07:15 Starting ChromeDriver 90.0.4430.24 (4c6d850f087da467d926e8eddb76550aed655991-refs/branch-heads/4430@{#429}) on port 4512
22-Nov-2021 22:07:15 Only local connections are allowed.
22-Nov-2021 22:07:15 Please see https://chromedriver.chromium.org/security-considerations for suggestions on keeping ChromeDriver safe.
22-Nov-2021 22:07:15 ChromeDriver was started successfully.
22-Nov-2021 22:07:15 Nov 22, 2021 10:07:15 PM org.openqa.selenium.remote.ProtocolHandshake createSession
22-Nov-2021 22:07:15 INFO: Detected dialect: W3C
22-Nov-2021 22:07:20 Tests run: 1, Failures: 0, Errors: 0, Skipped: 0, Time elapsed: 4.991 sec
22-Nov-2021 22:07:20 Running org.openmrs.reference.RetireVisitTypeTest
22-Nov-2021 22:07:20 Running locally...
22-Nov-2021 22:07:20 Starting ChromeDriver 90.0.4430.24 (4c6d850f087da467d926e8eddb76550aed655991-refs/branch-heads/4430@{#429}) on port 29732
22-Nov-2021 22:07:20 Only local connections are allowed.
22-Nov-2021 22:07:20 Please see https://chromedriver.chromium.org/security-considerations for suggestions on keeping ChromeDriver safe.
22-Nov-2021 22:07:20 ChromeDriver was started successfully.
22-Nov-2021 22:07:20 Nov 22, 2021 10:07:20 PM org.openqa.selenium.remote.ProtocolHandshake createSession
22-Nov-2021 22:07:20 INFO: Detected dialect: W3C
22-Nov-2021 22:07:24 Tests run: 1, Failures: 0, Errors: 0, Skipped: 0, Time elapsed: 3.544 sec
22-Nov-2021 22:07:24
22-Nov-2021 22:07:24 Results :
22-Nov-2021 22:07:24
22-Nov-2021 22:07:24 Tests in error:
22-Nov-2021 22:07:24   addPatientAppointmentTest(org.openmrs.reference.AddPatientAppointmentTest): Error communicating with the remote browser. It may have died.(..)
22-Nov-2021 22:07:24   addPatientAppointmentTest(org.openmrs.reference.AddPatientAppointmentTest): Session ID is null. Using WebDriver after calling quit()?(..)
22-Nov-2021 22:07:24   bookRequestAppointmentTest(org.openmrs.reference.BookRequestAppointmentTest): Error communicating with the remote browser. It may have died.(..)
22-Nov-2021 22:07:24   bookRequestAppointmentTest(org.openmrs.reference.BookRequestAppointmentTest): Session ID is null. Using WebDriver after calling quit()?(..)
22-Nov-2021 22:07:24
22-Nov-2021 22:07:24 Tests run: 61, Failures: 0, Errors: 4, Skipped: 0
22-Nov-2021 22:07:24
22-Nov-2021 22:07:24 [INFO] ------------------------------------------------------------------------
22-Nov-2021 22:07:24 [INFO] Reactor Summary:
22-Nov-2021 22:07:24 [INFO]
22-Nov-2021 22:07:24 [INFO] Reference Application Distribution ................. SUCCESS [  0.428 s]
22-Nov-2021 22:07:24 [INFO] Reference Application Distribution Package ......... SUCCESS [ 46.698 s]
22-Nov-2021 22:07:24 [INFO] Reference Application Distribution UI Tests ........ FAILURE [13:16 min]
22-Nov-2021 22:07:24 [INFO] ------------------------------------------------------------------------
22-Nov-2021 22:07:24 [INFO] BUILD FAILURE
22-Nov-2021 22:07:24 [INFO] ------------------------------------------------------------------------
22-Nov-2021 22:07:24 [INFO] Total time: 14:03 min
22-Nov-2021 22:07:24 [INFO] Finished at: 2021-11-22T22:07:24+00:00
22-Nov-2021 22:07:25 [INFO] Final Memory: 63M/357M
22-Nov-2021 22:07:25 [INFO] ------------------------------------------------------------------------
22-Nov-2021 22:07:25 [ERROR] Failed to execute goal org.apache.maven.plugins:maven-surefire-plugin:2.12:test (default-test) on project referenceapplication-ui-tests: There are test failures.
22-Nov-2021 22:07:25 [ERROR]
22-Nov-2021 22:07:25 [ERROR] Please refer to /home/bamboo-agent/bamboo-agent/xml-data/build-dir/REFAPP-UI-FRAMEWORK/ui-tests/target/surefire-reports for the individual test results.
22-Nov-2021 22:07:25 [ERROR] -> [Help 1]
22-Nov-2021 22:07:25 org.apache.maven.lifecycle.LifecycleExecutionException: Failed to execute goal org.apache.maven.plugins:maven-surefire-plugin:2.12:test (default-test) on project referenceapplication-ui-tests: There are test failures.
22-Nov-2021 22:07:25
22-Nov-2021 22:07:25 Please refer to /home/bamboo-agent/bamboo-agent/xml-data/build-dir/REFAPP-UI-FRAMEWORK/ui-tests/target/surefire-reports for the individual test results.
22-Nov-2021 22:07:25         at org.apache.maven.lifecycle.internal.MojoExecutor.execute(MojoExecutor.java:212)
22-Nov-2021 22:07:25         at org.apache.maven.lifecycle.internal.MojoExecutor.execute(MojoExecutor.java:153)
22-Nov-2021 22:07:25         at org.apache.maven.lifecycle.internal.MojoExecutor.execute(MojoExecutor.java:145)
22-Nov-2021 22:07:25         at org.apache.maven.lifecycle.internal.LifecycleModuleBuilder.buildProject(LifecycleModuleBuilder.java:116)
22-Nov-2021 22:07:25         at org.apache.maven.lifecycle.internal.LifecycleModuleBuilder.buildProject(LifecycleModuleBuilder.java:80)
22-Nov-2021 22:07:25         at org.apache.maven.lifecycle.internal.builder.singlethreaded.SingleThreadedBuilder.build(SingleThreadedBuilder.java:51)
22-Nov-2021 22:07:25         at org.apache.maven.lifecycle.internal.LifecycleStarter.execute(LifecycleStarter.java:128)
22-Nov-2021 22:07:25         at org.apache.maven.DefaultMaven.doExecute(DefaultMaven.java:307)
22-Nov-2021 22:07:25         at org.apache.maven.DefaultMaven.doExecute(DefaultMaven.java:193)
22-Nov-2021 22:07:25         at org.apache.maven.DefaultMaven.execute(DefaultMaven.java:106)
22-Nov-2021 22:07:25         at org.apache.maven.cli.MavenCli.execute(MavenCli.java:863)
22-Nov-2021 22:07:25         at org.apache.maven.cli.MavenCli.doMain(MavenCli.java:288)
22-Nov-2021 22:07:25         at org.apache.maven.cli.MavenCli.main(MavenCli.java:199)
22-Nov-2021 22:07:25         at sun.reflect.NativeMethodAccessorImpl.invoke0(Native Method)
22-Nov-2021 22:07:25         at sun.reflect.NativeMethodAccessorImpl.invoke(NativeMethodAccessorImpl.java:62)
22-Nov-2021 22:07:25         at sun.reflect.DelegatingMethodAccessorImpl.invoke(DelegatingMethodAccessorImpl.java:43)
22-Nov-2021 22:07:25         at java.lang.reflect.Method.invoke(Method.java:498)
22-Nov-2021 22:07:25         at org.codehaus.plexus.classworlds.launcher.Launcher.launchEnhanced(Launcher.java:289)
22-Nov-2021 22:07:25         at org.codehaus.plexus.classworlds.launcher.Launcher.launch(Launcher.java:229)
22-Nov-2021 22:07:25         at org.codehaus.plexus.classworlds.launcher.Launcher.mainWithExitCode(Launcher.java:415)
22-Nov-2021 22:07:25         at org.codehaus.plexus.classworlds.launcher.Launcher.main(Launcher.java:356)
22-Nov-2021 22:07:25 Caused by: org.apache.maven.plugin.MojoFailureException: There are test failures.
22-Nov-2021 22:07:25
22-Nov-2021 22:07:25 Please refer to /home/bamboo-agent/bamboo-agent/xml-data/build-dir/REFAPP-UI-FRAMEWORK/ui-tests/target/surefire-reports for the individual test results.
22-Nov-2021 22:07:25         at org.apache.maven.plugin.surefire.SurefireHelper.reportExecution(SurefireHelper.java:83)
22-Nov-2021 22:07:25         at org.apache.maven.plugin.surefire.SurefirePlugin.writeSummary(SurefirePlugin.java:673)
22-Nov-2021 22:07:25         at org.apache.maven.plugin.surefire.SurefirePlugin.handleSummary(SurefirePlugin.java:647)
22-Nov-2021 22:07:25         at org.apache.maven.plugin.surefire.AbstractSurefireMojo.executeAfterPreconditionsChecked(AbstractSurefireMojo.java:137)
22-Nov-2021 22:07:25         at org.apache.maven.plugin.surefire.AbstractSurefireMojo.execute(AbstractSurefireMojo.java:98)
22-Nov-2021 22:07:25         at org.apache.maven.plugin.DefaultBuildPluginManager.executeMojo(DefaultBuildPluginManager.java:134)
22-Nov-2021 22:07:25         at org.apache.maven.lifecycle.internal.MojoExecutor.execute(MojoExecutor.java:207)
22-Nov-2021 22:07:25         ... 20 more
22-Nov-2021 22:07:25 [ERROR]
22-Nov-2021 22:07:25 [ERROR] Re-run Maven using the -X switch to enable full debug logging.
22-Nov-2021 22:07:25 [ERROR]
22-Nov-2021 22:07:25 [ERROR] For more information about the errors and possible solutions, please read the following articles:
22-Nov-2021 22:07:25 [ERROR] [Help 1] http://cwiki.apache.org/confluence/display/MAVEN/MojoFailureException
22-Nov-2021 22:07:25 [ERROR]
22-Nov-2021 22:07:25 [ERROR] After correcting the problems, you can resume the build with the command
22-Nov-2021 22:07:25 [ERROR]   mvn <goals> -rf :referenceapplication-ui-tests
22-Nov-2021 22:07:25 Failing task since return code of [/usr/share/apache-maven-3.3.9/bin/mvn --batch-mode -Djava.io.tmpdir=/home/bamboo-agent/bamboo-agent/.agent_tmp/REFAPP-UI-FRAMEWORK clean install -DskipTests=false -e] was 1 while expected 0
22-Nov-2021 22:07:25 Parsing test results under /home/bamboo-agent/bamboo-agent/xml-data/build-dir/REFAPP-UI-FRAMEWORK...
22-Nov-2021 22:07:26 Finished task 'Build distribution' with result: Failed
22-Nov-2021 22:07:26 Running post build plugin 'Docker Container Cleanup'
22-Nov-2021 22:07:26 Running post build plugin 'NCover Results Collector'
22-Nov-2021 22:07:26 Running post build plugin 'Clover Results Collector'
22-Nov-2021 22:07:26 Running post build plugin 'Sauce OnDemand Post Runner'
22-Nov-2021 22:07:26 Running post build plugin 'npm Cache Cleanup'
22-Nov-2021 22:07:26 Running post build plugin 'Artifact Copier'
22-Nov-2021 22:07:26 Finalising the build...
22-Nov-2021 22:07:26 Stopping timer.
22-Nov-2021 22:07:26 Build REFAPP-UI-FRAMEWORK-740 completed.
22-Nov-2021 22:07:26 Running on server: post build plugin 'NCover Results Collector'
22-Nov-2021 22:07:26 Running on server: post build plugin 'Build Hanging Detection Configuration'
22-Nov-2021 22:07:26 Running on server: post build plugin 'Clover Delta Calculator'
22-Nov-2021 22:07:26 Running on server: post build plugin 'Maven Dependencies Postprocessor'
22-Nov-2021 22:07:26 All post build plugins have finished
22-Nov-2021 22:07:26 Generating build results summary...
22-Nov-2021 22:07:26 Saving build results to disk...
22-Nov-2021 22:07:26 Logging substituted variables...
22-Nov-2021 22:07:26 Indexing build results...
22-Nov-2021 22:07:26 Finished building REFAPP-UI-FRAMEWORK-740.