More details of the release in https://wiki.openmrs.org/x/i4DTAw

Build: #714 failed Changes by mksrom <romain@mekomsolutions.com>

Stages & jobs

  1. Default Stage

  2. Release

    Requires a user to start manually

Build result summary

Details

Completed
Duration
6 minutes
Labels
None
Revisions
Git
ad515fdee2dad4f5e62e0460a3cad48e8227ab7d ad515fdee2dad4f5e62e0460a3cad48e8227ab7d
Release scripts
cb25741d3d6fa89e79187ec68f849228fcafce94 cb25741d3d6fa89e79187ec68f849228fcafce94
Total tests
3570
Fixed in
#715 (Changes by Mike Seaton)

Tests

Responsible

No one has taken responsibility for this failure

Code commits

Git
Author Commit Message Commit date
mksrom <romain@mekomsolutions.com> mksrom <romain@mekomsolutions.com> ad515fdee2dad4f5e62e0460a3cad48e8227ab7d ad515fdee2dad4f5e62e0460a3cad48e8227ab7d REPORT-825 - Add a OrderForVisitDataDefinition to fetch orders of a visit

Tests

New test failures 8
Status Test View job Duration
Collapse Failed OrderForVisitDataEvaluatorTest evaluate_shouldFilterByType History
Test against 1.12 < 1 sec
org.openmrs.module.reporting.evaluation.EvaluationException: Failed to evaluate Error evaluating because: could not resolve property: startDate of: org.openmrs.Order [select v.visitId as visitId, o as o from org.openmrs.Order as o inner join o.encounter as e inner join e.visit as v where o.voided = :param1 and o.orderType in (:param2) and v.visitId in (1) order by o.startDate asc]
org.openmrs.module.reporting.evaluation.EvaluationException: Failed to evaluate Error evaluating because:
could not resolve property: startDate of: org.openmrs.Order [select v.visitId as visitId, o as o from org.openmrs.Order as o inner join o.encounter as e inner join e.visit as v where o.voided = :param1 and o.orderType in (:param2) and v.visitId in (1) order by o.startDate asc]
	at org.openmrs.module.reporting.definition.service.BaseDefinitionService.executeEvaluator(BaseDefinitionService.java:375)
	at org.openmrs.module.reporting.definition.service.BaseDefinitionService.evaluateBypassingExclusionOfTestPatients(BaseDefinitionService.java:266)
	at org.openmrs.module.reporting.definition.service.BaseDefinitionService.evaluate(BaseDefinitionService.java:231)
	at org.openmrs.module.reporting.data.visit.service.VisitDataServiceImpl.evaluate(VisitDataServiceImpl.java:44)
	at sun.reflect.GeneratedMethodAccessor1006.invoke(Unknown Source)
(121 more lines...)
Collapse Failed OrderForVisitDataEvaluatorTest evaluate_shouldReturnAllOrdersForAVisit History
Test against 1.12 < 1 sec
org.openmrs.module.reporting.evaluation.EvaluationException: Failed to evaluate Error evaluating because: could not resolve property: startDate of: org.openmrs.Order [select v.visitId as visitId, o as o from org.openmrs.Order as o inner join o.encounter as e inner join e.visit as v where o.voided = :param1 and v.visitId in (1) order by o.startDate asc]
org.openmrs.module.reporting.evaluation.EvaluationException: Failed to evaluate Error evaluating because:
could not resolve property: startDate of: org.openmrs.Order [select v.visitId as visitId, o as o from org.openmrs.Order as o inner join o.encounter as e inner join e.visit as v where o.voided = :param1 and v.visitId in (1) order by o.startDate asc]
	at org.openmrs.module.reporting.definition.service.BaseDefinitionService.executeEvaluator(BaseDefinitionService.java:375)
	at org.openmrs.module.reporting.definition.service.BaseDefinitionService.evaluateBypassingExclusionOfTestPatients(BaseDefinitionService.java:266)
	at org.openmrs.module.reporting.definition.service.BaseDefinitionService.evaluate(BaseDefinitionService.java:231)
	at org.openmrs.module.reporting.data.visit.service.VisitDataServiceImpl.evaluate(VisitDataServiceImpl.java:44)
	at sun.reflect.GeneratedMethodAccessor1006.invoke(Unknown Source)
(121 more lines...)
Collapse Failed OrderForVisitDataEvaluatorTest evaluate_shouldFilterByType History
Test against 1.10 < 1 sec
org.openmrs.api.APIException: Editing some fields on Order is not allowed
	at org.openmrs.api.db.hibernate.ImmutableEntityInterceptor.onFlushDirty(ImmutableEntityInterceptor.java:111)
	at org.openmrs.api.db.hibernate.ChainingInterceptor.onFlushDirty(ChainingInterceptor.java:73)
	at org.hibernate.event.def.DefaultFlushEntityEventListener.invokeInterceptor(DefaultFlushEntityEventListener.java:372)
	at org.hibernate.event.def.DefaultFlushEntityEventListener.handleInterception(DefaultFlushEntityEventListener.java:349)
	at org.hibernate.event.def.DefaultFlushEntityEventListener.scheduleUpdate(DefaultFlushEntityEventListener.java:287)
	at org.hibernate.event.def.DefaultFlushEntityEventListener.onFlushEntity(DefaultFlushEntityEventListener.java:155)
	at org.hibernate.event.def.AbstractFlushingEventListener.flushEntities(AbstractFlushingEventListener.java:219)
(106 more lines...)
Collapse Failed OrderForVisitDataEvaluatorTest evaluate_shouldReturnAllOrdersForAVisit History
Test against 1.10 < 1 sec
org.openmrs.module.reporting.evaluation.EvaluationException: Failed to evaluate Error evaluating because: could not resolve property: startDate of: org.openmrs.Order [select v.visitId as visitId, o as o from org.openmrs.Order as o inner join o.encounter as e inner join e.visit as v where o.voided = :param1 and v.visitId in (1) order by o.startDate asc]
org.openmrs.module.reporting.evaluation.EvaluationException: Failed to evaluate Error evaluating because:
could not resolve property: startDate of: org.openmrs.Order [select v.visitId as visitId, o as o from org.openmrs.Order as o inner join o.encounter as e inner join e.visit as v where o.voided = :param1 and v.visitId in (1) order by o.startDate asc]
	at org.openmrs.module.reporting.definition.service.BaseDefinitionService.executeEvaluator(BaseDefinitionService.java:375)
	at org.openmrs.module.reporting.definition.service.BaseDefinitionService.evaluateBypassingExclusionOfTestPatients(BaseDefinitionService.java:266)
	at org.openmrs.module.reporting.definition.service.BaseDefinitionService.evaluate(BaseDefinitionService.java:231)
	at org.openmrs.module.reporting.data.visit.service.VisitDataServiceImpl.evaluate(VisitDataServiceImpl.java:44)
	at sun.reflect.GeneratedMethodAccessor983.invoke(Unknown Source)
(117 more lines...)
Collapse Failed OrderForVisitDataEvaluatorTest evaluate_shouldFilterByType History
Test against 1.11 < 1 sec
org.openmrs.module.reporting.evaluation.EvaluationException: Failed to evaluate Error evaluating because: could not resolve property: startDate of: org.openmrs.Order [select v.visitId as visitId, o as o from org.openmrs.Order as o inner join o.encounter as e inner join e.visit as v where o.voided = :param1 and o.orderType in (:param2) and v.visitId in (1) order by o.startDate asc]
org.openmrs.module.reporting.evaluation.EvaluationException: Failed to evaluate Error evaluating because:
could not resolve property: startDate of: org.openmrs.Order [select v.visitId as visitId, o as o from org.openmrs.Order as o inner join o.encounter as e inner join e.visit as v where o.voided = :param1 and o.orderType in (:param2) and v.visitId in (1) order by o.startDate asc]
	at org.openmrs.module.reporting.definition.service.BaseDefinitionService.executeEvaluator(BaseDefinitionService.java:375)
	at org.openmrs.module.reporting.definition.service.BaseDefinitionService.evaluateBypassingExclusionOfTestPatients(BaseDefinitionService.java:266)
	at org.openmrs.module.reporting.definition.service.BaseDefinitionService.evaluate(BaseDefinitionService.java:231)
	at org.openmrs.module.reporting.data.visit.service.VisitDataServiceImpl.evaluate(VisitDataServiceImpl.java:44)
	at sun.reflect.GeneratedMethodAccessor998.invoke(Unknown Source)
(121 more lines...)
Collapse Failed OrderForVisitDataEvaluatorTest evaluate_shouldReturnAllOrdersForAVisit History
Test against 1.11 < 1 sec
org.openmrs.module.reporting.evaluation.EvaluationException: Failed to evaluate Error evaluating because: could not resolve property: startDate of: org.openmrs.Order [select v.visitId as visitId, o as o from org.openmrs.Order as o inner join o.encounter as e inner join e.visit as v where o.voided = :param1 and v.visitId in (1) order by o.startDate asc]
org.openmrs.module.reporting.evaluation.EvaluationException: Failed to evaluate Error evaluating because:
could not resolve property: startDate of: org.openmrs.Order [select v.visitId as visitId, o as o from org.openmrs.Order as o inner join o.encounter as e inner join e.visit as v where o.voided = :param1 and v.visitId in (1) order by o.startDate asc]
	at org.openmrs.module.reporting.definition.service.BaseDefinitionService.executeEvaluator(BaseDefinitionService.java:375)
	at org.openmrs.module.reporting.definition.service.BaseDefinitionService.evaluateBypassingExclusionOfTestPatients(BaseDefinitionService.java:266)
	at org.openmrs.module.reporting.definition.service.BaseDefinitionService.evaluate(BaseDefinitionService.java:231)
	at org.openmrs.module.reporting.data.visit.service.VisitDataServiceImpl.evaluate(VisitDataServiceImpl.java:44)
	at sun.reflect.GeneratedMethodAccessor998.invoke(Unknown Source)
(121 more lines...)
Collapse Failed OrderForVisitDataEvaluatorTest evaluate_shouldFilterByType History
Test against 2.0 < 1 sec
org.openmrs.api.APIException: Editing some fields on Order is not allowed
	at org.openmrs.api.db.hibernate.ImmutableEntityInterceptor.onFlushDirty(ImmutableEntityInterceptor.java:111)
	at org.openmrs.api.db.hibernate.ChainingInterceptor.onFlushDirty(ChainingInterceptor.java:75)
	at org.hibernate.event.internal.DefaultFlushEntityEventListener.invokeInterceptor(DefaultFlushEntityEventListener.java:365)
	at org.hibernate.event.internal.DefaultFlushEntityEventListener.handleInterception(DefaultFlushEntityEventListener.java:342)
	at org.hibernate.event.internal.DefaultFlushEntityEventListener.scheduleUpdate(DefaultFlushEntityEventListener.java:293)
	at org.hibernate.event.internal.DefaultFlushEntityEventListener.onFlushEntity(DefaultFlushEntityEventListener.java:160)
	at org.hibernate.event.internal.AbstractFlushingEventListener.flushEntities(AbstractFlushingEventListener.java:231)
(97 more lines...)
Collapse Failed OrderForVisitDataEvaluatorTest evaluate_shouldReturnAllOrdersForAVisit History
Test against 2.0 < 1 sec
org.openmrs.module.reporting.evaluation.EvaluationException: Failed to evaluate Error evaluating because: could not resolve property: startDate of: org.openmrs.Order [select v.visitId as visitId, o as o from org.openmrs.Order as o inner join o.encounter as e inner join e.visit as v where o.voided = :param1 and v.visitId in (1) order by o.startDate asc]
org.openmrs.module.reporting.evaluation.EvaluationException: Failed to evaluate Error evaluating because:
could not resolve property: startDate of: org.openmrs.Order [select v.visitId as visitId, o as o from org.openmrs.Order as o inner join o.encounter as e inner join e.visit as v where o.voided = :param1 and v.visitId in (1) order by o.startDate asc]
	at org.openmrs.module.reporting.definition.service.BaseDefinitionService.executeEvaluator(BaseDefinitionService.java:375)
	at org.openmrs.module.reporting.definition.service.BaseDefinitionService.evaluateBypassingExclusionOfTestPatients(BaseDefinitionService.java:266)
	at org.openmrs.module.reporting.definition.service.BaseDefinitionService.evaluate(BaseDefinitionService.java:231)
	at org.openmrs.module.reporting.data.visit.service.VisitDataServiceImpl.evaluate(VisitDataServiceImpl.java:44)
	at sun.reflect.GeneratedMethodAccessor1071.invoke(Unknown Source)
(127 more lines...)

Jira issues

IssueDescriptionStatus
Unknown Issue TypeREPORT-825Could not obtain issue details from Jira