More details of the release in https://wiki.openmrs.org/x/i4DTAw

Build: #714 failed Changes by mksrom <romain@mekomsolutions.com>

Stages & jobs

  1. Default Stage

  2. Release

    Requires a user to start manually

Test results

  • 3,570 tests in total
  • 8 tests failed
  • 8 failures are new
  • 70 tests were quarantined / skipped
  • 17 minutes taken in total.
New test failures 8
Status Test View job Duration
Collapse Failed OrderForVisitDataEvaluatorTest evaluate_shouldFilterByType History
Test against 1.12 < 1 sec
org.openmrs.module.reporting.evaluation.EvaluationException: Failed to evaluate Error evaluating because: could not resolve property: startDate of: org.openmrs.Order [select v.visitId as visitId, o as o from org.openmrs.Order as o inner join o.encounter as e inner join e.visit as v where o.voided = :param1 and o.orderType in (:param2) and v.visitId in (1) order by o.startDate asc]
org.openmrs.module.reporting.evaluation.EvaluationException: Failed to evaluate Error evaluating because:
could not resolve property: startDate of: org.openmrs.Order [select v.visitId as visitId, o as o from org.openmrs.Order as o inner join o.encounter as e inner join e.visit as v where o.voided = :param1 and o.orderType in (:param2) and v.visitId in (1) order by o.startDate asc]
	at org.openmrs.module.reporting.definition.service.BaseDefinitionService.executeEvaluator(BaseDefinitionService.java:375)
	at org.openmrs.module.reporting.definition.service.BaseDefinitionService.evaluateBypassingExclusionOfTestPatients(BaseDefinitionService.java:266)
	at org.openmrs.module.reporting.definition.service.BaseDefinitionService.evaluate(BaseDefinitionService.java:231)
	at org.openmrs.module.reporting.data.visit.service.VisitDataServiceImpl.evaluate(VisitDataServiceImpl.java:44)
	at sun.reflect.GeneratedMethodAccessor1006.invoke(Unknown Source)
(121 more lines...)
Collapse Failed OrderForVisitDataEvaluatorTest evaluate_shouldReturnAllOrdersForAVisit History
Test against 1.12 < 1 sec
org.openmrs.module.reporting.evaluation.EvaluationException: Failed to evaluate Error evaluating because: could not resolve property: startDate of: org.openmrs.Order [select v.visitId as visitId, o as o from org.openmrs.Order as o inner join o.encounter as e inner join e.visit as v where o.voided = :param1 and v.visitId in (1) order by o.startDate asc]
org.openmrs.module.reporting.evaluation.EvaluationException: Failed to evaluate Error evaluating because:
could not resolve property: startDate of: org.openmrs.Order [select v.visitId as visitId, o as o from org.openmrs.Order as o inner join o.encounter as e inner join e.visit as v where o.voided = :param1 and v.visitId in (1) order by o.startDate asc]
	at org.openmrs.module.reporting.definition.service.BaseDefinitionService.executeEvaluator(BaseDefinitionService.java:375)
	at org.openmrs.module.reporting.definition.service.BaseDefinitionService.evaluateBypassingExclusionOfTestPatients(BaseDefinitionService.java:266)
	at org.openmrs.module.reporting.definition.service.BaseDefinitionService.evaluate(BaseDefinitionService.java:231)
	at org.openmrs.module.reporting.data.visit.service.VisitDataServiceImpl.evaluate(VisitDataServiceImpl.java:44)
	at sun.reflect.GeneratedMethodAccessor1006.invoke(Unknown Source)
(121 more lines...)
Collapse Failed OrderForVisitDataEvaluatorTest evaluate_shouldFilterByType History
Test against 1.10 < 1 sec
org.openmrs.api.APIException: Editing some fields on Order is not allowed
	at org.openmrs.api.db.hibernate.ImmutableEntityInterceptor.onFlushDirty(ImmutableEntityInterceptor.java:111)
	at org.openmrs.api.db.hibernate.ChainingInterceptor.onFlushDirty(ChainingInterceptor.java:73)
	at org.hibernate.event.def.DefaultFlushEntityEventListener.invokeInterceptor(DefaultFlushEntityEventListener.java:372)
	at org.hibernate.event.def.DefaultFlushEntityEventListener.handleInterception(DefaultFlushEntityEventListener.java:349)
	at org.hibernate.event.def.DefaultFlushEntityEventListener.scheduleUpdate(DefaultFlushEntityEventListener.java:287)
	at org.hibernate.event.def.DefaultFlushEntityEventListener.onFlushEntity(DefaultFlushEntityEventListener.java:155)
	at org.hibernate.event.def.AbstractFlushingEventListener.flushEntities(AbstractFlushingEventListener.java:219)
(106 more lines...)
Collapse Failed OrderForVisitDataEvaluatorTest evaluate_shouldReturnAllOrdersForAVisit History
Test against 1.10 < 1 sec
org.openmrs.module.reporting.evaluation.EvaluationException: Failed to evaluate Error evaluating because: could not resolve property: startDate of: org.openmrs.Order [select v.visitId as visitId, o as o from org.openmrs.Order as o inner join o.encounter as e inner join e.visit as v where o.voided = :param1 and v.visitId in (1) order by o.startDate asc]
org.openmrs.module.reporting.evaluation.EvaluationException: Failed to evaluate Error evaluating because:
could not resolve property: startDate of: org.openmrs.Order [select v.visitId as visitId, o as o from org.openmrs.Order as o inner join o.encounter as e inner join e.visit as v where o.voided = :param1 and v.visitId in (1) order by o.startDate asc]
	at org.openmrs.module.reporting.definition.service.BaseDefinitionService.executeEvaluator(BaseDefinitionService.java:375)
	at org.openmrs.module.reporting.definition.service.BaseDefinitionService.evaluateBypassingExclusionOfTestPatients(BaseDefinitionService.java:266)
	at org.openmrs.module.reporting.definition.service.BaseDefinitionService.evaluate(BaseDefinitionService.java:231)
	at org.openmrs.module.reporting.data.visit.service.VisitDataServiceImpl.evaluate(VisitDataServiceImpl.java:44)
	at sun.reflect.GeneratedMethodAccessor983.invoke(Unknown Source)
(117 more lines...)
Collapse Failed OrderForVisitDataEvaluatorTest evaluate_shouldFilterByType History
Test against 1.11 < 1 sec
org.openmrs.module.reporting.evaluation.EvaluationException: Failed to evaluate Error evaluating because: could not resolve property: startDate of: org.openmrs.Order [select v.visitId as visitId, o as o from org.openmrs.Order as o inner join o.encounter as e inner join e.visit as v where o.voided = :param1 and o.orderType in (:param2) and v.visitId in (1) order by o.startDate asc]
org.openmrs.module.reporting.evaluation.EvaluationException: Failed to evaluate Error evaluating because:
could not resolve property: startDate of: org.openmrs.Order [select v.visitId as visitId, o as o from org.openmrs.Order as o inner join o.encounter as e inner join e.visit as v where o.voided = :param1 and o.orderType in (:param2) and v.visitId in (1) order by o.startDate asc]
	at org.openmrs.module.reporting.definition.service.BaseDefinitionService.executeEvaluator(BaseDefinitionService.java:375)
	at org.openmrs.module.reporting.definition.service.BaseDefinitionService.evaluateBypassingExclusionOfTestPatients(BaseDefinitionService.java:266)
	at org.openmrs.module.reporting.definition.service.BaseDefinitionService.evaluate(BaseDefinitionService.java:231)
	at org.openmrs.module.reporting.data.visit.service.VisitDataServiceImpl.evaluate(VisitDataServiceImpl.java:44)
	at sun.reflect.GeneratedMethodAccessor998.invoke(Unknown Source)
(121 more lines...)
Collapse Failed OrderForVisitDataEvaluatorTest evaluate_shouldReturnAllOrdersForAVisit History
Test against 1.11 < 1 sec
org.openmrs.module.reporting.evaluation.EvaluationException: Failed to evaluate Error evaluating because: could not resolve property: startDate of: org.openmrs.Order [select v.visitId as visitId, o as o from org.openmrs.Order as o inner join o.encounter as e inner join e.visit as v where o.voided = :param1 and v.visitId in (1) order by o.startDate asc]
org.openmrs.module.reporting.evaluation.EvaluationException: Failed to evaluate Error evaluating because:
could not resolve property: startDate of: org.openmrs.Order [select v.visitId as visitId, o as o from org.openmrs.Order as o inner join o.encounter as e inner join e.visit as v where o.voided = :param1 and v.visitId in (1) order by o.startDate asc]
	at org.openmrs.module.reporting.definition.service.BaseDefinitionService.executeEvaluator(BaseDefinitionService.java:375)
	at org.openmrs.module.reporting.definition.service.BaseDefinitionService.evaluateBypassingExclusionOfTestPatients(BaseDefinitionService.java:266)
	at org.openmrs.module.reporting.definition.service.BaseDefinitionService.evaluate(BaseDefinitionService.java:231)
	at org.openmrs.module.reporting.data.visit.service.VisitDataServiceImpl.evaluate(VisitDataServiceImpl.java:44)
	at sun.reflect.GeneratedMethodAccessor998.invoke(Unknown Source)
(121 more lines...)
Collapse Failed OrderForVisitDataEvaluatorTest evaluate_shouldFilterByType History
Test against 2.0 < 1 sec
org.openmrs.api.APIException: Editing some fields on Order is not allowed
	at org.openmrs.api.db.hibernate.ImmutableEntityInterceptor.onFlushDirty(ImmutableEntityInterceptor.java:111)
	at org.openmrs.api.db.hibernate.ChainingInterceptor.onFlushDirty(ChainingInterceptor.java:75)
	at org.hibernate.event.internal.DefaultFlushEntityEventListener.invokeInterceptor(DefaultFlushEntityEventListener.java:365)
	at org.hibernate.event.internal.DefaultFlushEntityEventListener.handleInterception(DefaultFlushEntityEventListener.java:342)
	at org.hibernate.event.internal.DefaultFlushEntityEventListener.scheduleUpdate(DefaultFlushEntityEventListener.java:293)
	at org.hibernate.event.internal.DefaultFlushEntityEventListener.onFlushEntity(DefaultFlushEntityEventListener.java:160)
	at org.hibernate.event.internal.AbstractFlushingEventListener.flushEntities(AbstractFlushingEventListener.java:231)
(97 more lines...)
Collapse Failed OrderForVisitDataEvaluatorTest evaluate_shouldReturnAllOrdersForAVisit History
Test against 2.0 < 1 sec
org.openmrs.module.reporting.evaluation.EvaluationException: Failed to evaluate Error evaluating because: could not resolve property: startDate of: org.openmrs.Order [select v.visitId as visitId, o as o from org.openmrs.Order as o inner join o.encounter as e inner join e.visit as v where o.voided = :param1 and v.visitId in (1) order by o.startDate asc]
org.openmrs.module.reporting.evaluation.EvaluationException: Failed to evaluate Error evaluating because:
could not resolve property: startDate of: org.openmrs.Order [select v.visitId as visitId, o as o from org.openmrs.Order as o inner join o.encounter as e inner join e.visit as v where o.voided = :param1 and v.visitId in (1) order by o.startDate asc]
	at org.openmrs.module.reporting.definition.service.BaseDefinitionService.executeEvaluator(BaseDefinitionService.java:375)
	at org.openmrs.module.reporting.definition.service.BaseDefinitionService.evaluateBypassingExclusionOfTestPatients(BaseDefinitionService.java:266)
	at org.openmrs.module.reporting.definition.service.BaseDefinitionService.evaluate(BaseDefinitionService.java:231)
	at org.openmrs.module.reporting.data.visit.service.VisitDataServiceImpl.evaluate(VisitDataServiceImpl.java:44)
	at sun.reflect.GeneratedMethodAccessor1071.invoke(Unknown Source)
(127 more lines...)
Skipped tests 70
Status Test Failing since View job
Skipped CodedObsCohortDefinitionEvaluatorTest evaluate_shouldNotReturnVoidedPatients History
Test against 1.11
Skipped CodedObsCohortDefinitionEvaluatorTest evaluate_shouldNotReturnVoidedPatients History
Default Job
Skipped CodedObsCohortDefinitionEvaluatorTest evaluate_shouldNotReturnVoidedPatients History
Test against 2.0
Skipped CodedObsCohortDefinitionEvaluatorTest evaluate_shouldNotReturnVoidedPatients History
Test against 1.10
Skipped CodedObsCohortDefinitionEvaluatorTest evaluate_shouldNotReturnVoidedPatients History
Test against 1.12
Skipped EncounterCohortDefinitionEvaluatorTest evaluate_shouldReturnCorrectPatientsWhenProviderParametersAreSet History
Test against 1.11
Skipped EncounterCohortDefinitionEvaluatorTest evaluate_shouldNotReturnVoidedPatients History
Test against 1.11
Skipped EncounterCohortDefinitionEvaluatorTest evaluate_shouldReturnCorrectPatientsWhenProviderParametersAreSet History
Default Job
Skipped EncounterCohortDefinitionEvaluatorTest evaluate_shouldNotReturnVoidedPatients History
Default Job
Skipped EncounterCohortDefinitionEvaluatorTest evaluate_shouldReturnCorrectPatientsWhenProviderParametersAreSet History
Test against 2.0
Skipped EncounterCohortDefinitionEvaluatorTest evaluate_shouldNotReturnVoidedPatients History
Test against 2.0
Skipped EncounterCohortDefinitionEvaluatorTest evaluate_shouldReturnCorrectPatientsWhenProviderParametersAreSet History
Test against 1.10
Skipped EncounterCohortDefinitionEvaluatorTest evaluate_shouldNotReturnVoidedPatients History
Test against 1.10
Skipped EncounterCohortDefinitionEvaluatorTest evaluate_shouldReturnCorrectPatientsWhenProviderParametersAreSet History
Test against 1.12
Skipped EncounterCohortDefinitionEvaluatorTest evaluate_shouldNotReturnVoidedPatients History
Test against 1.12
Skipped TestUtil org.openmrs.module.reporting.common.TestUtil History
Test against 1.11
Skipped TestUtil org.openmrs.module.reporting.common.TestUtil History
Default Job
Skipped TestUtil org.openmrs.module.reporting.common.TestUtil History
Test against 2.0
Skipped TestUtil org.openmrs.module.reporting.common.TestUtil History
Test against 1.10
Skipped TestUtil org.openmrs.module.reporting.common.TestUtil History
Test against 1.12
Skipped GroupMemberObsDataEvaluatorTest testMakeSureEmptySingleEntryEvenIfNoMatchingObsInGroup History
Test against 1.12
Skipped GroupMemberObsDataEvaluatorTest testMakeSureEmptyListEntryEvenIfNoMatchingObsInGroup History
Test against 1.12
Skipped GroupMemberObsDataEvaluatorTest testMakeSureEmptySingleEntryEvenIfNoMatchingObsInGroup History
Test against 1.11
Skipped GroupMemberObsDataEvaluatorTest testMakeSureEmptyListEntryEvenIfNoMatchingObsInGroup History
Test against 1.11
Skipped GroupMemberObsDataEvaluatorTest testMakeSureEmptySingleEntryEvenIfNoMatchingObsInGroup History
Default Job
Skipped GroupMemberObsDataEvaluatorTest testMakeSureEmptyListEntryEvenIfNoMatchingObsInGroup History
Default Job
Skipped GroupMemberObsDataEvaluatorTest testMakeSureEmptySingleEntryEvenIfNoMatchingObsInGroup History
Test against 2.0
Skipped GroupMemberObsDataEvaluatorTest testMakeSureEmptyListEntryEvenIfNoMatchingObsInGroup History
Test against 2.0
Skipped GroupMemberObsDataEvaluatorTest testMakeSureEmptySingleEntryEvenIfNoMatchingObsInGroup History
Test against 1.10
Skipped GroupMemberObsDataEvaluatorTest testMakeSureEmptyListEntryEvenIfNoMatchingObsInGroup History
Test against 1.10
Skipped LogicDataEvaluatorTest org.openmrs.module.reporting.data.patient.evaluator.LogicDataEvaluatorTest History
Test against 1.12
Skipped LogicDataEvaluatorTest org.openmrs.module.reporting.data.patient.evaluator.LogicDataEvaluatorTest History
Test against 1.11
Skipped LogicDataEvaluatorTest org.openmrs.module.reporting.data.patient.evaluator.LogicDataEvaluatorTest History
Default Job
Skipped LogicDataEvaluatorTest org.openmrs.module.reporting.data.patient.evaluator.LogicDataEvaluatorTest History
Test against 2.0
Skipped LogicDataEvaluatorTest org.openmrs.module.reporting.data.patient.evaluator.LogicDataEvaluatorTest History
Test against 1.10
Skipped TestPatientCalculation org.openmrs.module.reporting.data.patient.evaluator.TestPatientCalculation History
Test against 1.10
Skipped TestPatientCalculation org.openmrs.module.reporting.data.patient.evaluator.TestPatientCalculation History
Test against 1.12
Skipped TestPatientCalculation org.openmrs.module.reporting.data.patient.evaluator.TestPatientCalculation History
Test against 1.11
Skipped TestPatientCalculation org.openmrs.module.reporting.data.patient.evaluator.TestPatientCalculation History
Default Job
Skipped TestPatientCalculation org.openmrs.module.reporting.data.patient.evaluator.TestPatientCalculation History
Test against 2.0
Skipped DataExportDataSetPersisterTest org.openmrs.module.reporting.dataset.DataExportDataSetPersisterTest History
Test against 1.10
Skipped DataExportDataSetPersisterTest org.openmrs.module.reporting.dataset.DataExportDataSetPersisterTest History
Test against 1.12
Skipped DataExportDataSetPersisterTest org.openmrs.module.reporting.dataset.DataExportDataSetPersisterTest History
Test against 1.11
Skipped DataExportDataSetPersisterTest org.openmrs.module.reporting.dataset.DataExportDataSetPersisterTest History
Default Job
Skipped DataExportDataSetPersisterTest org.openmrs.module.reporting.dataset.DataExportDataSetPersisterTest History
Test against 2.0
Skipped LogicDataSetEvaluatorTest org.openmrs.module.reporting.dataset.definition.evaluator.LogicDataSetEvaluatorTest History
Test against 1.10
Skipped LogicDataSetEvaluatorTest org.openmrs.module.reporting.dataset.definition.evaluator.LogicDataSetEvaluatorTest History
Test against 1.12
Skipped LogicDataSetEvaluatorTest org.openmrs.module.reporting.dataset.definition.evaluator.LogicDataSetEvaluatorTest History
Test against 1.11
Skipped LogicDataSetEvaluatorTest org.openmrs.module.reporting.dataset.definition.evaluator.LogicDataSetEvaluatorTest History
Default Job
Skipped LogicDataSetEvaluatorTest org.openmrs.module.reporting.dataset.definition.evaluator.LogicDataSetEvaluatorTest History
Test against 2.0
Skipped MySqlDataSetEvaluatorTest org.openmrs.module.reporting.dataset.definition.evaluator.MySqlDataSetEvaluatorTest History
Test against 1.11
Skipped MySqlDataSetEvaluatorTest org.openmrs.module.reporting.dataset.definition.evaluator.MySqlDataSetEvaluatorTest History
Default Job
Skipped MySqlDataSetEvaluatorTest org.openmrs.module.reporting.dataset.definition.evaluator.MySqlDataSetEvaluatorTest History
Test against 2.0
Skipped MySqlDataSetEvaluatorTest org.openmrs.module.reporting.dataset.definition.evaluator.MySqlDataSetEvaluatorTest History
Test against 1.10
Skipped MySqlDataSetEvaluatorTest org.openmrs.module.reporting.dataset.definition.evaluator.MySqlDataSetEvaluatorTest History
Test against 1.12
Skipped ObsQueryServiceImplTest evaluate_shouldEvaluateAnObsQuery History
Test against 1.12
Skipped ObsQueryServiceImplTest evaluate_shouldEvaluateAnObsQuery History
Test against 1.11
Skipped ObsQueryServiceImplTest evaluate_shouldEvaluateAnObsQuery History
Default Job
Skipped ObsQueryServiceImplTest evaluate_shouldEvaluateAnObsQuery History
Test against 2.0
Skipped ObsQueryServiceImplTest evaluate_shouldEvaluateAnObsQuery History
Test against 1.10
Skipped MysqlReportServiceTest org.openmrs.module.reporting.report.service.MysqlReportServiceTest History
Test against 1.11
Skipped MysqlReportServiceTest org.openmrs.module.reporting.report.service.MysqlReportServiceTest History
Default Job
Skipped MysqlReportServiceTest org.openmrs.module.reporting.report.service.MysqlReportServiceTest History
Test against 2.0
Skipped MysqlReportServiceTest org.openmrs.module.reporting.report.service.MysqlReportServiceTest History
Test against 1.10
Skipped MysqlReportServiceTest org.openmrs.module.reporting.report.service.MysqlReportServiceTest History
Test against 1.12
Skipped TestReportProcessor org.openmrs.module.reporting.report.service.TestReportProcessor History
Test against 1.10
Skipped TestReportProcessor org.openmrs.module.reporting.report.service.TestReportProcessor History
Test against 1.12
Skipped TestReportProcessor org.openmrs.module.reporting.report.service.TestReportProcessor History
Test against 1.11
Skipped TestReportProcessor org.openmrs.module.reporting.report.service.TestReportProcessor History
Default Job
Skipped TestReportProcessor org.openmrs.module.reporting.report.service.TestReportProcessor History
Test against 2.0