More details of the release in https://wiki.openmrs.org/x/i4DTAw

Build: #784 failed Changes by Michael Seaton <mseaton@pih.org>

Test results

  • 5,260 tests in total
  • 10 tests failed
  • 1 failure is new
  • 38 tests were fixed
  • 98 tests were quarantined / skipped
  • 15 minutes taken in total.
New test failures 1
Status Test View job Duration
Collapse Failed VisitCohortDefinitionEvaluatorTest shouldIncludeVisit_ifActiveVisitRangeEndSameAsVisitStart History
Test against 2.2 < 1 sec
org.openmrs.api.ValidationException: 'Visit #null' failed to validate with reason: startDatetime: Visit.startDateCannotFallBeforeTheBirthDateOfTheSamePatient
	at org.openmrs.validator.ValidateUtil.validate(ValidateUtil.java:82)
	at org.openmrs.aop.RequiredDataAdvice.before(RequiredDataAdvice.java:127)
	at org.springframework.aop.framework.adapter.MethodBeforeAdviceInterceptor.invoke(MethodBeforeAdviceInterceptor.java:51)
	at org.springframework.aop.framework.ReflectiveMethodInvocation.proceed(ReflectiveMethodInvocation.java:179)
	at org.springframework.aop.framework.adapter.MethodBeforeAdviceInterceptor.invoke(MethodBeforeAdviceInterceptor.java:52)
	at org.springframework.aop.framework.ReflectiveMethodInvocation.proceed(ReflectiveMethodInvocation.java:179)
	at org.springframework.aop.framework.JdkDynamicAopProxy.invoke(JdkDynamicAopProxy.java:207)
(39 more lines...)
Existing test failures 9
Status Test Failing since View job Duration
java.lang.AssertionError: expected:<2> but was:<3>
	at org.junit.Assert.fail(Assert.java:88)
	at org.junit.Assert.failNotEquals(Assert.java:834)
	at org.junit.Assert.assertEquals(Assert.java:645)
	at org.junit.Assert.assertEquals(Assert.java:631)
	at org.openmrs.module.reporting.cohort.definition.evaluator.AgeCohortDefinitionEvaluatorTest.testAgeRange(AgeCohortDefinitionEvaluatorTest.java:112)
	at org.openmrs.module.reporting.cohort.definition.evaluator.AgeCohortDefinitionEvaluatorTest.evaluate_shouldReturnOnlyPatientsBornOnOrBeforeTheEvaluationDate(AgeCohortDefinitionEvaluatorTest.java:47)
	at sun.reflect.NativeMethodAccessorImpl.invoke0(Native Method)
(35 more lines...)
java.lang.AssertionError: expected:<1> but was:<0>
	at org.junit.Assert.fail(Assert.java:88)
	at org.junit.Assert.failNotEquals(Assert.java:834)
	at org.junit.Assert.assertEquals(Assert.java:645)
	at org.junit.Assert.assertEquals(Assert.java:631)
	at org.openmrs.module.reporting.cohort.definition.evaluator.AgeCohortDefinitionEvaluatorTest.testAgeRange(AgeCohortDefinitionEvaluatorTest.java:112)
	at org.openmrs.module.reporting.cohort.definition.evaluator.AgeCohortDefinitionEvaluatorTest.evaluate_shouldReturnOnlyPatientsInTheGivenAgeRange(AgeCohortDefinitionEvaluatorTest.java:60)
	at sun.reflect.NativeMethodAccessorImpl.invoke0(Native Method)
(35 more lines...)
java.lang.AssertionError: expected:<8> but was:<9>
	at org.junit.Assert.fail(Assert.java:88)
	at org.junit.Assert.failNotEquals(Assert.java:834)
	at org.junit.Assert.assertEquals(Assert.java:645)
	at org.junit.Assert.assertEquals(Assert.java:631)
	at org.openmrs.module.reporting.cohort.definition.evaluator.PatientIdentifierCohortDefinitionEvaluatorTest.evaluate_shouldReturnPatientsWhoHaveIdentifiersOfThePassedTypes(PatientIdentifierCohortDefinitionEvaluatorTest.java:57)
	at sun.reflect.NativeMethodAccessorImpl.invoke0(Native Method)
	at sun.reflect.NativeMethodAccessorImpl.invoke(NativeMethodAccessorImpl.java:62)
(34 more lines...)
java.lang.AssertionError: expected:<8> but was:<9>
	at org.junit.Assert.fail(Assert.java:88)
	at org.junit.Assert.failNotEquals(Assert.java:834)
	at org.junit.Assert.assertEquals(Assert.java:645)
	at org.junit.Assert.assertEquals(Assert.java:631)
	at org.openmrs.module.reporting.cohort.definition.evaluator.PatientIdentifierCohortDefinitionEvaluatorTest.evaluate_shouldReturnPatientsWhoHaveIdentifiersMatchingThePassedLocations(PatientIdentifierCohortDefinitionEvaluatorTest.java:82)
	at sun.reflect.NativeMethodAccessorImpl.invoke0(Native Method)
	at sun.reflect.NativeMethodAccessorImpl.invoke(NativeMethodAccessorImpl.java:62)
(34 more lines...)
org.openmrs.api.ValidationException: 'Visit #null' failed to validate with reason: startDatetime: Visit.startDateCannotFallBeforeTheBirthDateOfTheSamePatient
	at org.openmrs.validator.ValidateUtil.validate(ValidateUtil.java:82)
	at org.openmrs.aop.RequiredDataAdvice.before(RequiredDataAdvice.java:127)
	at org.springframework.aop.framework.adapter.MethodBeforeAdviceInterceptor.invoke(MethodBeforeAdviceInterceptor.java:51)
	at org.springframework.aop.framework.ReflectiveMethodInvocation.proceed(ReflectiveMethodInvocation.java:179)
	at org.springframework.aop.framework.adapter.MethodBeforeAdviceInterceptor.invoke(MethodBeforeAdviceInterceptor.java:52)
	at org.springframework.aop.framework.ReflectiveMethodInvocation.proceed(ReflectiveMethodInvocation.java:179)
	at org.springframework.aop.framework.JdkDynamicAopProxy.invoke(JdkDynamicAopProxy.java:207)
(39 more lines...)
java.lang.AssertionError: expected:<3> but was:<5>
	at org.junit.Assert.fail(Assert.java:88)
	at org.junit.Assert.failNotEquals(Assert.java:834)
	at org.junit.Assert.assertEquals(Assert.java:645)
	at org.junit.Assert.assertEquals(Assert.java:631)
	at org.openmrs.module.reporting.dataset.definition.evaluator.MultiParameterDataSetEvaluatorTest.evaluate_shouldEvaluateAMultiParameterDataSetDefinition(MultiParameterDataSetEvaluatorTest.java:80)
	at sun.reflect.NativeMethodAccessorImpl.invoke0(Native Method)
	at sun.reflect.NativeMethodAccessorImpl.invoke(NativeMethodAccessorImpl.java:62)
(34 more lines...)
java.lang.AssertionError: expected:<Sun May 27 00:00:00 UTC 2007> but was:<1975-05-27 00:00:00.0>
	at org.junit.Assert.fail(Assert.java:88)
	at org.junit.Assert.failNotEquals(Assert.java:834)
	at org.junit.Assert.assertEquals(Assert.java:118)
	at org.junit.Assert.assertEquals(Assert.java:144)
	at org.openmrs.module.reporting.dataset.definition.evaluator.MultiPeriodIndicatorDataSetEvaluatorTest.evaluate_shouldEvaluateAMultiPeriodIndicatorDataSetDefinition(MultiPeriodIndicatorDataSetEvaluatorTest.java:53)
	at sun.reflect.NativeMethodAccessorImpl.invoke0(Native Method)
	at sun.reflect.NativeMethodAccessorImpl.invoke(NativeMethodAccessorImpl.java:62)
(34 more lines...)
org.junit.ComparisonFailure: expected:<...r><birthdate>27/May/[2007]</birthdate></row><r...> but was:<...r><birthdate>27/May/[1975]</birthdate></row><r...>
	at org.junit.Assert.assertEquals(Assert.java:115)
	at org.junit.Assert.assertEquals(Assert.java:144)
	at org.openmrs.module.reporting.report.renderer.TextTemplateRendererTest.shouldRenderTemplate(TextTemplateRendererTest.java:114)
	at org.openmrs.module.reporting.report.renderer.TextTemplateRendererTest.shouldRenderVelocityTemplate(TextTemplateRendererTest.java:49)
	at sun.reflect.NativeMethodAccessorImpl.invoke0(Native Method)
	at sun.reflect.NativeMethodAccessorImpl.invoke(NativeMethodAccessorImpl.java:62)
	at sun.reflect.DelegatingMethodAccessorImpl.invoke(DelegatingMethodAccessorImpl.java:43)
(33 more lines...)
org.junit.ComparisonFailure: expected:<...r><birthdate>27/May/[2007]</birthdate></row><r...> but was:<...r><birthdate>27/May/[1975]</birthdate></row><r...>
	at org.junit.Assert.assertEquals(Assert.java:115)
	at org.junit.Assert.assertEquals(Assert.java:144)
	at org.openmrs.module.reporting.report.renderer.TextTemplateRendererTest.shouldRenderTemplate(TextTemplateRendererTest.java:114)
	at org.openmrs.module.reporting.report.renderer.TextTemplateRendererTest.shouldRenderGroovyTemplate(TextTemplateRendererTest.java:44)
	at sun.reflect.NativeMethodAccessorImpl.invoke0(Native Method)
	at sun.reflect.NativeMethodAccessorImpl.invoke(NativeMethodAccessorImpl.java:62)
	at sun.reflect.DelegatingMethodAccessorImpl.invoke(DelegatingMethodAccessorImpl.java:43)
(33 more lines...)
Fixed tests 38
Status Test Failing since View job Duration
Successful VisitCohortDefinitionEvaluatorTest shouldIncludeVisit_ifActiveVisitRangeStartAfterVisitStartAndVisitCurrentlyActive History
Failing since build #782 (Manual run by Mike Seaton) Test against 2.2 < 1 sec
Successful VisitCohortDefinitionEvaluatorTest shouldNotIncludeVisit_ifActiveVisitRangeEndBeforeVisitStartAndVisitCurrentlyActive History
Failing since build #782 (Manual run by Mike Seaton) Test against 2.2 < 1 sec
Successful EncountersForPatientDataEvaluatorTest shouldReturnEncountersInActiveVisit History
Failing since build #782 (Manual run by Mike Seaton) Test against 2.2 < 1 sec
Successful ImplementerConfiguredCohortDefinitionLibraryTest testSerializedDefinition History
Failing since build #783 (Changes by Michael Seaton <mseaton@pih.org>) Test against 2.0 < 1 sec
Successful ImplementerConfiguredCohortDefinitionLibraryTest testSerializedDefinition History
Failing since build #783 (Changes by Michael Seaton <mseaton@pih.org>) Test against 1.11 < 1 sec
Successful ImplementerConfiguredCohortDefinitionLibraryTest testSerializedDefinition History
Failing since build #783 (Changes by Michael Seaton <mseaton@pih.org>) Test against 2.1 < 1 sec
Successful ImplementerConfiguredCohortDefinitionLibraryTest testSerializedDefinition History
Failing since build #783 (Changes by Michael Seaton <mseaton@pih.org>) Test against 1.12 < 1 sec
Successful ImplementerConfiguredCohortDefinitionLibraryTest testSerializedDefinition History
Failing since build #783 (Changes by Michael Seaton <mseaton@pih.org>) Default Job < 1 sec
Successful ImplementerConfiguredCohortDefinitionLibraryTest testSerializedDefinition History
Failing since build #783 (Changes by Michael Seaton <mseaton@pih.org>) Test against 1.10 < 1 sec
Successful ImplementerConfiguredCohortDefinitionLibraryTest testSerializedDefinition History
Failing since build #782 (Manual run by Mike Seaton) Test against 2.2 < 1 sec
Successful ImplementerConfiguredDataSetDefinitionLibraryTest testSerializedDefinition History
Failing since build #783 (Changes by Michael Seaton <mseaton@pih.org>) Test against 2.0 < 1 sec
Successful ImplementerConfiguredDataSetDefinitionLibraryTest testSerializedDefinition History
Failing since build #783 (Changes by Michael Seaton <mseaton@pih.org>) Test against 1.11 < 1 sec
Successful ImplementerConfiguredDataSetDefinitionLibraryTest testSerializedDefinition History
Failing since build #783 (Changes by Michael Seaton <mseaton@pih.org>) Test against 2.1 < 1 sec
Successful ImplementerConfiguredDataSetDefinitionLibraryTest testSerializedDefinition History
Failing since build #783 (Changes by Michael Seaton <mseaton@pih.org>) Test against 1.12 < 1 sec
Successful ImplementerConfiguredDataSetDefinitionLibraryTest testSerializedDefinition History
Failing since build #783 (Changes by Michael Seaton <mseaton@pih.org>) Default Job < 1 sec
Successful ImplementerConfiguredDataSetDefinitionLibraryTest testSerializedDefinition History
Failing since build #783 (Changes by Michael Seaton <mseaton@pih.org>) Test against 1.10 < 1 sec
Successful ImplementerConfiguredDataSetDefinitionLibraryTest testSerializedDefinition History
Failing since build #782 (Manual run by Mike Seaton) Test against 2.2 < 1 sec
Successful ImplementerConfiguredEncounterDataDefinitionLibraryTest testSerializedDefinition History
Failing since build #783 (Changes by Michael Seaton <mseaton@pih.org>) Test against 2.0 < 1 sec
Successful ImplementerConfiguredEncounterDataDefinitionLibraryTest testSerializedDefinition History
Failing since build #783 (Changes by Michael Seaton <mseaton@pih.org>) Test against 1.11 < 1 sec
Successful ImplementerConfiguredEncounterDataDefinitionLibraryTest testSerializedDefinition History
Failing since build #783 (Changes by Michael Seaton <mseaton@pih.org>) Test against 2.1 < 1 sec
Successful ImplementerConfiguredEncounterDataDefinitionLibraryTest testSerializedDefinition History
Failing since build #783 (Changes by Michael Seaton <mseaton@pih.org>) Test against 1.12 < 1 sec
Successful ImplementerConfiguredEncounterDataDefinitionLibraryTest testSerializedDefinition History
Failing since build #783 (Changes by Michael Seaton <mseaton@pih.org>) Default Job < 1 sec
Successful ImplementerConfiguredEncounterDataDefinitionLibraryTest testSerializedDefinition History
Failing since build #783 (Changes by Michael Seaton <mseaton@pih.org>) Test against 1.10 < 1 sec
Successful ImplementerConfiguredEncounterDataDefinitionLibraryTest testSerializedDefinition History
Failing since build #782 (Manual run by Mike Seaton) Test against 2.2 < 1 sec
Successful ImplementerConfiguredPatientDataDefinitionLibraryTest testSerializedDefinition History
Failing since build #783 (Changes by Michael Seaton <mseaton@pih.org>) Test against 2.0 < 1 sec
Successful ImplementerConfiguredPatientDataDefinitionLibraryTest testSerializedDefinition History
Failing since build #783 (Changes by Michael Seaton <mseaton@pih.org>) Test against 1.11 < 1 sec
Successful ImplementerConfiguredPatientDataDefinitionLibraryTest testSerializedDefinition History
Failing since build #783 (Changes by Michael Seaton <mseaton@pih.org>) Test against 2.1 < 1 sec
Successful ImplementerConfiguredPatientDataDefinitionLibraryTest testSerializedDefinition History
Failing since build #783 (Changes by Michael Seaton <mseaton@pih.org>) Test against 1.12 < 1 sec
Successful ImplementerConfiguredPatientDataDefinitionLibraryTest testSerializedDefinition History
Failing since build #783 (Changes by Michael Seaton <mseaton@pih.org>) Default Job < 1 sec
Successful ImplementerConfiguredPatientDataDefinitionLibraryTest testSerializedDefinition History
Failing since build #783 (Changes by Michael Seaton <mseaton@pih.org>) Test against 1.10 < 1 sec
Successful ImplementerConfiguredPatientDataDefinitionLibraryTest testSerializedDefinition History
Failing since build #782 (Manual run by Mike Seaton) Test against 2.2 < 1 sec
Successful ImplementerConfiguredVisitDataDefinitionLibraryTest testSerializedDefinition History
Failing since build #783 (Changes by Michael Seaton <mseaton@pih.org>) Test against 1.11 < 1 sec
Successful ImplementerConfiguredVisitDataDefinitionLibraryTest testSerializedDefinition History
Failing since build #783 (Changes by Michael Seaton <mseaton@pih.org>) Test against 2.0 < 1 sec
Successful ImplementerConfiguredVisitDataDefinitionLibraryTest testSerializedDefinition History
Failing since build #783 (Changes by Michael Seaton <mseaton@pih.org>) Test against 2.1 < 1 sec
Successful ImplementerConfiguredVisitDataDefinitionLibraryTest testSerializedDefinition History
Failing since build #783 (Changes by Michael Seaton <mseaton@pih.org>) Test against 1.12 < 1 sec
Successful ImplementerConfiguredVisitDataDefinitionLibraryTest testSerializedDefinition History
Failing since build #783 (Changes by Michael Seaton <mseaton@pih.org>) Default Job < 1 sec
Successful ImplementerConfiguredVisitDataDefinitionLibraryTest testSerializedDefinition History
Failing since build #783 (Changes by Michael Seaton <mseaton@pih.org>) Test against 1.10 < 1 sec
Successful ImplementerConfiguredVisitDataDefinitionLibraryTest testSerializedDefinition History
Failing since build #782 (Manual run by Mike Seaton) Test against 2.2 < 1 sec
Skipped tests 98
Status Test Failing since View job
Skipped CodedObsCohortDefinitionEvaluatorTest evaluate_shouldNotReturnVoidedPatients History
Default Job
Skipped CodedObsCohortDefinitionEvaluatorTest evaluate_shouldNotReturnVoidedPatients History
Test against 1.11
Skipped CodedObsCohortDefinitionEvaluatorTest evaluate_shouldNotReturnVoidedPatients History
Test against 2.2
Skipped CodedObsCohortDefinitionEvaluatorTest evaluate_shouldNotReturnVoidedPatients History
Test against 1.10
Skipped CodedObsCohortDefinitionEvaluatorTest evaluate_shouldNotReturnVoidedPatients History
Test against 1.12
Skipped CodedObsCohortDefinitionEvaluatorTest evaluate_shouldNotReturnVoidedPatients History
Test against 2.0
Skipped CodedObsCohortDefinitionEvaluatorTest evaluate_shouldNotReturnVoidedPatients History
Test against 2.1
Skipped EncounterCohortDefinitionEvaluatorTest evaluate_shouldReturnCorrectPatientsWhenProviderParametersAreSet History
Test against 2.1
Skipped EncounterCohortDefinitionEvaluatorTest evaluate_shouldNotReturnVoidedPatients History
Test against 2.1
Skipped EncounterCohortDefinitionEvaluatorTest evaluate_shouldReturnCorrectPatientsWhenProviderParametersAreSet History
Default Job
Skipped EncounterCohortDefinitionEvaluatorTest evaluate_shouldNotReturnVoidedPatients History
Default Job
Skipped EncounterCohortDefinitionEvaluatorTest evaluate_shouldReturnCorrectPatientsWhenProviderParametersAreSet History
Test against 1.11
Skipped EncounterCohortDefinitionEvaluatorTest evaluate_shouldNotReturnVoidedPatients History
Test against 1.11
Skipped EncounterCohortDefinitionEvaluatorTest evaluate_shouldNotReturnVoidedPatients History
Test against 2.0
Skipped EncounterCohortDefinitionEvaluatorTest evaluate_shouldReturnCorrectPatientsWhenProviderParametersAreSet History
Test against 2.0
Skipped EncounterCohortDefinitionEvaluatorTest evaluate_shouldNotReturnVoidedPatients History
Test against 1.10
Skipped EncounterCohortDefinitionEvaluatorTest evaluate_shouldReturnCorrectPatientsWhenProviderParametersAreSet History
Test against 1.10
Skipped EncounterCohortDefinitionEvaluatorTest evaluate_shouldNotReturnVoidedPatients History
Test against 1.12
Skipped EncounterCohortDefinitionEvaluatorTest evaluate_shouldReturnCorrectPatientsWhenProviderParametersAreSet History
Test against 1.12
Skipped EncounterCohortDefinitionEvaluatorTest evaluate_shouldReturnCorrectPatientsWhenProviderParametersAreSet History
Test against 2.2
Skipped EncounterCohortDefinitionEvaluatorTest evaluate_shouldNotReturnVoidedPatients History
Test against 2.2
Skipped TestUtil org.openmrs.module.reporting.common.TestUtil History
Default Job
Skipped TestUtil org.openmrs.module.reporting.common.TestUtil History
Test against 1.11
Skipped TestUtil org.openmrs.module.reporting.common.TestUtil History
Test against 2.2
Skipped TestUtil org.openmrs.module.reporting.common.TestUtil History
Test against 2.1
Skipped TestUtil org.openmrs.module.reporting.common.TestUtil History
Test against 1.10
Skipped TestUtil org.openmrs.module.reporting.common.TestUtil History
Test against 1.12
Skipped TestUtil org.openmrs.module.reporting.common.TestUtil History
Test against 2.0
Skipped GroupMemberObsDataEvaluatorTest testMakeSureEmptySingleEntryEvenIfNoMatchingObsInGroup History
Test against 1.12
Skipped GroupMemberObsDataEvaluatorTest testMakeSureEmptyListEntryEvenIfNoMatchingObsInGroup History
Test against 2.1
Skipped GroupMemberObsDataEvaluatorTest testMakeSureEmptyListEntryEvenIfNoMatchingObsInGroup History
Test against 2.2
Skipped GroupMemberObsDataEvaluatorTest testMakeSureEmptySingleEntryEvenIfNoMatchingObsInGroup History
Test against 2.1
Skipped GroupMemberObsDataEvaluatorTest testMakeSureEmptySingleEntryEvenIfNoMatchingObsInGroup History
Test against 2.2
Skipped GroupMemberObsDataEvaluatorTest testMakeSureEmptySingleEntryEvenIfNoMatchingObsInGroup History
Default Job
Skipped GroupMemberObsDataEvaluatorTest testMakeSureEmptyListEntryEvenIfNoMatchingObsInGroup History
Default Job
Skipped GroupMemberObsDataEvaluatorTest testMakeSureEmptyListEntryEvenIfNoMatchingObsInGroup History
Test against 2.0
Skipped GroupMemberObsDataEvaluatorTest testMakeSureEmptyListEntryEvenIfNoMatchingObsInGroup History
Test against 1.11
Skipped GroupMemberObsDataEvaluatorTest testMakeSureEmptySingleEntryEvenIfNoMatchingObsInGroup History
Test against 2.0
Skipped GroupMemberObsDataEvaluatorTest testMakeSureEmptySingleEntryEvenIfNoMatchingObsInGroup History
Test against 1.11
Skipped GroupMemberObsDataEvaluatorTest testMakeSureEmptyListEntryEvenIfNoMatchingObsInGroup History
Test against 1.10
Skipped GroupMemberObsDataEvaluatorTest testMakeSureEmptySingleEntryEvenIfNoMatchingObsInGroup History
Test against 1.10
Skipped GroupMemberObsDataEvaluatorTest testMakeSureEmptyListEntryEvenIfNoMatchingObsInGroup History
Test against 1.12
Skipped LogicDataEvaluatorTest org.openmrs.module.reporting.data.patient.evaluator.LogicDataEvaluatorTest History
Test against 2.2
Skipped LogicDataEvaluatorTest org.openmrs.module.reporting.data.patient.evaluator.LogicDataEvaluatorTest History
Test against 2.1
Skipped LogicDataEvaluatorTest org.openmrs.module.reporting.data.patient.evaluator.LogicDataEvaluatorTest History
Default Job
Skipped LogicDataEvaluatorTest org.openmrs.module.reporting.data.patient.evaluator.LogicDataEvaluatorTest History
Test against 1.10
Skipped LogicDataEvaluatorTest org.openmrs.module.reporting.data.patient.evaluator.LogicDataEvaluatorTest History
Test against 1.11
Skipped LogicDataEvaluatorTest org.openmrs.module.reporting.data.patient.evaluator.LogicDataEvaluatorTest History
Test against 2.0
Skipped LogicDataEvaluatorTest org.openmrs.module.reporting.data.patient.evaluator.LogicDataEvaluatorTest History
Test against 1.12
Skipped TestPatientCalculation org.openmrs.module.reporting.data.patient.evaluator.TestPatientCalculation History
Test against 2.1
Skipped TestPatientCalculation org.openmrs.module.reporting.data.patient.evaluator.TestPatientCalculation History
Test against 2.2
Skipped TestPatientCalculation org.openmrs.module.reporting.data.patient.evaluator.TestPatientCalculation History
Default Job
Skipped TestPatientCalculation org.openmrs.module.reporting.data.patient.evaluator.TestPatientCalculation History
Test against 1.11
Skipped TestPatientCalculation org.openmrs.module.reporting.data.patient.evaluator.TestPatientCalculation History
Test against 2.0
Skipped TestPatientCalculation org.openmrs.module.reporting.data.patient.evaluator.TestPatientCalculation History
Test against 1.12
Skipped TestPatientCalculation org.openmrs.module.reporting.data.patient.evaluator.TestPatientCalculation History
Test against 1.10
Skipped DataExportDataSetPersisterTest org.openmrs.module.reporting.dataset.DataExportDataSetPersisterTest History
Test against 2.1
Skipped DataExportDataSetPersisterTest org.openmrs.module.reporting.dataset.DataExportDataSetPersisterTest History
Test against 2.2
Skipped DataExportDataSetPersisterTest org.openmrs.module.reporting.dataset.DataExportDataSetPersisterTest History
Default Job
Skipped DataExportDataSetPersisterTest org.openmrs.module.reporting.dataset.DataExportDataSetPersisterTest History
Test against 1.11
Skipped DataExportDataSetPersisterTest org.openmrs.module.reporting.dataset.DataExportDataSetPersisterTest History
Test against 1.10
Skipped DataExportDataSetPersisterTest org.openmrs.module.reporting.dataset.DataExportDataSetPersisterTest History
Test against 2.0
Skipped DataExportDataSetPersisterTest org.openmrs.module.reporting.dataset.DataExportDataSetPersisterTest History
Test against 1.12
Skipped LogicDataSetEvaluatorTest org.openmrs.module.reporting.dataset.definition.evaluator.LogicDataSetEvaluatorTest History
Test against 2.1
Skipped LogicDataSetEvaluatorTest org.openmrs.module.reporting.dataset.definition.evaluator.LogicDataSetEvaluatorTest History
Test against 1.12
Skipped LogicDataSetEvaluatorTest org.openmrs.module.reporting.dataset.definition.evaluator.LogicDataSetEvaluatorTest History
Default Job
Skipped LogicDataSetEvaluatorTest org.openmrs.module.reporting.dataset.definition.evaluator.LogicDataSetEvaluatorTest History
Test against 2.2
Skipped LogicDataSetEvaluatorTest org.openmrs.module.reporting.dataset.definition.evaluator.LogicDataSetEvaluatorTest History
Test against 1.11
Skipped LogicDataSetEvaluatorTest org.openmrs.module.reporting.dataset.definition.evaluator.LogicDataSetEvaluatorTest History
Test against 2.0
Skipped LogicDataSetEvaluatorTest org.openmrs.module.reporting.dataset.definition.evaluator.LogicDataSetEvaluatorTest History
Test against 1.10
Skipped MySqlDataSetEvaluatorTest org.openmrs.module.reporting.dataset.definition.evaluator.MySqlDataSetEvaluatorTest History
Test against 2.2
Skipped MySqlDataSetEvaluatorTest org.openmrs.module.reporting.dataset.definition.evaluator.MySqlDataSetEvaluatorTest History
Test against 2.1
Skipped MySqlDataSetEvaluatorTest org.openmrs.module.reporting.dataset.definition.evaluator.MySqlDataSetEvaluatorTest History
Test against 1.11
Skipped MySqlDataSetEvaluatorTest org.openmrs.module.reporting.dataset.definition.evaluator.MySqlDataSetEvaluatorTest History
Default Job
Skipped MySqlDataSetEvaluatorTest org.openmrs.module.reporting.dataset.definition.evaluator.MySqlDataSetEvaluatorTest History
Test against 2.0
Skipped MySqlDataSetEvaluatorTest org.openmrs.module.reporting.dataset.definition.evaluator.MySqlDataSetEvaluatorTest History
Test against 1.10
Skipped MySqlDataSetEvaluatorTest org.openmrs.module.reporting.dataset.definition.evaluator.MySqlDataSetEvaluatorTest History
Test against 1.12
Skipped ObsQueryServiceImplTest evaluate_shouldEvaluateAnObsQuery History
Test against 2.1
Skipped ObsQueryServiceImplTest evaluate_shouldEvaluateAnObsQuery History
Test against 2.2
Skipped ObsQueryServiceImplTest evaluate_shouldEvaluateAnObsQuery History
Default Job
Skipped ObsQueryServiceImplTest evaluate_shouldEvaluateAnObsQuery History
Test against 1.11
Skipped ObsQueryServiceImplTest evaluate_shouldEvaluateAnObsQuery History
Test against 2.0
Skipped ObsQueryServiceImplTest evaluate_shouldEvaluateAnObsQuery History
Test against 1.10
Skipped ObsQueryServiceImplTest evaluate_shouldEvaluateAnObsQuery History
Test against 1.12
Skipped MysqlReportServiceTest org.openmrs.module.reporting.report.service.MysqlReportServiceTest History
Default Job
Skipped MysqlReportServiceTest org.openmrs.module.reporting.report.service.MysqlReportServiceTest History
Test against 2.2
Skipped MysqlReportServiceTest org.openmrs.module.reporting.report.service.MysqlReportServiceTest History
Test against 2.1
Skipped MysqlReportServiceTest org.openmrs.module.reporting.report.service.MysqlReportServiceTest History
Test against 1.11
Skipped MysqlReportServiceTest org.openmrs.module.reporting.report.service.MysqlReportServiceTest History
Test against 1.12
Skipped MysqlReportServiceTest org.openmrs.module.reporting.report.service.MysqlReportServiceTest History
Test against 1.10
Skipped MysqlReportServiceTest org.openmrs.module.reporting.report.service.MysqlReportServiceTest History
Test against 2.0
Skipped TestReportProcessor org.openmrs.module.reporting.report.service.TestReportProcessor History
Test against 2.1
Skipped TestReportProcessor org.openmrs.module.reporting.report.service.TestReportProcessor History
Default Job
Skipped TestReportProcessor org.openmrs.module.reporting.report.service.TestReportProcessor History
Test against 1.11
Skipped TestReportProcessor org.openmrs.module.reporting.report.service.TestReportProcessor History
Test against 2.2
Skipped TestReportProcessor org.openmrs.module.reporting.report.service.TestReportProcessor History
Test against 1.10
Skipped TestReportProcessor org.openmrs.module.reporting.report.service.TestReportProcessor History
Test against 1.12
Skipped TestReportProcessor org.openmrs.module.reporting.report.service.TestReportProcessor History
Test against 2.0