More details of the release in https://wiki.openmrs.org/x/i4DTAw
Build: #327 failed
Job: Default Job failed
Evaluate should return all encounters of the specified types in order for each patient: Test case result
The below summarizes the result of the test "Evaluate should return all encounters of the specified types in order for each patient" in build 327 of Reporting Module - Reporting Module - Default Job.
- Description
- Evaluate should return all encounters of the specified types in order for each patient
- Test class
- org.openmrs.module.reporting.data.patient.evaluator.EncountersForPatientDataEvaluatorTest
- Method
- evaluate_shouldReturnAllEncountersOfTheSpecifiedTypesInOrderForEachPatient
- Duration
- 2 secs
- Status
- Failed (New Failure)
Error Log
java.lang.IllegalStateException: Failed to load ApplicationContext at org.springframework.test.context.TestContext.getApplicationContext(TestContext.java:308) at org.springframework.test.context.support.DependencyInjectionTestExecutionListener.injectDependencies(DependencyInjectionTestExecutionListener.java:109) at org.springframework.test.context.support.DependencyInjectionTestExecutionListener.prepareTestInstance(DependencyInjectionTestExecutionListener.java:75) at org.springframework.test.context.TestContextManager.prepareTestInstance(TestContextManager.java:321) at org.springframework.test.context.junit4.SpringJUnit4ClassRunner.createTest(SpringJUnit4ClassRunner.java:220) at org.springframework.test.context.junit4.SpringJUnit4ClassRunner$1.runReflectiveCall(SpringJUnit4ClassRunner.java:301) at org.junit.internal.runners.model.ReflectiveCallable.run(ReflectiveCallable.java:12) at org.springframework.test.context.junit4.SpringJUnit4ClassRunner.methodBlock(SpringJUnit4ClassRunner.java:303) at org.springframework.test.context.junit4.SpringJUnit4ClassRunner.runChild(SpringJUnit4ClassRunner.java:240) at org.junit.runners.BlockJUnit4ClassRunner.runChild(BlockJUnit4ClassRunner.java:50) at org.junit.runners.ParentRunner$3.run(ParentRunner.java:238) at org.junit.runners.ParentRunner$1.schedule(ParentRunner.java:63) at org.junit.runners.ParentRunner.runChildren(ParentRunner.java:236) at org.junit.runners.ParentRunner.access$000(ParentRunner.java:53) at org.junit.runners.ParentRunner$2.evaluate(ParentRunner.java:229) at org.springframework.test.context.junit4.statements.RunBeforeTestClassCallbacks.evaluate(RunBeforeTestClassCallbacks.java:61) at org.junit.internal.runners.statements.RunAfters.evaluate(RunAfters.java:27) at org.springframework.test.context.junit4.statements.RunAfterTestClassCallbacks.evaluate(RunAfterTestClassCallbacks.java:70) at org.junit.runners.ParentRunner.run(ParentRunner.java:309) at org.springframework.test.context.junit4.SpringJUnit4ClassRunner.run(SpringJUnit4ClassRunner.java:180) at org.apache.maven.surefire.junit4.JUnit4TestSet.execute(JUnit4TestSet.java:59) at org.apache.maven.surefire.suite.AbstractDirectoryTestSuite.executeTestSet(AbstractDirectoryTestSuite.java:115) at org.apache.maven.surefire.suite.AbstractDirectoryTestSuite.execute(AbstractDirectoryTestSuite.java:102) at org.apache.maven.surefire.Surefire.run(Surefire.java:180) at sun.reflect.NativeMethodAccessorImpl.invoke0(Native Method) at sun.reflect.NativeMethodAccessorImpl.invoke(NativeMethodAccessorImpl.java:57) at sun.reflect.DelegatingMethodAccessorImpl.invoke(DelegatingMethodAccessorImpl.java:43) at java.lang.reflect.Method.invoke(Method.java:622) at org.apache.maven.surefire.booter.SurefireBooter.runSuitesInProcess(SurefireBooter.java:350) at org.apache.maven.surefire.booter.SurefireBooter.main(SurefireBooter.java:1021) Caused by: org.springframework.beans.factory.BeanCreationException: Error creating bean with name 'reportManagerInitializer': Injection of autowired dependencies failed; nested exception is org.springframework.beans.factory.BeanCreationException: Could not autowire field: private java.util.List org.openmrs.module.reporting.report.manager.ReportManagerInitializer.reportManagers; nested exception is org.springframework.beans.factory.NoSuchBeanDefinitionException: No matching bean of type [org.openmrs.module.reporting.report.manager.ReportManager] found for dependency [collection of org.openmrs.module.reporting.report.manager.ReportManager]: expected at least 1 bean which qualifies as autowire candidate for this dependency. Dependency annotations: {@org.springframework.beans.factory.annotation.Autowired(required=true)} at org.springframework.beans.factory.annotation.AutowiredAnnotationBeanPostProcessor.postProcessPropertyValues(AutowiredAnnotationBeanPostProcessor.java:285) at org.springframework.beans.factory.support.AbstractAutowireCapableBeanFactory.populateBean(AbstractAutowireCapableBeanFactory.java:1074) at org.springframework.beans.factory.support.AbstractAutowireCapableBeanFactory.doCreateBean(AbstractAutowireCapableBeanFactory.java:517) at org.springframework.beans.factory.support.AbstractAutowireCapableBeanFactory.createBean(AbstractAutowireCapableBeanFactory.java:456) at org.springframework.beans.factory.support.AbstractBeanFactory$1.getObject(AbstractBeanFactory.java:291) at org.springframework.beans.factory.support.DefaultSingletonBeanRegistry.getSingleton(DefaultSingletonBeanRegistry.java:222) at org.springframework.beans.factory.support.AbstractBeanFactory.doGetBean(AbstractBeanFactory.java:288) at org.springframework.beans.factory.support.AbstractBeanFactory.getBean(AbstractBeanFactory.java:190) at org.springframework.beans.factory.support.DefaultListableBeanFactory.preInstantiateSingletons(DefaultListableBeanFactory.java:580) at org.springframework.context.support.AbstractApplicationContext.finishBeanFactoryInitialization(AbstractApplicationContext.java:895) at org.springframework.context.support.AbstractApplicationContext.refresh(AbstractApplicationContext.java:425) at org.springframework.test.context.support.AbstractGenericContextLoader.loadContext(AbstractGenericContextLoader.java:84) at org.springframework.test.context.support.AbstractGenericContextLoader.loadContext(AbstractGenericContextLoader.java:1) at org.springframework.test.context.TestContext.loadApplicationContext(TestContext.java:280) at org.springframework.test.context.TestContext.getApplicationContext(TestContext.java:304) ... 29 more Caused by: org.springframework.beans.factory.BeanCreationException: Could not autowire field: private java.util.List org.openmrs.module.reporting.report.manager.ReportManagerInitializer.reportManagers; nested exception is org.springframework.beans.factory.NoSuchBeanDefinitionException: No matching bean of type [org.openmrs.module.reporting.report.manager.ReportManager] found for dependency [collection of org.openmrs.module.reporting.report.manager.ReportManager]: expected at least 1 bean which qualifies as autowire candidate for this dependency. Dependency annotations: {@org.springframework.beans.factory.annotation.Autowired(required=true)} at org.springframework.beans.factory.annotation.AutowiredAnnotationBeanPostProcessor$AutowiredFieldElement.inject(AutowiredAnnotationBeanPostProcessor.java:502) at org.springframework.beans.factory.annotation.InjectionMetadata.inject(InjectionMetadata.java:84) at org.springframework.beans.factory.annotation.AutowiredAnnotationBeanPostProcessor.postProcessPropertyValues(AutowiredAnnotationBeanPostProcessor.java:282) ... 43 more Caused by: org.springframework.beans.factory.NoSuchBeanDefinitionException: No matching bean of type [org.openmrs.module.reporting.report.manager.ReportManager] found for dependency [collection of org.openmrs.module.reporting.report.manager.ReportManager]: expected at least 1 bean which qualifies as autowire candidate for this dependency. Dependency annotations: {@org.springframework.beans.factory.annotation.Autowired(required=true)} at org.springframework.beans.factory.support.DefaultListableBeanFactory.raiseNoSuchBeanDefinitionException(DefaultListableBeanFactory.java:920) at org.springframework.beans.factory.support.DefaultListableBeanFactory.doResolveDependency(DefaultListableBeanFactory.java:747) at org.springframework.beans.factory.support.DefaultListableBeanFactory.resolveDependency(DefaultListableBeanFactory.java:703) at org.springframework.beans.factory.annotation.AutowiredAnnotationBeanPostProcessor$AutowiredFieldElement.inject(AutowiredAnnotationBeanPostProcessor.java:474) ... 45 more