More details of the release in https://wiki.openmrs.org/x/i4DTAw

Build: #795 was successful

Job: Test against 1.12 was successful

Build log

The build generated 1,689 lines of output.The output is too long and has been truncated to the last 1,000 lines. Download or view full build log

25-Oct-2019 22:40:42         at java.lang.reflect.Method.invoke(Method.java:498)
25-Oct-2019 22:40:42         at org.springframework.aop.support.AopUtils.invokeJoinpointUsingReflection(AopUtils.java:317)
25-Oct-2019 22:40:42         at org.springframework.aop.framework.ReflectiveMethodInvocation.invokeJoinpoint(ReflectiveMethodInvocation.java:183)
25-Oct-2019 22:40:42         at org.springframework.aop.framework.ReflectiveMethodInvocation.proceed(ReflectiveMethodInvocation.java:150)
25-Oct-2019 22:40:42         at org.springframework.transaction.interceptor.TransactionInterceptor$1.proceedWithInvocation(TransactionInterceptor.java:96)
25-Oct-2019 22:40:42         at org.springframework.transaction.interceptor.TransactionAspectSupport.invokeWithinTransaction(TransactionAspectSupport.java:260)
25-Oct-2019 22:40:42         at org.springframework.transaction.interceptor.TransactionInterceptor.invoke(TransactionInterceptor.java:94)
25-Oct-2019 22:40:42         at org.springframework.aop.framework.ReflectiveMethodInvocation.proceed(ReflectiveMethodInvocation.java:172)
25-Oct-2019 22:40:42         at org.openmrs.aop.LoggingAdvice.invoke(LoggingAdvice.java:121)
25-Oct-2019 22:40:42         at org.springframework.aop.framework.ReflectiveMethodInvocation.proceed(ReflectiveMethodInvocation.java:172)
25-Oct-2019 22:40:42         at org.springframework.aop.framework.adapter.MethodBeforeAdviceInterceptor.invoke(MethodBeforeAdviceInterceptor.java:51)
25-Oct-2019 22:40:42         at org.springframework.aop.framework.ReflectiveMethodInvocation.proceed(ReflectiveMethodInvocation.java:172)
25-Oct-2019 22:40:42         at org.springframework.aop.framework.adapter.MethodBeforeAdviceInterceptor.invoke(MethodBeforeAdviceInterceptor.java:51)
25-Oct-2019 22:40:42         at org.springframework.aop.framework.ReflectiveMethodInvocation.proceed(ReflectiveMethodInvocation.java:172)
25-Oct-2019 22:40:42         at org.springframework.aop.framework.JdkDynamicAopProxy.invoke(JdkDynamicAopProxy.java:204)
25-Oct-2019 22:40:42         at com.sun.proxy.$Proxy26.evaluateToList(Unknown Source)
25-Oct-2019 22:40:42         at sun.reflect.GeneratedMethodAccessor264.invoke(Unknown Source)
25-Oct-2019 22:40:42         at sun.reflect.DelegatingMethodAccessorImpl.invoke(DelegatingMethodAccessorImpl.java:43)
25-Oct-2019 22:40:42         at java.lang.reflect.Method.invoke(Method.java:498)
25-Oct-2019 22:40:42         at org.springframework.aop.support.AopUtils.invokeJoinpointUsingReflection(AopUtils.java:317)
25-Oct-2019 22:40:42         at org.springframework.aop.framework.ReflectiveMethodInvocation.invokeJoinpoint(ReflectiveMethodInvocation.java:183)
25-Oct-2019 22:40:42         at org.springframework.aop.framework.ReflectiveMethodInvocation.proceed(ReflectiveMethodInvocation.java:150)
25-Oct-2019 22:40:42         at org.springframework.transaction.interceptor.TransactionInterceptor$1.proceedWithInvocation(TransactionInterceptor.java:96)
25-Oct-2019 22:40:42         at org.springframework.transaction.interceptor.TransactionAspectSupport.invokeWithinTransaction(TransactionAspectSupport.java:260)
25-Oct-2019 22:40:42         at org.springframework.transaction.interceptor.TransactionInterceptor.invoke(TransactionInterceptor.java:94)
25-Oct-2019 22:40:42         at org.springframework.aop.framework.ReflectiveMethodInvocation.proceed(ReflectiveMethodInvocation.java:172)
25-Oct-2019 22:40:42         at org.springframework.aop.framework.JdkDynamicAopProxy.invoke(JdkDynamicAopProxy.java:204)
25-Oct-2019 22:40:42         at com.sun.proxy.$Proxy145.evaluateToList(Unknown Source)
25-Oct-2019 22:40:42         at org.openmrs.module.reporting.cohort.definition.evaluator.SqlCohortDefinitionEvaluator.evaluate(SqlCohortDefinitionEvaluator.java:61)
25-Oct-2019 22:40:42         at org.openmrs.module.reporting.cohort.definition.evaluator.SqlCohortDefinitionEvaluator.evaluate(SqlCohortDefinitionEvaluator.java:28)
25-Oct-2019 22:40:42         at org.openmrs.module.reporting.definition.service.BaseDefinitionService.executeEvaluator(BaseDefinitionService.java:369)
25-Oct-2019 22:40:42         at org.openmrs.module.reporting.definition.service.BaseDefinitionService.evaluateBypassingExclusionOfTestPatients(BaseDefinitionService.java:264)
25-Oct-2019 22:40:42         at org.openmrs.module.reporting.cohort.definition.service.CohortDefinitionServiceImpl.evaluateBypassingExclusionOfTestPatients(CohortDefinitionServiceImpl.java:54)
25-Oct-2019 22:40:42         at org.openmrs.module.reporting.cohort.definition.service.CohortDefinitionServiceImpl.evaluateBypassingExclusionOfTestPatients(CohortDefinitionServiceImpl.java:24)
25-Oct-2019 22:40:42         at org.openmrs.module.reporting.definition.service.BaseDefinitionService.evaluate(BaseDefinitionService.java:229)
25-Oct-2019 22:40:42         at org.openmrs.module.reporting.cohort.definition.service.CohortDefinitionServiceImpl.evaluate(CohortDefinitionServiceImpl.java:38)
25-Oct-2019 22:40:42         at sun.reflect.GeneratedMethodAccessor263.invoke(Unknown Source)
25-Oct-2019 22:40:42         at sun.reflect.DelegatingMethodAccessorImpl.invoke(DelegatingMethodAccessorImpl.java:43)
25-Oct-2019 22:40:42         at java.lang.reflect.Method.invoke(Method.java:498)
25-Oct-2019 22:40:42         at org.springframework.aop.support.AopUtils.invokeJoinpointUsingReflection(AopUtils.java:317)
25-Oct-2019 22:40:42         at org.springframework.aop.framework.ReflectiveMethodInvocation.invokeJoinpoint(ReflectiveMethodInvocation.java:183)
25-Oct-2019 22:40:42         at org.springframework.aop.framework.ReflectiveMethodInvocation.proceed(ReflectiveMethodInvocation.java:150)
25-Oct-2019 22:40:42         at org.openmrs.aop.LoggingAdvice.invoke(LoggingAdvice.java:121)
25-Oct-2019 22:40:42         at org.springframework.aop.framework.ReflectiveMethodInvocation.proceed(ReflectiveMethodInvocation.java:172)
25-Oct-2019 22:40:42         at org.springframework.aop.framework.adapter.MethodBeforeAdviceInterceptor.invoke(MethodBeforeAdviceInterceptor.java:51)
25-Oct-2019 22:40:42         at org.springframework.aop.framework.ReflectiveMethodInvocation.proceed(ReflectiveMethodInvocation.java:172)
25-Oct-2019 22:40:42         at org.springframework.aop.framework.adapter.MethodBeforeAdviceInterceptor.invoke(MethodBeforeAdviceInterceptor.java:51)
25-Oct-2019 22:40:42         at org.springframework.aop.framework.ReflectiveMethodInvocation.proceed(ReflectiveMethodInvocation.java:172)
25-Oct-2019 22:40:42         at org.springframework.aop.framework.JdkDynamicAopProxy.invoke(JdkDynamicAopProxy.java:204)
25-Oct-2019 22:40:42         at com.sun.proxy.$Proxy37.evaluate(Unknown Source)
25-Oct-2019 22:40:42         at sun.reflect.GeneratedMethodAccessor263.invoke(Unknown Source)
25-Oct-2019 22:40:42         at sun.reflect.DelegatingMethodAccessorImpl.invoke(DelegatingMethodAccessorImpl.java:43)
25-Oct-2019 22:40:42         at java.lang.reflect.Method.invoke(Method.java:498)
25-Oct-2019 22:40:42         at org.springframework.aop.support.AopUtils.invokeJoinpointUsingReflection(AopUtils.java:317)
25-Oct-2019 22:40:42         at org.springframework.aop.framework.JdkDynamicAopProxy.invoke(JdkDynamicAopProxy.java:198)
25-Oct-2019 22:40:42         at com.sun.proxy.$Proxy146.evaluate(Unknown Source)
25-Oct-2019 22:40:42         at org.openmrs.module.reporting.cohort.definition.evaluator.SqlCohortDefinitionEvaluatorTest.shouldProtectSqlQueryAgainstDatabaseModifications(SqlCohortDefinitionEvaluatorTest.java:308)
25-Oct-2019 22:40:42         at sun.reflect.NativeMethodAccessorImpl.invoke0(Native Method)
25-Oct-2019 22:40:42         at sun.reflect.NativeMethodAccessorImpl.invoke(NativeMethodAccessorImpl.java:62)
25-Oct-2019 22:40:42         at sun.reflect.DelegatingMethodAccessorImpl.invoke(DelegatingMethodAccessorImpl.java:43)
25-Oct-2019 22:40:42         at java.lang.reflect.Method.invoke(Method.java:498)
25-Oct-2019 22:40:42         at org.junit.runners.model.FrameworkMethod$1.runReflectiveCall(FrameworkMethod.java:47)
25-Oct-2019 22:40:42         at org.junit.internal.runners.model.ReflectiveCallable.run(ReflectiveCallable.java:12)
25-Oct-2019 22:40:42         at org.junit.runners.model.FrameworkMethod.invokeExplosively(FrameworkMethod.java:44)
25-Oct-2019 22:40:42         at org.junit.internal.runners.statements.InvokeMethod.evaluate(InvokeMethod.java:17)
25-Oct-2019 22:40:42         at org.junit.internal.runners.statements.ExpectException.evaluate(ExpectException.java:19)
25-Oct-2019 22:40:42         at org.junit.internal.runners.statements.RunBefores.evaluate(RunBefores.java:26)
25-Oct-2019 22:40:42         at org.springframework.test.context.junit4.statements.RunBeforeTestMethodCallbacks.evaluate(RunBeforeTestMethodCallbacks.java:74)
25-Oct-2019 22:40:42         at org.junit.internal.runners.statements.RunAfters.evaluate(RunAfters.java:27)
25-Oct-2019 22:40:42         at org.springframework.test.context.junit4.statements.RunAfterTestMethodCallbacks.evaluate(RunAfterTestMethodCallbacks.java:83)
25-Oct-2019 22:40:42         at org.springframework.test.context.junit4.statements.SpringRepeat.evaluate(SpringRepeat.java:72)
25-Oct-2019 22:40:42         at org.springframework.test.context.junit4.SpringJUnit4ClassRunner.runChild(SpringJUnit4ClassRunner.java:231)
25-Oct-2019 22:40:42         at org.springframework.test.context.junit4.SpringJUnit4ClassRunner.runChild(SpringJUnit4ClassRunner.java:88)
25-Oct-2019 22:40:42         at org.junit.runners.ParentRunner$3.run(ParentRunner.java:238)
25-Oct-2019 22:40:42         at org.junit.runners.ParentRunner$1.schedule(ParentRunner.java:63)
25-Oct-2019 22:40:42         at org.junit.runners.ParentRunner.runChildren(ParentRunner.java:236)
25-Oct-2019 22:40:42         at org.junit.runners.ParentRunner.access$000(ParentRunner.java:53)
25-Oct-2019 22:40:42         at org.junit.runners.ParentRunner$2.evaluate(ParentRunner.java:229)
25-Oct-2019 22:40:42         at org.springframework.test.context.junit4.statements.RunBeforeTestClassCallbacks.evaluate(RunBeforeTestClassCallbacks.java:61)
25-Oct-2019 22:40:42         at org.junit.internal.runners.statements.RunAfters.evaluate(RunAfters.java:27)
25-Oct-2019 22:40:42         at org.springframework.test.context.junit4.statements.RunAfterTestClassCallbacks.evaluate(RunAfterTestClassCallbacks.java:71)
25-Oct-2019 22:40:42         at org.junit.runners.ParentRunner.run(ParentRunner.java:309)
25-Oct-2019 22:40:42         at org.springframework.test.context.junit4.SpringJUnit4ClassRunner.run(SpringJUnit4ClassRunner.java:174)
25-Oct-2019 22:40:42         at org.apache.maven.surefire.junit4.JUnit4TestSet.execute(JUnit4TestSet.java:59)
25-Oct-2019 22:40:42         at org.apache.maven.surefire.suite.AbstractDirectoryTestSuite.executeTestSet(AbstractDirectoryTestSuite.java:115)
25-Oct-2019 22:40:42         at org.apache.maven.surefire.suite.AbstractDirectoryTestSuite.execute(AbstractDirectoryTestSuite.java:102)
25-Oct-2019 22:40:42         at org.apache.maven.surefire.Surefire.run(Surefire.java:180)
25-Oct-2019 22:40:42         at sun.reflect.NativeMethodAccessorImpl.invoke0(Native Method)
25-Oct-2019 22:40:42         at sun.reflect.NativeMethodAccessorImpl.invoke(NativeMethodAccessorImpl.java:62)
25-Oct-2019 22:40:42         at sun.reflect.DelegatingMethodAccessorImpl.invoke(DelegatingMethodAccessorImpl.java:43)
25-Oct-2019 22:40:42         at java.lang.reflect.Method.invoke(Method.java:498)
25-Oct-2019 22:40:42         at org.apache.maven.surefire.booter.SurefireBooter.runSuitesInProcess(SurefireBooter.java:350)
25-Oct-2019 22:40:42         at org.apache.maven.surefire.booter.SurefireBooter.main(SurefireBooter.java:1021)
25-Oct-2019 22:40:42 Caused by: org.hibernate.exception.GenericJDBCException: error executing work
25-Oct-2019 22:40:42         at org.hibernate.exception.SQLStateConverter.handledNonSpecificException(SQLStateConverter.java:140)
25-Oct-2019 22:40:42         at org.hibernate.exception.SQLStateConverter.convert(SQLStateConverter.java:128)
25-Oct-2019 22:40:42         at org.hibernate.exception.JDBCExceptionHelper.convert(JDBCExceptionHelper.java:66)
25-Oct-2019 22:40:42         at org.hibernate.exception.JDBCExceptionHelper.convert(JDBCExceptionHelper.java:52)
25-Oct-2019 22:40:42         at org.hibernate.impl.SessionImpl.doWork(SessionImpl.java:2001)
25-Oct-2019 22:40:42         at org.openmrs.api.db.hibernate.DbSession.doWork(DbSession.java:958)
25-Oct-2019 22:40:42         at org.openmrs.module.reporting.evaluation.querybuilder.SqlQueryBuilder.evaluateToList(SqlQueryBuilder.java:152)
25-Oct-2019 22:40:42         ... 97 more
25-Oct-2019 22:40:42 Caused by: org.h2.jdbc.JdbcSQLException: Method is only allowed for a query. Use execute or executeUpdate instead of executeQuery; SQL statement:
25-Oct-2019 22:40:42 update person set gender='F'  [90002-173]
25-Oct-2019 22:40:42         at org.h2.message.DbException.getJdbcSQLException(DbException.java:331)
25-Oct-2019 22:40:42         at org.h2.message.DbException.get(DbException.java:171)
25-Oct-2019 22:40:42         at org.h2.message.DbException.get(DbException.java:148)
25-Oct-2019 22:40:42         at org.h2.message.DbException.get(DbException.java:137)
25-Oct-2019 22:40:42         at org.h2.command.Prepared.query(Prepared.java:211)
25-Oct-2019 22:40:42         at org.h2.command.CommandContainer.query(CommandContainer.java:91)
25-Oct-2019 22:40:42         at org.h2.command.Command.executeQuery(Command.java:195)
25-Oct-2019 22:40:42         at org.h2.jdbc.JdbcPreparedStatement.executeQuery(JdbcPreparedStatement.java:106)
25-Oct-2019 22:40:42         at com.mchange.v2.c3p0.impl.NewProxyPreparedStatement.executeQuery(NewProxyPreparedStatement.java:76)
25-Oct-2019 22:40:42         at org.openmrs.module.reporting.evaluation.querybuilder.SqlQueryBuilder$2.execute(SqlQueryBuilder.java:159)
25-Oct-2019 22:40:42         at org.hibernate.impl.SessionImpl.doWork(SessionImpl.java:1997)
25-Oct-2019 22:40:42         ... 99 more
25-Oct-2019 22:40:43 Tests run: 13, Failures: 0, Errors: 0, Skipped: 0, Time elapsed: 1.588 sec
25-Oct-2019 22:40:43 Running org.openmrs.module.reporting.evaluation.service.EvaluationServiceTest
25-Oct-2019 22:40:44 Tests run: 6, Failures: 0, Errors: 0, Skipped: 0, Time elapsed: 1.624 sec
25-Oct-2019 22:40:44 Running org.openmrs.module.reporting.data.obs.evaluator.EncounterToObsDataEvaluatorTest
25-Oct-2019 22:40:45 Tests run: 3, Failures: 0, Errors: 0, Skipped: 0, Time elapsed: 0.476 sec
25-Oct-2019 22:40:45 Running org.openmrs.module.reporting.query.encounter.evaluator.MappedParametersEncounterQueryEvaluatorTest
25-Oct-2019 22:40:45 Tests run: 1, Failures: 0, Errors: 0, Skipped: 0, Time elapsed: 0.143 sec
25-Oct-2019 22:40:45 Running org.openmrs.module.reporting.validator.InStateCohortDefinitionValidatorTest
25-Oct-2019 22:40:45 Tests run: 3, Failures: 0, Errors: 0, Skipped: 0, Time elapsed: 0.047 sec
25-Oct-2019 22:40:45 Running org.openmrs.module.reporting.common.ReflectionUtilTest
25-Oct-2019 22:40:45 Tests run: 6, Failures: 0, Errors: 0, Skipped: 0, Time elapsed: 0.004 sec
25-Oct-2019 22:40:45 Running org.openmrs.module.reporting.template.HandlebarsHelpersTest
25-Oct-2019 22:40:45 Tests run: 3, Failures: 0, Errors: 0, Skipped: 0, Time elapsed: 0.218 sec
25-Oct-2019 22:40:45 Running org.openmrs.module.reporting.data.visit.evaluator.VisitIdDataEvaluatorTest
25-Oct-2019 22:40:45 Tests run: 2, Failures: 0, Errors: 0, Skipped: 0, Time elapsed: 0.251 sec
25-Oct-2019 22:40:45 Running org.openmrs.module.reporting.cohort.definition.evaluator.ConditionalParameterCohortDefinitionEvaluatorTest
25-Oct-2019 22:40:46 Tests run: 1, Failures: 0, Errors: 0, Skipped: 0, Time elapsed: 0.128 sec
25-Oct-2019 22:40:46 Running org.openmrs.module.reporting.data.patient.evaluator.CurrentPatientStateDataEvaluatorTest
25-Oct-2019 22:40:46 Tests run: 1, Failures: 0, Errors: 0, Skipped: 0, Time elapsed: 0.154 sec
25-Oct-2019 22:40:46 Running org.openmrs.module.reporting.data.encounter.evaluator.ObsOnSameDateEncounterDataEvaluatorTest
25-Oct-2019 22:40:46 Tests run: 3, Failures: 0, Errors: 0, Skipped: 0, Time elapsed: 0.442 sec
25-Oct-2019 22:40:46 Running org.openmrs.module.reporting.cohort.query.service.CohortQueryServiceTest
25-Oct-2019 22:40:46 Tests run: 1, Failures: 0, Errors: 0, Skipped: 0, Time elapsed: 0.129 sec
25-Oct-2019 22:40:46 Running org.openmrs.module.reporting.data.person.evaluator.ObsForPersonDataEvaluatorTest
25-Oct-2019 22:40:47 Tests run: 3, Failures: 0, Errors: 0, Skipped: 0, Time elapsed: 0.402 sec
25-Oct-2019 22:40:47 Running org.openmrs.module.reporting.validator.StaticCohortDefinitionValidatorTest
25-Oct-2019 22:40:47 Tests run: 1, Failures: 0, Errors: 0, Skipped: 0, Time elapsed: 0.027 sec
25-Oct-2019 22:40:47 Running org.openmrs.module.reporting.dataset.definition.evaluator.EncounterDataSetEvaluatorTest
25-Oct-2019 22:40:47 ENCOUNTER ID        EMR ID        BIRTHDATE           ENCOUNTER DATE        Age At Start        Age At End        
25-Oct-2019 22:40:47 ------------        ------        ------------        --------------        ------------        ----------        
25-Oct-2019 22:40:47 3                   7             ~25/Aug/1976        01/Aug/2008           33                  34                
25-Oct-2019 22:40:47 4                   7             ~25/Aug/1976        15/Aug/2008           33                  34                
25-Oct-2019 22:40:47 5                   7             ~25/Aug/1976        19/Aug/2008           33                  34                
25-Oct-2019 22:40:47 6                   20            08/Feb/1925         19/Aug/2009           80                  80                
25-Oct-2019 22:40:47 7                   21            ~08/Jun/1959        19/Aug/2009           50                  51                
25-Oct-2019 22:40:47 8                   21            ~08/Jun/1959        19/Sep/2009           50                  51                
25-Oct-2019 22:40:47 9                   22            08/Jul/1997         19/Sep/2009           12                  13                
25-Oct-2019 22:40:47 10                  22            08/Jul/1997         19/Oct/2009           12                  13                
25-Oct-2019 22:40:47 11                  23            08/Nov/2000         19/Aug/2009           9                   10                
25-Oct-2019 22:40:47 12                  24            08/Dec/2006         19/Sep/2009           3                   4                 
25-Oct-2019 22:40:47 Tests run: 1, Failures: 0, Errors: 0, Skipped: 0, Time elapsed: 0.264 sec
25-Oct-2019 22:40:47 Running org.openmrs.module.reporting.data.person.evaluator.BirthdateDataEvaluatorTest
25-Oct-2019 22:40:47 Tests run: 1, Failures: 0, Errors: 0, Skipped: 0, Time elapsed: 0.107 sec
25-Oct-2019 22:40:47 Running org.openmrs.module.reporting.cohort.definition.evaluator.EncounterCohortDefinitionEvaluatorTest
25-Oct-2019 22:40:48 Tests run: 9, Failures: 0, Errors: 0, Skipped: 2, Time elapsed: 0.945 sec
25-Oct-2019 22:40:48 Running org.openmrs.module.reporting.data.person.evaluator.PreferredAddressDataEvaluatorTest
25-Oct-2019 22:40:48 Tests run: 1, Failures: 0, Errors: 0, Skipped: 0, Time elapsed: 0.181 sec
25-Oct-2019 22:40:48 Running org.openmrs.module.reporting.cohort.definition.evaluator.GenderCohortDefinitionEvaluatorTest
25-Oct-2019 22:40:49 Tests run: 5, Failures: 0, Errors: 0, Skipped: 0, Time elapsed: 0.599 sec
25-Oct-2019 22:40:49 Running org.openmrs.module.reporting.data.converter.BirthdateConverterTest
25-Oct-2019 22:40:49 Tests run: 1, Failures: 0, Errors: 0, Skipped: 0, Time elapsed: 0.033 sec
25-Oct-2019 22:40:49 Running org.openmrs.module.reporting.data.patient.evaluator.ProgramStatesForPatientDataEvaluatorTest
25-Oct-2019 22:40:50 Tests run: 9, Failures: 0, Errors: 0, Skipped: 0, Time elapsed: 1.151 sec
25-Oct-2019 22:40:50 Running org.openmrs.module.reporting.data.visit.library.BuiltInVisitDataLibraryTest
25-Oct-2019 22:40:50 Tests run: 1, Failures: 0, Errors: 0, Skipped: 0, Time elapsed: 0.023 sec
25-Oct-2019 22:40:50 Running org.openmrs.module.reporting.cohort.definition.evaluator.AgeCohortDefinitionEvaluatorTest
25-Oct-2019 22:40:50 Tests run: 5, Failures: 0, Errors: 0, Skipped: 0, Time elapsed: 0.153 sec
25-Oct-2019 22:40:50 Running org.openmrs.module.reporting.data.encounter.evaluator.EncounterLocationDataEvaluatorTest
25-Oct-2019 22:40:50 Tests run: 3, Failures: 0, Errors: 0, Skipped: 0, Time elapsed: 0.299 sec
25-Oct-2019 22:40:50 Running org.openmrs.module.reporting.data.obs.evaluator.PersonToObsEvaluatorTest
25-Oct-2019 22:40:51 Tests run: 3, Failures: 0, Errors: 0, Skipped: 0, Time elapsed: 0.306 sec
25-Oct-2019 22:40:51 Running org.openmrs.module.reporting.common.DateRangeTest
25-Oct-2019 22:40:51 Tests run: 9, Failures: 0, Errors: 0, Skipped: 0, Time elapsed: 0.004 sec
25-Oct-2019 22:40:51 Running org.openmrs.module.reporting.cohort.definition.evaluator.NumericObsCohortDefinitionEvaluatorTest
25-Oct-2019 22:40:52 Tests run: 11, Failures: 0, Errors: 0, Skipped: 0, Time elapsed: 1.501 sec
25-Oct-2019 22:40:52 Running org.openmrs.module.reporting.indicator.QueryCountIndicatorEvaluatorTest
25-Oct-2019 22:40:53 Tests run: 3, Failures: 0, Errors: 0, Skipped: 0, Time elapsed: 0.407 sec
25-Oct-2019 22:40:53 Running org.openmrs.module.reporting.data.encounter.evaluator.ObsForEncounterEvaluatorTest
25-Oct-2019 22:40:54 Tests run: 7, Failures: 0, Errors: 0, Skipped: 0, Time elapsed: 0.863 sec
25-Oct-2019 22:40:54 Running org.openmrs.module.reporting.common.DateUtilTest
25-Oct-2019 22:40:54 Tests run: 15, Failures: 0, Errors: 0, Skipped: 0, Time elapsed: 0.136 sec
25-Oct-2019 22:40:54 Running org.openmrs.module.reporting.data.patient.evaluator.DrugOrdersForPatientDataEvaluatorTest
25-Oct-2019 22:40:55 Tests run: 8, Failures: 0, Errors: 0, Skipped: 0, Time elapsed: 1.659 sec
25-Oct-2019 22:40:55 Running org.openmrs.module.reporting.query.encounter.evaluator.MappedParametersObsQueryEvaluatorTest
25-Oct-2019 22:40:56 Tests run: 1, Failures: 0, Errors: 0, Skipped: 0, Time elapsed: 0.321 sec
25-Oct-2019 22:40:56 Running org.openmrs.module.reporting.serializer.ReportingSerializerTest
25-Oct-2019 22:40:56 Tests run: 6, Failures: 0, Errors: 0, Skipped: 0, Time elapsed: 0.142 sec
25-Oct-2019 22:40:56 Running org.openmrs.module.reporting.dataset.definition.evaluator.CohortCrossTabDataSetEvaluatorTest
25-Oct-2019 22:40:56 Tests run: 1, Failures: 0, Errors: 0, Skipped: 0, Time elapsed: 0.133 sec
25-Oct-2019 22:40:56 Running org.openmrs.module.reporting.query.person.service.PersonQueryServiceImplTest
25-Oct-2019 22:40:56 Tests run: 2, Failures: 0, Errors: 0, Skipped: 0, Time elapsed: 0.258 sec
25-Oct-2019 22:40:56 Running org.openmrs.module.reporting.dataset.definition.evaluator.MySqlDataSetEvaluatorTest
25-Oct-2019 22:40:56 Tests run: 1, Failures: 0, Errors: 0, Skipped: 1, Time elapsed: 0.002 sec
25-Oct-2019 22:40:56 Running org.openmrs.module.reporting.report.renderer.TextTemplateRendererTest
25-Oct-2019 22:40:57 Tests run: 3, Failures: 0, Errors: 0, Skipped: 0, Time elapsed: 0.889 sec
25-Oct-2019 22:40:57 Running org.openmrs.module.reporting.validator.InverseCohortDefinitionValidatorTest
25-Oct-2019 22:40:57 Tests run: 2, Failures: 0, Errors: 0, Skipped: 0, Time elapsed: 0.017 sec
25-Oct-2019 22:40:57 Running org.openmrs.module.reporting.validator.PatientStateCohortDefinitionValidatorTest
25-Oct-2019 22:40:57 Tests run: 3, Failures: 0, Errors: 0, Skipped: 0, Time elapsed: 0.028 sec
25-Oct-2019 22:40:57 Running org.openmrs.module.reporting.report.service.db.PropertiesTypeTest
25-Oct-2019 22:40:57 Tests run: 1, Failures: 0, Errors: 0, Skipped: 0, Time elapsed: 0.001 sec
25-Oct-2019 22:40:57 Running org.openmrs.module.reporting.query.encounter.evaluator.ObsForEncounterQueryEvaluatorTest
25-Oct-2019 22:40:58 Tests run: 8, Failures: 0, Errors: 0, Skipped: 0, Time elapsed: 1.07 sec
25-Oct-2019 22:40:58 Running org.openmrs.module.reporting.data.encounter.service.EncounterDataServiceImplTest
25-Oct-2019 22:40:58 Tests run: 2, Failures: 0, Errors: 0, Skipped: 0, Time elapsed: 0.222 sec
25-Oct-2019 22:40:58 Running org.openmrs.module.reporting.cohort.definition.evaluator.MappedParametersCohortDefinitionEvaluatorTest
25-Oct-2019 22:40:59 Tests run: 1, Failures: 0, Errors: 0, Skipped: 0, Time elapsed: 0.132 sec
25-Oct-2019 22:40:59 Running org.openmrs.module.reporting.data.encounter.evaluator.ConvertedEncounterDataEvaluatorTest
25-Oct-2019 22:40:59 Tests run: 1, Failures: 0, Errors: 0, Skipped: 0, Time elapsed: 0.105 sec
25-Oct-2019 22:40:59 Running org.openmrs.module.reporting.data.patient.evaluator.PatientIdentifierDataEvaluatorTest
25-Oct-2019 22:40:59 Tests run: 4, Failures: 0, Errors: 0, Skipped: 0, Time elapsed: 0.43 sec
25-Oct-2019 22:40:59 Running org.openmrs.module.reporting.data.converter.ListConverterTest
25-Oct-2019 22:40:59 Tests run: 6, Failures: 0, Errors: 0, Skipped: 0, Time elapsed: 0.002 sec
25-Oct-2019 22:40:59 Running org.openmrs.module.reporting.data.converter.ObsFromObsGroupConverterTest
25-Oct-2019 22:40:59 Tests run: 2, Failures: 0, Errors: 0, Skipped: 0, Time elapsed: 0.015 sec
25-Oct-2019 22:40:59 Running org.openmrs.module.reporting.common.AgeTest
25-Oct-2019 22:40:59 Tests run: 5, Failures: 0, Errors: 0, Skipped: 0, Time elapsed: 0.002 sec
25-Oct-2019 22:40:59 Running org.openmrs.module.reporting.evaluation.CachingCohortDefinitionTest
25-Oct-2019 22:40:59 Tests run: 1, Failures: 0, Errors: 0, Skipped: 0, Time elapsed: 0.094 sec
25-Oct-2019 22:40:59 Running org.openmrs.module.reporting.common.TestUtil
25-Oct-2019 22:40:59 Tests run: 1, Failures: 0, Errors: 0, Skipped: 1, Time elapsed: 0.001 sec
25-Oct-2019 22:40:59 Running org.openmrs.module.reporting.query.encounter.evaluator.CompositionEncounterQueryEvaluatorTest
25-Oct-2019 22:41:00 Tests run: 4, Failures: 0, Errors: 0, Skipped: 0, Time elapsed: 0.433 sec
25-Oct-2019 22:41:00 Running org.openmrs.module.reporting.definition.library.implementerconfigured.ImplementerConfiguredVisitDataDefinitionLibraryTest
25-Oct-2019 22:41:00 Tests run: 2, Failures: 0, Errors: 0, Skipped: 0, Time elapsed: 0.023 sec
25-Oct-2019 22:41:00 Running org.openmrs.module.reporting.common.ObjectUtilTest
25-Oct-2019 22:41:00 Tests run: 23, Failures: 0, Errors: 0, Skipped: 0, Time elapsed: 0.723 sec
25-Oct-2019 22:41:00 Running org.openmrs.module.reporting.data.person.evaluator.AgeDataEvaluatorTest
25-Oct-2019 22:41:01 Tests run: 2, Failures: 0, Errors: 0, Skipped: 0, Time elapsed: 0.3 sec
25-Oct-2019 22:41:01 Running org.openmrs.module.reporting.evaluation.querybuilder.HqlQueryBuilderTest
25-Oct-2019 22:41:05 Tests run: 39, Failures: 0, Errors: 0, Skipped: 0, Time elapsed: 4.213 sec
25-Oct-2019 22:41:05 Running org.openmrs.module.reporting.data.visit.evaluator.ObsForVisitDataEvaluatorTest
25-Oct-2019 22:41:05 Tests run: 2, Failures: 0, Errors: 0, Skipped: 0, Time elapsed: 0.285 sec
25-Oct-2019 22:41:05 Running org.openmrs.module.reporting.query.encounter.evaluator.MostRecentEncounterForPatientQueryEvaluatorTest
25-Oct-2019 22:41:05 Tests run: 1, Failures: 0, Errors: 0, Skipped: 0, Time elapsed: 0.108 sec
25-Oct-2019 22:41:05 Running org.openmrs.module.reporting.cohort.definition.evaluator.OptionalParameterCohortDefinitionEvaluatorTest
25-Oct-2019 22:41:05 Tests run: 1, Failures: 0, Errors: 0, Skipped: 0, Time elapsed: 0.139 sec
25-Oct-2019 22:41:05 Running org.openmrs.module.reporting.report.util.SqlUtilsTest
25-Oct-2019 22:41:05 Tests run: 3, Failures: 0, Errors: 0, Skipped: 0, Time elapsed: 0.002 sec
25-Oct-2019 22:41:05 Running org.openmrs.module.reporting.validator.InProgramCohortDefinitionValidatorTest
25-Oct-2019 22:41:05 Tests run: 3, Failures: 0, Errors: 0, Skipped: 0, Time elapsed: 0.033 sec
25-Oct-2019 22:41:05 Running org.openmrs.module.reporting.data.obs.evaluator.PatientToObsDataEvaluatorTest
25-Oct-2019 22:41:06 Tests run: 3, Failures: 0, Errors: 0, Skipped: 0, Time elapsed: 0.396 sec
25-Oct-2019 22:41:06 Running org.openmrs.module.reporting.definition.library.BaseDefinitionLibraryTest
25-Oct-2019 22:41:06 Tests run: 4, Failures: 0, Errors: 0, Skipped: 0, Time elapsed: 0.025 sec
25-Oct-2019 22:41:06 Running org.openmrs.module.reporting.data.person.evaluator.PersonAttributeDataEvaluatorTest
25-Oct-2019 22:41:06 Tests run: 1, Failures: 0, Errors: 0, Skipped: 0, Time elapsed: 0.101 sec
25-Oct-2019 22:41:06 Running org.openmrs.module.reporting.data.person.evaluator.PreferredNameDataEvaluatorTest
25-Oct-2019 22:41:06 Tests run: 3, Failures: 0, Errors: 0, Skipped: 0, Time elapsed: 0.292 sec
25-Oct-2019 22:41:06 Running org.openmrs.module.reporting.definition.library.implementerconfigured.ImplementerConfiguredCohortDefinitionLibraryTest
25-Oct-2019 22:41:06 Tests run: 3, Failures: 0, Errors: 0, Skipped: 0, Time elapsed: 0.14 sec
25-Oct-2019 22:41:06 Running org.openmrs.module.reporting.evaluation.parameter.ParameterUtilTest
25-Oct-2019 22:41:06 Tests run: 2, Failures: 0, Errors: 0, Skipped: 0, Time elapsed: 0.013 sec
25-Oct-2019 22:41:06 Running org.openmrs.module.reporting.data.encounter.library.BuiltInEncounterDataLibraryTest
25-Oct-2019 22:41:07 Tests run: 6, Failures: 0, Errors: 0, Skipped: 0, Time elapsed: 0.146 sec
25-Oct-2019 22:41:07 Running org.openmrs.module.reporting.cohort.definition.evaluator.ScriptedCohortDefinitionEvaluatorTest
25-Oct-2019 22:41:07 Tests run: 1, Failures: 0, Errors: 0, Skipped: 0, Time elapsed: 0.106 sec
25-Oct-2019 22:41:07 Running org.openmrs.module.reporting.data.converter.PersonNameConverterTest
25-Oct-2019 22:41:07 Tests run: 1, Failures: 0, Errors: 0, Skipped: 0, Time elapsed: 0.025 sec
25-Oct-2019 22:41:07 Running org.openmrs.module.reporting.definition.library.AllDefinitionLibrariesComponentTest
25-Oct-2019 22:41:07 Tests run: 2, Failures: 0, Errors: 0, Skipped: 0, Time elapsed: 0.029 sec
25-Oct-2019 22:41:07 Running org.openmrs.module.reporting.data.person.evaluator.VitalStatusDataEvaluatorTest
25-Oct-2019 22:41:07 Tests run: 1, Failures: 0, Errors: 0, Skipped: 0, Time elapsed: 0.118 sec
25-Oct-2019 22:41:07 Running org.openmrs.module.reporting.dataset.definition.evaluator.PatientDataSetEvaluatorTest
25-Oct-2019 22:41:08 Tests run: 8, Failures: 0, Errors: 0, Skipped: 0, Time elapsed: 0.958 sec
25-Oct-2019 22:41:08 Running org.openmrs.module.reporting.cohort.definition.evaluator.TextObsCohortDefinitionEvaluatorTest
25-Oct-2019 22:41:08 Tests run: 2, Failures: 0, Errors: 0, Skipped: 0, Time elapsed: 0.22 sec
25-Oct-2019 22:41:08 Running org.openmrs.module.reporting.data.encounter.evaluator.AuditInfoEncounterDataEvaluatorTest
25-Oct-2019 22:41:08 Tests run: 1, Failures: 0, Errors: 0, Skipped: 0, Time elapsed: 0.029 sec
25-Oct-2019 22:41:08 Running org.openmrs.module.reporting.data.patient.evaluator.LogicDataEvaluatorTest
25-Oct-2019 22:41:08 Tests run: 1, Failures: 0, Errors: 0, Skipped: 1, Time elapsed: 0 sec
25-Oct-2019 22:41:08 Running org.openmrs.module.reporting.data.visit.evaluator.PersonToVisitDataEvaluatorTest
25-Oct-2019 22:41:08 Tests run: 3, Failures: 0, Errors: 0, Skipped: 0, Time elapsed: 0.305 sec
25-Oct-2019 22:41:08 Running org.openmrs.module.reporting.cohort.definition.evaluator.DateObsCohortDefinitionEvaluatorTest
25-Oct-2019 22:41:09 Tests run: 3, Failures: 0, Errors: 0, Skipped: 0, Time elapsed: 0.335 sec
25-Oct-2019 22:41:09 Running org.openmrs.module.reporting.cohort.definition.evaluator.VisitCohortDefinitionEvaluatorTest
25-Oct-2019 22:41:09 Tests run: 13, Failures: 0, Errors: 0, Skipped: 0, Time elapsed: 0.185 sec
25-Oct-2019 22:41:09 Running org.openmrs.module.reporting.data.encounter.evaluator.AgeAtEncounterDataEvaluatorTest
25-Oct-2019 22:41:09 Tests run: 1, Failures: 0, Errors: 0, Skipped: 0, Time elapsed: 0.116 sec
25-Oct-2019 22:41:09 Running org.openmrs.module.reporting.indicator.CohortIndicatorDataSetEvaluatorTest
25-Oct-2019 22:41:09 Tests run: 1, Failures: 0, Errors: 0, Skipped: 0, Time elapsed: 0.178 sec
25-Oct-2019 22:41:09 Running org.openmrs.module.reporting.data.person.evaluator.ObsActiveListPersonDataEvaluatorTest
25-Oct-2019 22:41:09 Tests run: 1, Failures: 0, Errors: 0, Skipped: 0, Time elapsed: 0.127 sec
25-Oct-2019 22:41:09 Running org.openmrs.module.reporting.common.ExcelUtilTest
25-Oct-2019 22:41:10 Tests run: 5, Failures: 0, Errors: 0, Skipped: 0, Time elapsed: 0.262 sec
25-Oct-2019 22:41:10 Running org.openmrs.module.reporting.data.obs.evaluator.GroupMemberObsDataEvaluatorTest
25-Oct-2019 22:41:10 Tests run: 5, Failures: 0, Errors: 0, Skipped: 2, Time elapsed: 0.388 sec
25-Oct-2019 22:41:10 Running org.openmrs.module.reporting.query.visit.evaluator.BasicVisitQueryEvaluatorTest
25-Oct-2019 22:41:10 Tests run: 3, Failures: 0, Errors: 0, Skipped: 0, Time elapsed: 0.459 sec
25-Oct-2019 22:41:10 Running org.openmrs.module.reporting.common.ExcelBuilderTest
25-Oct-2019 22:41:14 Tests run: 3, Failures: 0, Errors: 0, Skipped: 0, Time elapsed: 3.972 sec
25-Oct-2019 22:41:14 Running org.openmrs.module.reporting.query.obs.evaluator.AllObsQueryEvaluatorTest
25-Oct-2019 22:41:15 Tests run: 5, Failures: 0, Errors: 0, Skipped: 0, Time elapsed: 0.609 sec
25-Oct-2019 22:41:15 Running org.openmrs.module.reporting.cohort.definition.evaluator.AllPatientsCohortDefinitionEvaluatorTest
25-Oct-2019 22:41:15 Tests run: 1, Failures: 0, Errors: 0, Skipped: 0, Time elapsed: 0.103 sec
25-Oct-2019 22:41:15 Running org.openmrs.module.reporting.data.encounter.evaluator.SimultaneousEncountersDataEvaluatorTest
25-Oct-2019 22:41:15 Tests run: 2, Failures: 0, Errors: 0, Skipped: 0, Time elapsed: 0.073 sec
25-Oct-2019 22:41:15 Running org.openmrs.module.reporting.validator.ProgramEnrollmentCohortDefinitionValidatorTest
25-Oct-2019 22:41:15 Tests run: 3, Failures: 0, Errors: 0, Skipped: 0, Time elapsed: 0.031 sec
25-Oct-2019 22:41:15 Running org.openmrs.module.reporting.evaluation.EvaluationContextTest
25-Oct-2019 22:41:15 Tests run: 4, Failures: 0, Errors: 0, Skipped: 0, Time elapsed: 0.04 sec
25-Oct-2019 22:41:15 Running org.openmrs.module.reporting.data.patient.evaluator.PreferredIdentifierDataEvaluatorTest
25-Oct-2019 22:41:15 Tests run: 2, Failures: 0, Errors: 0, Skipped: 0, Time elapsed: 0.217 sec
25-Oct-2019 22:41:15 Running org.openmrs.module.reporting.data.encounter.evaluator.EncounterVisitDataEvaluatorTest
25-Oct-2019 22:41:16 Tests run: 1, Failures: 0, Errors: 0, Skipped: 0, Time elapsed: 0.118 sec
25-Oct-2019 22:41:16 Running org.openmrs.module.reporting.query.obs.service.ObsQueryServiceImplTest
25-Oct-2019 22:41:16 Tests run: 2, Failures: 0, Errors: 0, Skipped: 1, Time elapsed: 0.113 sec
25-Oct-2019 22:41:16 Running org.openmrs.module.reporting.data.patient.library.BuiltInPatientDataLibraryTest
25-Oct-2019 22:41:16 Tests run: 4, Failures: 0, Errors: 0, Skipped: 0, Time elapsed: 0.056 sec
25-Oct-2019 22:41:16 Running org.openmrs.module.reporting.indicator.util.IndicatorUtilTest
25-Oct-2019 22:41:16 Tests run: 1, Failures: 0, Errors: 0, Skipped: 0, Time elapsed: 0.002 sec
25-Oct-2019 22:41:16 Running org.openmrs.module.reporting.cohort.definition.evaluator.EvaluatableCohortDefinitionEvaluatorTest
25-Oct-2019 22:41:16 Tests run: 1, Failures: 0, Errors: 0, Skipped: 0, Time elapsed: 0.009 sec
25-Oct-2019 22:41:16 Running org.openmrs.module.reporting.data.patient.evaluator.ConvertedPatientDataEvaluatorTest
25-Oct-2019 22:41:16 Tests run: 2, Failures: 0, Errors: 0, Skipped: 0, Time elapsed: 0.227 sec
25-Oct-2019 22:41:16 Running org.openmrs.module.reporting.cohort.definition.evaluator.CompositionCohortDefinitionEvaluatorTest
25-Oct-2019 22:41:16 Tests run: 4, Failures: 0, Errors: 0, Skipped: 0, Time elapsed: 0.432 sec
25-Oct-2019 22:41:16 Running org.openmrs.module.reporting.data.converter.MapConverterTest
25-Oct-2019 22:41:16 Tests run: 5, Failures: 0, Errors: 0, Skipped: 0, Time elapsed: 0.003 sec
25-Oct-2019 22:41:16 Running org.openmrs.module.reporting.data.patient.evaluator.EncountersForPatientDataEvaluatorTest
25-Oct-2019 22:41:17 Tests run: 1, Failures: 0, Errors: 0, Skipped: 0, Time elapsed: 0.176 sec
25-Oct-2019 22:41:17 Running org.openmrs.module.reporting.indicator.SqlIndicatorTest
25-Oct-2019 22:41:17 ERROR - EvaluationProfiler.log(111) |2019-10-25 22:41:17,592| 1336        2019-10-25 22:41:17.592        >        ERROR        EVALUATING_DEFINITION                        SqlIndicator[sql=SELECT distinct(.222) as res, 33 as res2 from patient]: Failed to evaluate sql because:
25-Oct-2019 22:41:17 Unable to evaluate to a single value. Exactly one column must be defined.
25-Oct-2019 22:41:17 org.openmrs.module.reporting.evaluation.EvaluationException: Failed to evaluate sql because:
25-Oct-2019 22:41:17 Unable to evaluate to a single value. Exactly one column must be defined.
25-Oct-2019 22:41:17         at org.openmrs.module.reporting.indicator.evaluator.SqlIndicatorEvaluator.evaluateSql(SqlIndicatorEvaluator.java:57)
25-Oct-2019 22:41:17         at org.openmrs.module.reporting.indicator.evaluator.SqlIndicatorEvaluator.evaluate(SqlIndicatorEvaluator.java:41)
25-Oct-2019 22:41:17         at org.openmrs.module.reporting.indicator.evaluator.SqlIndicatorEvaluator.evaluate(SqlIndicatorEvaluator.java:28)
25-Oct-2019 22:41:17         at org.openmrs.module.reporting.definition.service.BaseDefinitionService.executeEvaluator(BaseDefinitionService.java:369)
25-Oct-2019 22:41:17         at org.openmrs.module.reporting.definition.service.BaseDefinitionService.evaluateBypassingExclusionOfTestPatients(BaseDefinitionService.java:264)
25-Oct-2019 22:41:17         at org.openmrs.module.reporting.definition.service.BaseDefinitionService.evaluate(BaseDefinitionService.java:229)
25-Oct-2019 22:41:17         at org.openmrs.module.reporting.indicator.service.IndicatorServiceImpl.evaluate(IndicatorServiceImpl.java:41)
25-Oct-2019 22:41:17         at sun.reflect.NativeMethodAccessorImpl.invoke0(Native Method)
25-Oct-2019 22:41:17         at sun.reflect.NativeMethodAccessorImpl.invoke(NativeMethodAccessorImpl.java:62)
25-Oct-2019 22:41:17         at sun.reflect.DelegatingMethodAccessorImpl.invoke(DelegatingMethodAccessorImpl.java:43)
25-Oct-2019 22:41:17         at java.lang.reflect.Method.invoke(Method.java:498)
25-Oct-2019 22:41:17         at org.springframework.aop.support.AopUtils.invokeJoinpointUsingReflection(AopUtils.java:317)
25-Oct-2019 22:41:17         at org.springframework.aop.framework.ReflectiveMethodInvocation.invokeJoinpoint(ReflectiveMethodInvocation.java:183)
25-Oct-2019 22:41:17         at org.springframework.aop.framework.ReflectiveMethodInvocation.proceed(ReflectiveMethodInvocation.java:150)
25-Oct-2019 22:41:17         at org.openmrs.aop.LoggingAdvice.invoke(LoggingAdvice.java:121)
25-Oct-2019 22:41:17         at org.springframework.aop.framework.ReflectiveMethodInvocation.proceed(ReflectiveMethodInvocation.java:172)
25-Oct-2019 22:41:17         at org.springframework.aop.framework.adapter.MethodBeforeAdviceInterceptor.invoke(MethodBeforeAdviceInterceptor.java:51)
25-Oct-2019 22:41:17         at org.springframework.aop.framework.ReflectiveMethodInvocation.proceed(ReflectiveMethodInvocation.java:172)
25-Oct-2019 22:41:17         at org.springframework.aop.framework.adapter.MethodBeforeAdviceInterceptor.invoke(MethodBeforeAdviceInterceptor.java:51)
25-Oct-2019 22:41:17         at org.springframework.aop.framework.ReflectiveMethodInvocation.proceed(ReflectiveMethodInvocation.java:172)
25-Oct-2019 22:41:17         at org.springframework.aop.framework.JdkDynamicAopProxy.invoke(JdkDynamicAopProxy.java:204)
25-Oct-2019 22:41:17         at com.sun.proxy.$Proxy39.evaluate(Unknown Source)
25-Oct-2019 22:41:17         at sun.reflect.NativeMethodAccessorImpl.invoke0(Native Method)
25-Oct-2019 22:41:17         at sun.reflect.NativeMethodAccessorImpl.invoke(NativeMethodAccessorImpl.java:62)
25-Oct-2019 22:41:17         at sun.reflect.DelegatingMethodAccessorImpl.invoke(DelegatingMethodAccessorImpl.java:43)
25-Oct-2019 22:41:17         at java.lang.reflect.Method.invoke(Method.java:498)
25-Oct-2019 22:41:17         at org.springframework.aop.support.AopUtils.invokeJoinpointUsingReflection(AopUtils.java:317)
25-Oct-2019 22:41:17         at org.springframework.aop.framework.JdkDynamicAopProxy.invoke(JdkDynamicAopProxy.java:198)
25-Oct-2019 22:41:17         at com.sun.proxy.$Proxy168.evaluate(Unknown Source)
25-Oct-2019 22:41:17         at org.openmrs.module.reporting.indicator.SqlIndicatorTest.assertIndicatorValue(SqlIndicatorTest.java:94)
25-Oct-2019 22:41:17         at org.openmrs.module.reporting.indicator.SqlIndicatorTest.assertIndicatorValue(SqlIndicatorTest.java:103)
25-Oct-2019 22:41:17         at org.openmrs.module.reporting.indicator.SqlIndicatorTest.assertIndicatorValue(SqlIndicatorTest.java:114)
25-Oct-2019 22:41:17         at org.openmrs.module.reporting.indicator.SqlIndicatorTest.assertIndicatorValue(SqlIndicatorTest.java:107)
25-Oct-2019 22:41:17         at org.openmrs.module.reporting.indicator.SqlIndicatorTest.sqlIndicator_shouldNotAllowQueriesThatReturnMoreThanOneColumn(SqlIndicatorTest.java:85)
25-Oct-2019 22:41:17         at sun.reflect.NativeMethodAccessorImpl.invoke0(Native Method)
25-Oct-2019 22:41:17         at sun.reflect.NativeMethodAccessorImpl.invoke(NativeMethodAccessorImpl.java:62)
25-Oct-2019 22:41:17         at sun.reflect.DelegatingMethodAccessorImpl.invoke(DelegatingMethodAccessorImpl.java:43)
25-Oct-2019 22:41:17         at java.lang.reflect.Method.invoke(Method.java:498)
25-Oct-2019 22:41:17         at org.junit.runners.model.FrameworkMethod$1.runReflectiveCall(FrameworkMethod.java:47)
25-Oct-2019 22:41:17         at org.junit.internal.runners.model.ReflectiveCallable.run(ReflectiveCallable.java:12)
25-Oct-2019 22:41:17         at org.junit.runners.model.FrameworkMethod.invokeExplosively(FrameworkMethod.java:44)
25-Oct-2019 22:41:17         at org.junit.internal.runners.statements.InvokeMethod.evaluate(InvokeMethod.java:17)
25-Oct-2019 22:41:17         at org.junit.internal.runners.statements.ExpectException.evaluate(ExpectException.java:19)
25-Oct-2019 22:41:17         at org.junit.internal.runners.statements.RunBefores.evaluate(RunBefores.java:26)
25-Oct-2019 22:41:17         at org.springframework.test.context.junit4.statements.RunBeforeTestMethodCallbacks.evaluate(RunBeforeTestMethodCallbacks.java:74)
25-Oct-2019 22:41:17         at org.junit.internal.runners.statements.RunAfters.evaluate(RunAfters.java:27)
25-Oct-2019 22:41:17         at org.springframework.test.context.junit4.statements.RunAfterTestMethodCallbacks.evaluate(RunAfterTestMethodCallbacks.java:83)
25-Oct-2019 22:41:17         at org.springframework.test.context.junit4.statements.SpringRepeat.evaluate(SpringRepeat.java:72)
25-Oct-2019 22:41:17         at org.springframework.test.context.junit4.SpringJUnit4ClassRunner.runChild(SpringJUnit4ClassRunner.java:231)
25-Oct-2019 22:41:17         at org.springframework.test.context.junit4.SpringJUnit4ClassRunner.runChild(SpringJUnit4ClassRunner.java:88)
25-Oct-2019 22:41:17         at org.junit.runners.ParentRunner$3.run(ParentRunner.java:238)
25-Oct-2019 22:41:17         at org.junit.runners.ParentRunner$1.schedule(ParentRunner.java:63)
25-Oct-2019 22:41:17         at org.junit.runners.ParentRunner.runChildren(ParentRunner.java:236)
25-Oct-2019 22:41:17         at org.junit.runners.ParentRunner.access$000(ParentRunner.java:53)
25-Oct-2019 22:41:17         at org.junit.runners.ParentRunner$2.evaluate(ParentRunner.java:229)
25-Oct-2019 22:41:17         at org.springframework.test.context.junit4.statements.RunBeforeTestClassCallbacks.evaluate(RunBeforeTestClassCallbacks.java:61)
25-Oct-2019 22:41:17         at org.junit.internal.runners.statements.RunAfters.evaluate(RunAfters.java:27)
25-Oct-2019 22:41:17         at org.springframework.test.context.junit4.statements.RunAfterTestClassCallbacks.evaluate(RunAfterTestClassCallbacks.java:71)
25-Oct-2019 22:41:17         at org.junit.runners.ParentRunner.run(ParentRunner.java:309)
25-Oct-2019 22:41:17         at org.springframework.test.context.junit4.SpringJUnit4ClassRunner.run(SpringJUnit4ClassRunner.java:174)
25-Oct-2019 22:41:17         at org.apache.maven.surefire.junit4.JUnit4TestSet.execute(JUnit4TestSet.java:59)
25-Oct-2019 22:41:17         at org.apache.maven.surefire.suite.AbstractDirectoryTestSuite.executeTestSet(AbstractDirectoryTestSuite.java:115)
25-Oct-2019 22:41:17         at org.apache.maven.surefire.suite.AbstractDirectoryTestSuite.execute(AbstractDirectoryTestSuite.java:102)
25-Oct-2019 22:41:17         at org.apache.maven.surefire.Surefire.run(Surefire.java:180)
25-Oct-2019 22:41:17         at sun.reflect.NativeMethodAccessorImpl.invoke0(Native Method)
25-Oct-2019 22:41:17         at sun.reflect.NativeMethodAccessorImpl.invoke(NativeMethodAccessorImpl.java:62)
25-Oct-2019 22:41:17         at sun.reflect.DelegatingMethodAccessorImpl.invoke(DelegatingMethodAccessorImpl.java:43)
25-Oct-2019 22:41:17         at java.lang.reflect.Method.invoke(Method.java:498)
25-Oct-2019 22:41:17         at org.apache.maven.surefire.booter.SurefireBooter.runSuitesInProcess(SurefireBooter.java:350)
25-Oct-2019 22:41:17         at org.apache.maven.surefire.booter.SurefireBooter.main(SurefireBooter.java:1021)
25-Oct-2019 22:41:17 Caused by: java.lang.IllegalArgumentException: Unable to evaluate to a single value. Exactly one column must be defined.
25-Oct-2019 22:41:17         at org.openmrs.module.reporting.evaluation.service.EvaluationServiceImpl.evaluateToObject(EvaluationServiceImpl.java:90)
25-Oct-2019 22:41:17         at sun.reflect.NativeMethodAccessorImpl.invoke0(Native Method)
25-Oct-2019 22:41:17         at sun.reflect.NativeMethodAccessorImpl.invoke(NativeMethodAccessorImpl.java:62)
25-Oct-2019 22:41:17         at sun.reflect.DelegatingMethodAccessorImpl.invoke(DelegatingMethodAccessorImpl.java:43)
25-Oct-2019 22:41:17         at java.lang.reflect.Method.invoke(Method.java:498)
25-Oct-2019 22:41:17         at org.springframework.aop.support.AopUtils.invokeJoinpointUsingReflection(AopUtils.java:317)
25-Oct-2019 22:41:17         at org.springframework.aop.framework.ReflectiveMethodInvocation.invokeJoinpoint(ReflectiveMethodInvocation.java:183)
25-Oct-2019 22:41:17         at org.springframework.aop.framework.ReflectiveMethodInvocation.proceed(ReflectiveMethodInvocation.java:150)
25-Oct-2019 22:41:17         at org.springframework.transaction.interceptor.TransactionInterceptor$1.proceedWithInvocation(TransactionInterceptor.java:96)
25-Oct-2019 22:41:17         at org.springframework.transaction.interceptor.TransactionAspectSupport.invokeWithinTransaction(TransactionAspectSupport.java:260)
25-Oct-2019 22:41:17         at org.springframework.transaction.interceptor.TransactionInterceptor.invoke(TransactionInterceptor.java:94)
25-Oct-2019 22:41:17         at org.springframework.aop.framework.ReflectiveMethodInvocation.proceed(ReflectiveMethodInvocation.java:172)
25-Oct-2019 22:41:17         at org.openmrs.aop.LoggingAdvice.invoke(LoggingAdvice.java:121)
25-Oct-2019 22:41:17         at org.springframework.aop.framework.ReflectiveMethodInvocation.proceed(ReflectiveMethodInvocation.java:172)
25-Oct-2019 22:41:17         at org.springframework.aop.framework.adapter.MethodBeforeAdviceInterceptor.invoke(MethodBeforeAdviceInterceptor.java:51)
25-Oct-2019 22:41:17         at org.springframework.aop.framework.ReflectiveMethodInvocation.proceed(ReflectiveMethodInvocation.java:172)
25-Oct-2019 22:41:17         at org.springframework.aop.framework.adapter.MethodBeforeAdviceInterceptor.invoke(MethodBeforeAdviceInterceptor.java:51)
25-Oct-2019 22:41:17         at org.springframework.aop.framework.ReflectiveMethodInvocation.proceed(ReflectiveMethodInvocation.java:172)
25-Oct-2019 22:41:17         at org.springframework.aop.framework.JdkDynamicAopProxy.invoke(JdkDynamicAopProxy.java:204)
25-Oct-2019 22:41:17         at com.sun.proxy.$Proxy26.evaluateToObject(Unknown Source)
25-Oct-2019 22:41:17         at sun.reflect.NativeMethodAccessorImpl.invoke0(Native Method)
25-Oct-2019 22:41:17         at sun.reflect.NativeMethodAccessorImpl.invoke(NativeMethodAccessorImpl.java:62)
25-Oct-2019 22:41:17         at sun.reflect.DelegatingMethodAccessorImpl.invoke(DelegatingMethodAccessorImpl.java:43)
25-Oct-2019 22:41:17         at java.lang.reflect.Method.invoke(Method.java:498)
25-Oct-2019 22:41:17         at org.springframework.aop.support.AopUtils.invokeJoinpointUsingReflection(AopUtils.java:317)
25-Oct-2019 22:41:17         at org.springframework.aop.framework.ReflectiveMethodInvocation.invokeJoinpoint(ReflectiveMethodInvocation.java:183)
25-Oct-2019 22:41:17         at org.springframework.aop.framework.ReflectiveMethodInvocation.proceed(ReflectiveMethodInvocation.java:150)
25-Oct-2019 22:41:17         at org.springframework.transaction.interceptor.TransactionInterceptor$1.proceedWithInvocation(TransactionInterceptor.java:96)
25-Oct-2019 22:41:17         at org.springframework.transaction.interceptor.TransactionAspectSupport.invokeWithinTransaction(TransactionAspectSupport.java:260)
25-Oct-2019 22:41:17         at org.springframework.transaction.interceptor.TransactionInterceptor.invoke(TransactionInterceptor.java:94)
25-Oct-2019 22:41:17         at org.springframework.aop.framework.ReflectiveMethodInvocation.proceed(ReflectiveMethodInvocation.java:172)
25-Oct-2019 22:41:17         at org.springframework.aop.framework.JdkDynamicAopProxy.invoke(JdkDynamicAopProxy.java:204)
25-Oct-2019 22:41:17         at com.sun.proxy.$Proxy145.evaluateToObject(Unknown Source)
25-Oct-2019 22:41:17         at org.openmrs.module.reporting.indicator.evaluator.SqlIndicatorEvaluator.evaluateSql(SqlIndicatorEvaluator.java:54)
25-Oct-2019 22:41:17         ... 69 more
25-Oct-2019 22:41:17 ERROR - EvaluationProfiler.log(111) |2019-10-25 22:41:17,903| 1344        2019-10-25 22:41:17.903        >        ERROR        EVALUATING_DEFINITION                        SqlIndicator[sql=SELECT person_id from person]: Failed to evaluate sql because:
25-Oct-2019 22:41:17 Unable to evaluate to a single value. Exactly one row must be returned by query.
25-Oct-2019 22:41:17 org.openmrs.module.reporting.evaluation.EvaluationException: Failed to evaluate sql because:
25-Oct-2019 22:41:17 Unable to evaluate to a single value. Exactly one row must be returned by query.
25-Oct-2019 22:41:17         at org.openmrs.module.reporting.indicator.evaluator.SqlIndicatorEvaluator.evaluateSql(SqlIndicatorEvaluator.java:57)
25-Oct-2019 22:41:17         at org.openmrs.module.reporting.indicator.evaluator.SqlIndicatorEvaluator.evaluate(SqlIndicatorEvaluator.java:41)
25-Oct-2019 22:41:17         at org.openmrs.module.reporting.indicator.evaluator.SqlIndicatorEvaluator.evaluate(SqlIndicatorEvaluator.java:28)
25-Oct-2019 22:41:17         at org.openmrs.module.reporting.definition.service.BaseDefinitionService.executeEvaluator(BaseDefinitionService.java:369)
25-Oct-2019 22:41:17         at org.openmrs.module.reporting.definition.service.BaseDefinitionService.evaluateBypassingExclusionOfTestPatients(BaseDefinitionService.java:264)
25-Oct-2019 22:41:17         at org.openmrs.module.reporting.definition.service.BaseDefinitionService.evaluate(BaseDefinitionService.java:229)
25-Oct-2019 22:41:17         at org.openmrs.module.reporting.indicator.service.IndicatorServiceImpl.evaluate(IndicatorServiceImpl.java:41)
25-Oct-2019 22:41:17         at sun.reflect.GeneratedMethodAccessor1081.invoke(Unknown Source)
25-Oct-2019 22:41:17         at sun.reflect.DelegatingMethodAccessorImpl.invoke(DelegatingMethodAccessorImpl.java:43)
25-Oct-2019 22:41:17         at java.lang.reflect.Method.invoke(Method.java:498)
25-Oct-2019 22:41:17         at org.springframework.aop.support.AopUtils.invokeJoinpointUsingReflection(AopUtils.java:317)
25-Oct-2019 22:41:17         at org.springframework.aop.framework.ReflectiveMethodInvocation.invokeJoinpoint(ReflectiveMethodInvocation.java:183)
25-Oct-2019 22:41:17         at org.springframework.aop.framework.ReflectiveMethodInvocation.proceed(ReflectiveMethodInvocation.java:150)
25-Oct-2019 22:41:17         at org.openmrs.aop.LoggingAdvice.invoke(LoggingAdvice.java:121)
25-Oct-2019 22:41:17         at org.springframework.aop.framework.ReflectiveMethodInvocation.proceed(ReflectiveMethodInvocation.java:172)
25-Oct-2019 22:41:17         at org.springframework.aop.framework.adapter.MethodBeforeAdviceInterceptor.invoke(MethodBeforeAdviceInterceptor.java:51)
25-Oct-2019 22:41:17         at org.springframework.aop.framework.ReflectiveMethodInvocation.proceed(ReflectiveMethodInvocation.java:172)
25-Oct-2019 22:41:17         at org.springframework.aop.framework.adapter.MethodBeforeAdviceInterceptor.invoke(MethodBeforeAdviceInterceptor.java:51)
25-Oct-2019 22:41:17         at org.springframework.aop.framework.ReflectiveMethodInvocation.proceed(ReflectiveMethodInvocation.java:172)
25-Oct-2019 22:41:17         at org.springframework.aop.framework.JdkDynamicAopProxy.invoke(JdkDynamicAopProxy.java:204)
25-Oct-2019 22:41:17         at com.sun.proxy.$Proxy39.evaluate(Unknown Source)
25-Oct-2019 22:41:17         at sun.reflect.GeneratedMethodAccessor1081.invoke(Unknown Source)
25-Oct-2019 22:41:17         at sun.reflect.DelegatingMethodAccessorImpl.invoke(DelegatingMethodAccessorImpl.java:43)
25-Oct-2019 22:41:17         at java.lang.reflect.Method.invoke(Method.java:498)
25-Oct-2019 22:41:17         at org.springframework.aop.support.AopUtils.invokeJoinpointUsingReflection(AopUtils.java:317)
25-Oct-2019 22:41:17         at org.springframework.aop.framework.JdkDynamicAopProxy.invoke(JdkDynamicAopProxy.java:198)
25-Oct-2019 22:41:17         at com.sun.proxy.$Proxy168.evaluate(Unknown Source)
25-Oct-2019 22:41:17         at org.openmrs.module.reporting.indicator.SqlIndicatorTest.assertIndicatorValue(SqlIndicatorTest.java:94)
25-Oct-2019 22:41:17         at org.openmrs.module.reporting.indicator.SqlIndicatorTest.assertIndicatorValue(SqlIndicatorTest.java:103)
25-Oct-2019 22:41:17         at org.openmrs.module.reporting.indicator.SqlIndicatorTest.assertIndicatorValue(SqlIndicatorTest.java:114)
25-Oct-2019 22:41:17         at org.openmrs.module.reporting.indicator.SqlIndicatorTest.assertIndicatorValue(SqlIndicatorTest.java:107)
25-Oct-2019 22:41:17         at org.openmrs.module.reporting.indicator.SqlIndicatorTest.sqlIndicator_shouldNotAllowQueriesThatReturnMoreThanOneRow(SqlIndicatorTest.java:90)
25-Oct-2019 22:41:17         at sun.reflect.NativeMethodAccessorImpl.invoke0(Native Method)
25-Oct-2019 22:41:17         at sun.reflect.NativeMethodAccessorImpl.invoke(NativeMethodAccessorImpl.java:62)
25-Oct-2019 22:41:17         at sun.reflect.DelegatingMethodAccessorImpl.invoke(DelegatingMethodAccessorImpl.java:43)
25-Oct-2019 22:41:17         at java.lang.reflect.Method.invoke(Method.java:498)
25-Oct-2019 22:41:17         at org.junit.runners.model.FrameworkMethod$1.runReflectiveCall(FrameworkMethod.java:47)
25-Oct-2019 22:41:17         at org.junit.internal.runners.model.ReflectiveCallable.run(ReflectiveCallable.java:12)
25-Oct-2019 22:41:17         at org.junit.runners.model.FrameworkMethod.invokeExplosively(FrameworkMethod.java:44)
25-Oct-2019 22:41:17         at org.junit.internal.runners.statements.InvokeMethod.evaluate(InvokeMethod.java:17)
25-Oct-2019 22:41:17         at org.junit.internal.runners.statements.ExpectException.evaluate(ExpectException.java:19)
25-Oct-2019 22:41:17         at org.junit.internal.runners.statements.RunBefores.evaluate(RunBefores.java:26)
25-Oct-2019 22:41:17         at org.springframework.test.context.junit4.statements.RunBeforeTestMethodCallbacks.evaluate(RunBeforeTestMethodCallbacks.java:74)
25-Oct-2019 22:41:17         at org.junit.internal.runners.statements.RunAfters.evaluate(RunAfters.java:27)
25-Oct-2019 22:41:17         at org.springframework.test.context.junit4.statements.RunAfterTestMethodCallbacks.evaluate(RunAfterTestMethodCallbacks.java:83)
25-Oct-2019 22:41:17         at org.springframework.test.context.junit4.statements.SpringRepeat.evaluate(SpringRepeat.java:72)
25-Oct-2019 22:41:17         at org.springframework.test.context.junit4.SpringJUnit4ClassRunner.runChild(SpringJUnit4ClassRunner.java:231)
25-Oct-2019 22:41:17         at org.springframework.test.context.junit4.SpringJUnit4ClassRunner.runChild(SpringJUnit4ClassRunner.java:88)
25-Oct-2019 22:41:17         at org.junit.runners.ParentRunner$3.run(ParentRunner.java:238)
25-Oct-2019 22:41:17         at org.junit.runners.ParentRunner$1.schedule(ParentRunner.java:63)
25-Oct-2019 22:41:17         at org.junit.runners.ParentRunner.runChildren(ParentRunner.java:236)
25-Oct-2019 22:41:17         at org.junit.runners.ParentRunner.access$000(ParentRunner.java:53)
25-Oct-2019 22:41:17         at org.junit.runners.ParentRunner$2.evaluate(ParentRunner.java:229)
25-Oct-2019 22:41:17         at org.springframework.test.context.junit4.statements.RunBeforeTestClassCallbacks.evaluate(RunBeforeTestClassCallbacks.java:61)
25-Oct-2019 22:41:17         at org.junit.internal.runners.statements.RunAfters.evaluate(RunAfters.java:27)
25-Oct-2019 22:41:17         at org.springframework.test.context.junit4.statements.RunAfterTestClassCallbacks.evaluate(RunAfterTestClassCallbacks.java:71)
25-Oct-2019 22:41:17         at org.junit.runners.ParentRunner.run(ParentRunner.java:309)
25-Oct-2019 22:41:17         at org.springframework.test.context.junit4.SpringJUnit4ClassRunner.run(SpringJUnit4ClassRunner.java:174)
25-Oct-2019 22:41:17         at org.apache.maven.surefire.junit4.JUnit4TestSet.execute(JUnit4TestSet.java:59)
25-Oct-2019 22:41:17         at org.apache.maven.surefire.suite.AbstractDirectoryTestSuite.executeTestSet(AbstractDirectoryTestSuite.java:115)
25-Oct-2019 22:41:17         at org.apache.maven.surefire.suite.AbstractDirectoryTestSuite.execute(AbstractDirectoryTestSuite.java:102)
25-Oct-2019 22:41:17         at org.apache.maven.surefire.Surefire.run(Surefire.java:180)
25-Oct-2019 22:41:17         at sun.reflect.NativeMethodAccessorImpl.invoke0(Native Method)
25-Oct-2019 22:41:17         at sun.reflect.NativeMethodAccessorImpl.invoke(NativeMethodAccessorImpl.java:62)
25-Oct-2019 22:41:17         at sun.reflect.DelegatingMethodAccessorImpl.invoke(DelegatingMethodAccessorImpl.java:43)
25-Oct-2019 22:41:17         at java.lang.reflect.Method.invoke(Method.java:498)
25-Oct-2019 22:41:17         at org.apache.maven.surefire.booter.SurefireBooter.runSuitesInProcess(SurefireBooter.java:350)
25-Oct-2019 22:41:17         at org.apache.maven.surefire.booter.SurefireBooter.main(SurefireBooter.java:1021)
25-Oct-2019 22:41:17 Caused by: java.lang.IllegalArgumentException: Unable to evaluate to a single value. Exactly one row must be returned by query.
25-Oct-2019 22:41:17         at org.openmrs.module.reporting.evaluation.service.EvaluationServiceImpl.evaluateToObject(EvaluationServiceImpl.java:86)
25-Oct-2019 22:41:17         at sun.reflect.GeneratedMethodAccessor1084.invoke(Unknown Source)
25-Oct-2019 22:41:17         at sun.reflect.DelegatingMethodAccessorImpl.invoke(DelegatingMethodAccessorImpl.java:43)
25-Oct-2019 22:41:17         at java.lang.reflect.Method.invoke(Method.java:498)
25-Oct-2019 22:41:17         at org.springframework.aop.support.AopUtils.invokeJoinpointUsingReflection(AopUtils.java:317)
25-Oct-2019 22:41:17         at org.springframework.aop.framework.ReflectiveMethodInvocation.invokeJoinpoint(ReflectiveMethodInvocation.java:183)
25-Oct-2019 22:41:17         at org.springframework.aop.framework.ReflectiveMethodInvocation.proceed(ReflectiveMethodInvocation.java:150)
25-Oct-2019 22:41:17         at org.springframework.transaction.interceptor.TransactionInterceptor$1.proceedWithInvocation(TransactionInterceptor.java:96)
25-Oct-2019 22:41:17         at org.springframework.transaction.interceptor.TransactionAspectSupport.invokeWithinTransaction(TransactionAspectSupport.java:260)
25-Oct-2019 22:41:17         at org.springframework.transaction.interceptor.TransactionInterceptor.invoke(TransactionInterceptor.java:94)
25-Oct-2019 22:41:17         at org.springframework.aop.framework.ReflectiveMethodInvocation.proceed(ReflectiveMethodInvocation.java:172)
25-Oct-2019 22:41:17         at org.openmrs.aop.LoggingAdvice.invoke(LoggingAdvice.java:121)
25-Oct-2019 22:41:17         at org.springframework.aop.framework.ReflectiveMethodInvocation.proceed(ReflectiveMethodInvocation.java:172)
25-Oct-2019 22:41:17         at org.springframework.aop.framework.adapter.MethodBeforeAdviceInterceptor.invoke(MethodBeforeAdviceInterceptor.java:51)
25-Oct-2019 22:41:17         at org.springframework.aop.framework.ReflectiveMethodInvocation.proceed(ReflectiveMethodInvocation.java:172)
25-Oct-2019 22:41:17         at org.springframework.aop.framework.adapter.MethodBeforeAdviceInterceptor.invoke(MethodBeforeAdviceInterceptor.java:51)
25-Oct-2019 22:41:17         at org.springframework.aop.framework.ReflectiveMethodInvocation.proceed(ReflectiveMethodInvocation.java:172)
25-Oct-2019 22:41:17         at org.springframework.aop.framework.JdkDynamicAopProxy.invoke(JdkDynamicAopProxy.java:204)
25-Oct-2019 22:41:17         at com.sun.proxy.$Proxy26.evaluateToObject(Unknown Source)
25-Oct-2019 22:41:17         at sun.reflect.GeneratedMethodAccessor1084.invoke(Unknown Source)
25-Oct-2019 22:41:17         at sun.reflect.DelegatingMethodAccessorImpl.invoke(DelegatingMethodAccessorImpl.java:43)
25-Oct-2019 22:41:17         at java.lang.reflect.Method.invoke(Method.java:498)
25-Oct-2019 22:41:17         at org.springframework.aop.support.AopUtils.invokeJoinpointUsingReflection(AopUtils.java:317)
25-Oct-2019 22:41:17         at org.springframework.aop.framework.ReflectiveMethodInvocation.invokeJoinpoint(ReflectiveMethodInvocation.java:183)
25-Oct-2019 22:41:17         at org.springframework.aop.framework.ReflectiveMethodInvocation.proceed(ReflectiveMethodInvocation.java:150)
25-Oct-2019 22:41:17         at org.springframework.transaction.interceptor.TransactionInterceptor$1.proceedWithInvocation(TransactionInterceptor.java:96)
25-Oct-2019 22:41:17         at org.springframework.transaction.interceptor.TransactionAspectSupport.invokeWithinTransaction(TransactionAspectSupport.java:260)
25-Oct-2019 22:41:17         at org.springframework.transaction.interceptor.TransactionInterceptor.invoke(TransactionInterceptor.java:94)
25-Oct-2019 22:41:17         at org.springframework.aop.framework.ReflectiveMethodInvocation.proceed(ReflectiveMethodInvocation.java:172)
25-Oct-2019 22:41:17         at org.springframework.aop.framework.JdkDynamicAopProxy.invoke(JdkDynamicAopProxy.java:204)
25-Oct-2019 22:41:17         at com.sun.proxy.$Proxy145.evaluateToObject(Unknown Source)
25-Oct-2019 22:41:17         at org.openmrs.module.reporting.indicator.evaluator.SqlIndicatorEvaluator.evaluateSql(SqlIndicatorEvaluator.java:54)
25-Oct-2019 22:41:17         ... 67 more
25-Oct-2019 22:41:18 Tests run: 8, Failures: 0, Errors: 0, Skipped: 0, Time elapsed: 0.956 sec
25-Oct-2019 22:41:18 Running org.openmrs.module.reporting.report.renderer.ExcelTemplateRendererTest
25-Oct-2019 22:41:18 Tests run: 2, Failures: 0, Errors: 0, Skipped: 0, Time elapsed: 0.238 sec
25-Oct-2019 22:41:18 Running org.openmrs.module.reporting.cohort.CohortsTest
25-Oct-2019 22:41:18 Tests run: 3, Failures: 0, Errors: 0, Skipped: 0, Time elapsed: 0.022 sec
25-Oct-2019 22:41:18 Running org.openmrs.module.reporting.data.converter.StringConverterTest
25-Oct-2019 22:41:18 Tests run: 1, Failures: 0, Errors: 0, Skipped: 0, Time elapsed: 0.001 sec
25-Oct-2019 22:41:18 Running org.openmrs.module.reporting.dataset.definition.evaluator.RepeatPerTimePeriodDataSetEvaluatorTest
25-Oct-2019 22:41:18 Tests run: 4, Failures: 0, Errors: 0, Skipped: 0, Time elapsed: 0.082 sec
25-Oct-2019 22:41:18 Running org.openmrs.module.reporting.data.JoinDataDefinitionTest
25-Oct-2019 22:41:18 Tests run: 2, Failures: 0, Errors: 0, Skipped: 0, Time elapsed: 0.001 sec
25-Oct-2019 22:41:18 Running org.openmrs.module.reporting.query.obs.evaluator.BasicObsQueryEvaluatorTest
25-Oct-2019 22:41:18 Tests run: 1, Failures: 0, Errors: 0, Skipped: 0, Time elapsed: 0.172 sec
25-Oct-2019 22:41:18 Running org.openmrs.module.reporting.query.person.evaluator.PatientPersonQueryEvaluatorTest
25-Oct-2019 22:41:18 Tests run: 1, Failures: 0, Errors: 0, Skipped: 0, Time elapsed: 0.205 sec
25-Oct-2019 22:41:18 Running org.openmrs.module.reporting.data.patient.evaluator.ScriptedCompositionPatientDataEvaluatorTest
25-Oct-2019 22:41:19 Tests run: 2, Failures: 0, Errors: 0, Skipped: 0, Time elapsed: 0.318 sec
25-Oct-2019 22:41:19 Running org.openmrs.module.reporting.definition.library.implementerconfigured.ImplementerConfiguredEncounterDataDefinitionLibraryTest
25-Oct-2019 22:41:19 Tests run: 2, Failures: 0, Errors: 0, Skipped: 0, Time elapsed: 0.022 sec
25-Oct-2019 22:41:19 Running org.openmrs.module.reporting.data.encounter.evaluator.PersonToEncounterDataEvaluatorTest
25-Oct-2019 22:41:19 Tests run: 3, Failures: 0, Errors: 0, Skipped: 0, Time elapsed: 0.384 sec
25-Oct-2019 22:41:19 Running org.openmrs.module.reporting.data.visit.evaluator.PatientToVisitDataEvaluatorTest
25-Oct-2019 22:41:19 {1=102, 4=12345K}
25-Oct-2019 22:41:19 Tests run: 3, Failures: 0, Errors: 0, Skipped: 0, Time elapsed: 0.335 sec
25-Oct-2019 22:41:19 Running org.openmrs.module.reporting.validator.CompositionCohortDefinitionValidatorTest
25-Oct-2019 22:41:19 Tests run: 5, Failures: 0, Errors: 0, Skipped: 0, Time elapsed: 0.029 sec
25-Oct-2019 22:41:19 Running org.openmrs.module.reporting.cohort.definition.evaluator.InProgramCohortDefinitionEvaluatorTest
25-Oct-2019 22:41:20 Tests run: 5, Failures: 0, Errors: 0, Skipped: 0, Time elapsed: 0.619 sec
25-Oct-2019 22:41:20 Running org.openmrs.module.reporting.calculation.PatientDataCalculationBehaviorTest
25-Oct-2019 22:41:20 Tests run: 3, Failures: 0, Errors: 0, Skipped: 0, Time elapsed: 0.38 sec
25-Oct-2019 22:41:20 Running org.openmrs.module.reporting.dataset.definition.evaluator.CohortIndicatorDataSetEvaluatorTest
25-Oct-2019 22:41:21 Tests run: 1, Failures: 0, Errors: 0, Skipped: 0, Time elapsed: 0.139 sec
25-Oct-2019 22:41:21 Running org.openmrs.module.reporting.query.encounter.evaluator.AuditEncounterQueryEvaluatorTest
25-Oct-2019 22:41:21 Tests run: 5, Failures: 0, Errors: 0, Skipped: 0, Time elapsed: 0.77 sec
25-Oct-2019 22:41:21 Running org.openmrs.module.reporting.definition.service.DefinitionServiceTest
25-Oct-2019 22:41:21 Tests run: 1, Failures: 0, Errors: 0, Skipped: 0, Time elapsed: 0.038 sec
25-Oct-2019 22:41:21 Running org.openmrs.module.reporting.indicator.aggregation.AggregationTest
25-Oct-2019 22:41:21 Tests run: 12, Failures: 0, Errors: 0, Skipped: 0, Time elapsed: 0.005 sec
25-Oct-2019 22:41:21 Running org.openmrs.module.reporting.data.person.evaluator.ConvertedPersonDataEvaluatorTest
25-Oct-2019 22:41:21 Tests run: 1, Failures: 0, Errors: 0, Skipped: 0, Time elapsed: 0.126 sec
25-Oct-2019 22:41:21 Running org.openmrs.module.reporting.query.encounter.evaluator.SqlEncounterQueryEvaluatorTest
25-Oct-2019 22:41:22 Tests run: 3, Failures: 0, Errors: 0, Skipped: 0, Time elapsed: 0.388 sec
25-Oct-2019 22:41:22 Running org.openmrs.module.reporting.report.renderer.CsvReportRendererTest
25-Oct-2019 22:41:22 Tests run: 1, Failures: 0, Errors: 0, Skipped: 0, Time elapsed: 0.011 sec
25-Oct-2019 22:41:22 Running org.openmrs.module.reporting.dataset.definition.evaluator.LogicDataSetEvaluatorTest
25-Oct-2019 22:41:22 Tests run: 1, Failures: 0, Errors: 0, Skipped: 1, Time elapsed: 0.001 sec
25-Oct-2019 22:41:22 Running org.openmrs.module.reporting.dataset.definition.evaluator.VisitDataSetEvaluatorTest
25-Oct-2019 22:41:22 VISIT ID        EMR ID        BIRTHDATE          
25-Oct-2019 22:41:22 --------        ------        -----------        
25-Oct-2019 22:41:22 1               2             08/Apr/1975        
25-Oct-2019 22:41:22 2               2             08/Apr/1975        
25-Oct-2019 22:41:22 3               2             08/Apr/1975        
25-Oct-2019 22:41:22 4               6             27/May/2007        
25-Oct-2019 22:41:22 5               6             27/May/2007        
25-Oct-2019 22:41:22 Tests run: 1, Failures: 0, Errors: 0, Skipped: 0, Time elapsed: 0.117 sec
25-Oct-2019 22:41:22 Running org.openmrs.module.reporting.data.person.evaluator.PersonIdDataEvaluatorTest
25-Oct-2019 22:41:22 Tests run: 1, Failures: 0, Errors: 0, Skipped: 0, Time elapsed: 0.115 sec
25-Oct-2019 22:41:22 Running org.openmrs.module.reporting.cohort.definition.evaluator.BirthAndDeathCohortDefinitionEvaluatorTest
25-Oct-2019 22:41:23 Tests run: 8, Failures: 0, Errors: 0, Skipped: 0, Time elapsed: 0.971 sec
25-Oct-2019 22:41:23 Running org.openmrs.module.reporting.data.encounter.evaluator.SqlEncounterDataEvaluatorTest
25-Oct-2019 22:41:23 Tests run: 1, Failures: 0, Errors: 0, Skipped: 0, Time elapsed: 0.133 sec
25-Oct-2019 22:41:23 Running org.openmrs.module.reporting.data.converter.PersonAddressConverterTest
25-Oct-2019 22:41:23 Tests run: 1, Failures: 0, Errors: 0, Skipped: 0, Time elapsed: 0.014 sec
25-Oct-2019 22:41:23 Running org.openmrs.module.reporting.data.converter.AttributeValueConverterTest
25-Oct-2019 22:41:23 Tests run: 2, Failures: 0, Errors: 0, Skipped: 0, Time elapsed: 0.219 sec
25-Oct-2019 22:41:23 Running org.openmrs.module.reporting.common.DelimitedKeyComparatorTest
25-Oct-2019 22:41:23 Tests run: 1, Failures: 0, Errors: 0, Skipped: 0, Time elapsed: 0.001 sec
25-Oct-2019 22:41:23 Running org.openmrs.module.reporting.data.obs.evaluator.ConvertedObsDataEvaluatorTest
25-Oct-2019 22:41:24 Tests run: 1, Failures: 0, Errors: 0, Skipped: 0, Time elapsed: 0.099 sec
25-Oct-2019 22:41:24 Running org.openmrs.module.reporting.query.person.evaluator.SqlPersonQueryEvaluatorTest
25-Oct-2019 22:41:24 Tests run: 2, Failures: 0, Errors: 0, Skipped: 0, Time elapsed: 0.202 sec
25-Oct-2019 22:41:24 Running org.openmrs.module.reporting.query.person.evaluator.AllPersonQueryEvaluatorTest
25-Oct-2019 22:41:24 Tests run: 6, Failures: 0, Errors: 0, Skipped: 0, Time elapsed: 0.639 sec
25-Oct-2019 22:41:24 Running org.openmrs.module.reporting.dataset.definition.evaluator.SqlFileDataSetEvaluatorTest
25-Oct-2019 22:41:25 Tests run: 2, Failures: 0, Errors: 0, Skipped: 0, Time elapsed: 0.482 sec
25-Oct-2019 22:41:25 Running org.openmrs.module.reporting.data.person.evaluator.AgeAtDateOfOtherDataEvaluatorTest
25-Oct-2019 22:41:25 Tests run: 1, Failures: 0, Errors: 0, Skipped: 0, Time elapsed: 0.427 sec
25-Oct-2019 22:41:25 Running org.openmrs.module.reporting.indicator.PeriodIndicatorReportTest
25-Oct-2019 22:41:26 Tests run: 2, Failures: 0, Errors: 0, Skipped: 0, Time elapsed: 0.273 sec
25-Oct-2019 22:41:26 Running org.openmrs.module.reporting.report.renderer.DelimitedTextReportRendererTest
25-Oct-2019 22:41:26 Tests run: 11, Failures: 0, Errors: 0, Skipped: 0, Time elapsed: 0.212 sec
25-Oct-2019 22:41:26 Running org.openmrs.module.reporting.data.patient.evaluator.PatientObjectDataEvaluatorTest
25-Oct-2019 22:41:26 Tests run: 1, Failures: 0, Errors: 0, Skipped: 0, Time elapsed: 0.133 sec
25-Oct-2019 22:41:26 Running org.openmrs.module.reporting.data.patient.evaluator.TestPatientCalculation
25-Oct-2019 22:41:26 Tests run: 1, Failures: 0, Errors: 0, Skipped: 1, Time elapsed: 0.002 sec
25-Oct-2019 22:41:26 Running org.openmrs.module.reporting.validator.SqlCohortDefinitionValidatorTest
25-Oct-2019 22:41:26 Tests run: 3, Failures: 0, Errors: 0, Skipped: 0, Time elapsed: 0.036 sec
25-Oct-2019 22:41:26 Running org.openmrs.module.reporting.cohort.definition.evaluator.PatientStateCohortDefinitionEvaluatorTest
25-Oct-2019 22:41:27 Tests run: 7, Failures: 0, Errors: 0, Skipped: 0, Time elapsed: 0.746 sec
25-Oct-2019 22:41:27 Running org.openmrs.module.reporting.data.converter.NullValueConverterTest
25-Oct-2019 22:41:27 Tests run: 1, Failures: 0, Errors: 0, Skipped: 0, Time elapsed: 0.002 sec
25-Oct-2019 22:41:27 Running org.openmrs.module.reporting.query.encounter.evaluator.ConditionalParameterEncounterQueryEvaluatorTest
25-Oct-2019 22:41:27 Tests run: 1, Failures: 0, Errors: 0, Skipped: 0, Time elapsed: 0.11 sec
25-Oct-2019 22:41:27 Running org.openmrs.module.reporting.report.service.TestReportProcessor
25-Oct-2019 22:41:27 Tests run: 1, Failures: 0, Errors: 0, Skipped: 1, Time elapsed: 0.001 sec
25-Oct-2019 22:41:27 Running org.openmrs.module.reporting.common.FractionTest
25-Oct-2019 22:41:27 Tests run: 7, Failures: 0, Errors: 0, Skipped: 0, Time elapsed: 0.003 sec
25-Oct-2019 22:41:27 Running org.openmrs.module.reporting.report.renderer.ReportDesignRendererTest
25-Oct-2019 22:41:27 Tests run: 2, Failures: 0, Errors: 0, Skipped: 0, Time elapsed: 0.014 sec
25-Oct-2019 22:41:27 Running org.openmrs.module.reporting.data.patient.evaluator.ProgramEnrollmentsForPatientDataEvaluatorTest
25-Oct-2019 22:41:28 Tests run: 8, Failures: 0, Errors: 0, Skipped: 0, Time elapsed: 0.863 sec
25-Oct-2019 22:41:28 Running org.openmrs.module.reporting.data.visit.evaluator.OrderForVisitDataEvaluatorTest
25-Oct-2019 22:41:28 Tests run: 2, Failures: 0, Errors: 0, Skipped: 0, Time elapsed: 0.045 sec
25-Oct-2019 22:41:28 Running org.openmrs.module.reporting.report.util.SqlScriptParserTest
25-Oct-2019 22:41:28 Tests run: 4, Failures: 0, Errors: 0, Skipped: 0, Time elapsed: 0.002 sec
25-Oct-2019 22:41:28 Running org.openmrs.module.reporting.definition.library.implementerconfigured.ImplementerConfiguredDataSetDefinitionLibraryTest
25-Oct-2019 22:41:28 Tests run: 3, Failures: 0, Errors: 0, Skipped: 0, Time elapsed: 0.199 sec
25-Oct-2019 22:41:28 Running org.openmrs.module.reporting.cohort.definition.evaluator.PresenceOrAbsenceCohortDefinitionEvaluatorTest
25-Oct-2019 22:41:28 Tests run: 3, Failures: 0, Errors: 0, Skipped: 0, Time elapsed: 0.277 sec
25-Oct-2019 22:41:28 Running org.openmrs.module.reporting.report.definition.service.ReportDefinitionServiceImplTest
25-Oct-2019 22:41:28 Tests run: 2, Failures: 0, Errors: 0, Skipped: 0, Time elapsed: 0.094 sec
25-Oct-2019 22:41:28 Running org.openmrs.module.reporting.data.converter.ObsValueTextAsCodedConverterTest
25-Oct-2019 22:41:28 Tests run: 3, Failures: 0, Errors: 0, Skipped: 0, Time elapsed: 0.017 sec
25-Oct-2019 22:41:28 Running org.openmrs.module.reporting.cohort.definition.service.BaseCohortDefinitionServiceTest
25-Oct-2019 22:41:28 Tests run: 1, Failures: 0, Errors: 0, Skipped: 0, Time elapsed: 0.09 sec
25-Oct-2019 22:41:28 Running org.openmrs.module.reporting.cohort.definition.evaluator.InStateCohortDefinitionEvaluatorTest
25-Oct-2019 22:41:29 Cohort: Cohort id=null size=2
25-Oct-2019 22:41:29 Tests run: 7, Failures: 0, Errors: 0, Skipped: 0, Time elapsed: 0.786 sec
25-Oct-2019 22:41:29 Running org.openmrs.module.reporting.data.patient.evaluator.DefinitionLibraryPatientDataEvaluatorTest
25-Oct-2019 22:41:29 Tests run: 3, Failures: 0, Errors: 0, Skipped: 0, Time elapsed: 0.298 sec
25-Oct-2019 22:41:29 Running org.openmrs.module.reporting.cohort.definition.evaluator.DefinitionLibraryCohortDefinitionEvaluatorTest
25-Oct-2019 22:41:30 Tests run: 3, Failures: 0, Errors: 0, Skipped: 0, Time elapsed: 0.276 sec
25-Oct-2019 22:41:30 Running org.openmrs.module.reporting.dataset.definition.evaluator.CohortsWithVaryingParametersDataSetEvaluatorTest
25-Oct-2019 22:41:30 Tests run: 1, Failures: 0, Errors: 0, Skipped: 0, Time elapsed: 0.101 sec
25-Oct-2019 22:41:30 Running org.openmrs.module.reporting.dataset.definition.evaluator.ObsDataSetEvaluatorTest
25-Oct-2019 22:41:30 Tests run: 1, Failures: 0, Errors: 0, Skipped: 0, Time elapsed: 0.139 sec
25-Oct-2019 22:41:30 Running org.openmrs.module.reporting.data.patient.evaluator.SqlPatientDataEvaluatorTest
25-Oct-2019 22:41:30 Tests run: 1, Failures: 0, Errors: 0, Skipped: 0, Time elapsed: 0.103 sec
25-Oct-2019 22:41:30 Running org.openmrs.module.reporting.data.converter.PrivilegedDataConverterTest
25-Oct-2019 22:41:31 SLF4J: Class path contains multiple SLF4J bindings.
25-Oct-2019 22:41:31 SLF4J: Found binding in [jar:file:/home/bamboo-agent/.m2/repository/org/slf4j/slf4j-log4j12/1.6.0/slf4j-log4j12-1.6.0.jar!/org/slf4j/impl/StaticLoggerBinder.class]
25-Oct-2019 22:41:31 SLF4J: Found binding in [jar:file:/home/bamboo-agent/.m2/repository/org/slf4j/slf4j-log4j12/1.6.0/slf4j-log4j12-1.6.0.jar!/org/slf4j/impl/StaticLoggerBinder.class]
25-Oct-2019 22:41:31 SLF4J: See http://www.slf4j.org/codes.html#multiple_bindings for an explanation.
25-Oct-2019 22:41:31 Tests run: 2, Failures: 0, Errors: 0, Skipped: 0, Time elapsed: 1.167 sec
25-Oct-2019 22:41:31 Running org.openmrs.module.reporting.data.patient.evaluator.PatientCalculationDataEvaluatorTest
25-Oct-2019 22:41:31 ERROR - EvaluationProfiler.log(111) |2019-10-25 22:41:31,897| 1768        2019-10-25 22:41:31.897        >        ERROR        EVALUATING_DEFINITION                        PatientCalculationDataDefinition[Example]: Failed to evaluate No PatientCalculation found on this PatientCalculationDataDefinition
25-Oct-2019 22:41:31 org.openmrs.module.reporting.evaluation.EvaluationException: Failed to evaluate No PatientCalculation found on this PatientCalculationDataDefinition
25-Oct-2019 22:41:31         at org.openmrs.module.reporting.data.patient.evaluator.PatientCalculationDataEvaluator.evaluate(PatientCalculationDataEvaluator.java:50)
25-Oct-2019 22:41:31         at org.openmrs.module.reporting.data.patient.evaluator.PatientCalculationDataEvaluator.evaluate(PatientCalculationDataEvaluator.java:34)
25-Oct-2019 22:41:31         at org.openmrs.module.reporting.definition.service.BaseDefinitionService.executeEvaluator(BaseDefinitionService.java:369)
25-Oct-2019 22:41:31         at org.openmrs.module.reporting.data.patient.service.PatientDataServiceImpl.executeEvaluator(PatientDataServiceImpl.java:66)
25-Oct-2019 22:41:31         at org.openmrs.module.reporting.data.patient.service.PatientDataServiceImpl.executeEvaluator(PatientDataServiceImpl.java:34)
25-Oct-2019 22:41:31         at org.openmrs.module.reporting.definition.service.BaseDefinitionService.evaluateBypassingExclusionOfTestPatients(BaseDefinitionService.java:264)
25-Oct-2019 22:41:31         at org.openmrs.module.reporting.definition.service.BaseDefinitionService.evaluate(BaseDefinitionService.java:229)
25-Oct-2019 22:41:31         at org.openmrs.module.reporting.data.patient.service.PatientDataServiceImpl.evaluate(PatientDataServiceImpl.java:48)
25-Oct-2019 22:41:31         at sun.reflect.GeneratedMethodAccessor781.invoke(Unknown Source)
25-Oct-2019 22:41:31         at sun.reflect.DelegatingMethodAccessorImpl.invoke(DelegatingMethodAccessorImpl.java:43)
25-Oct-2019 22:41:31         at java.lang.reflect.Method.invoke(Method.java:498)
25-Oct-2019 22:41:31         at org.springframework.aop.support.AopUtils.invokeJoinpointUsingReflection(AopUtils.java:317)
25-Oct-2019 22:41:31         at org.springframework.aop.framework.ReflectiveMethodInvocation.invokeJoinpoint(ReflectiveMethodInvocation.java:183)
25-Oct-2019 22:41:31         at org.springframework.aop.framework.ReflectiveMethodInvocation.proceed(ReflectiveMethodInvocation.java:150)
25-Oct-2019 22:41:31         at org.openmrs.aop.LoggingAdvice.invoke(LoggingAdvice.java:121)
25-Oct-2019 22:41:31         at org.springframework.aop.framework.ReflectiveMethodInvocation.proceed(ReflectiveMethodInvocation.java:172)
25-Oct-2019 22:41:31         at org.springframework.aop.framework.adapter.MethodBeforeAdviceInterceptor.invoke(MethodBeforeAdviceInterceptor.java:51)
25-Oct-2019 22:41:31         at org.springframework.aop.framework.ReflectiveMethodInvocation.proceed(ReflectiveMethodInvocation.java:172)
25-Oct-2019 22:41:31         at org.springframework.aop.framework.adapter.MethodBeforeAdviceInterceptor.invoke(MethodBeforeAdviceInterceptor.java:51)
25-Oct-2019 22:41:31         at org.springframework.aop.framework.ReflectiveMethodInvocation.proceed(ReflectiveMethodInvocation.java:172)
25-Oct-2019 22:41:31         at org.springframework.aop.framework.JdkDynamicAopProxy.invoke(JdkDynamicAopProxy.java:204)
25-Oct-2019 22:41:31         at com.sun.proxy.$Proxy29.evaluate(Unknown Source)
25-Oct-2019 22:41:31         at sun.reflect.GeneratedMethodAccessor781.invoke(Unknown Source)
25-Oct-2019 22:41:31         at sun.reflect.DelegatingMethodAccessorImpl.invoke(DelegatingMethodAccessorImpl.java:43)
25-Oct-2019 22:41:31         at java.lang.reflect.Method.invoke(Method.java:498)
25-Oct-2019 22:41:31         at org.springframework.aop.support.AopUtils.invokeJoinpointUsingReflection(AopUtils.java:317)
25-Oct-2019 22:41:31         at org.springframework.aop.framework.JdkDynamicAopProxy.invoke(JdkDynamicAopProxy.java:198)
25-Oct-2019 22:41:31         at com.sun.proxy.$Proxy150.evaluate(Unknown Source)
25-Oct-2019 22:41:31         at org.openmrs.module.reporting.data.patient.evaluator.PatientCalculationDataEvaluatorTest.evaluate_shouldThrowAnErrorIfNoCalculationRegistrationExistsOnTheDefinition(PatientCalculationDataEvaluatorTest.java:90)
25-Oct-2019 22:41:31         at sun.reflect.NativeMethodAccessorImpl.invoke0(Native Method)
25-Oct-2019 22:41:31         at sun.reflect.NativeMethodAccessorImpl.invoke(NativeMethodAccessorImpl.java:62)
25-Oct-2019 22:41:31         at sun.reflect.DelegatingMethodAccessorImpl.invoke(DelegatingMethodAccessorImpl.java:43)
25-Oct-2019 22:41:31         at java.lang.reflect.Method.invoke(Method.java:498)
25-Oct-2019 22:41:31         at org.junit.runners.model.FrameworkMethod$1.runReflectiveCall(FrameworkMethod.java:47)
25-Oct-2019 22:41:31         at org.junit.internal.runners.model.ReflectiveCallable.run(ReflectiveCallable.java:12)
25-Oct-2019 22:41:31         at org.junit.runners.model.FrameworkMethod.invokeExplosively(FrameworkMethod.java:44)
25-Oct-2019 22:41:31         at org.junit.internal.runners.statements.InvokeMethod.evaluate(InvokeMethod.java:17)
25-Oct-2019 22:41:31         at org.junit.internal.runners.statements.ExpectException.evaluate(ExpectException.java:19)
25-Oct-2019 22:41:31         at org.junit.internal.runners.statements.RunBefores.evaluate(RunBefores.java:26)
25-Oct-2019 22:41:31         at org.springframework.test.context.junit4.statements.RunBeforeTestMethodCallbacks.evaluate(RunBeforeTestMethodCallbacks.java:74)
25-Oct-2019 22:41:31         at org.junit.internal.runners.statements.RunAfters.evaluate(RunAfters.java:27)
25-Oct-2019 22:41:31         at org.springframework.test.context.junit4.statements.RunAfterTestMethodCallbacks.evaluate(RunAfterTestMethodCallbacks.java:83)
25-Oct-2019 22:41:31         at org.springframework.test.context.junit4.statements.SpringRepeat.evaluate(SpringRepeat.java:72)
25-Oct-2019 22:41:31         at org.springframework.test.context.junit4.SpringJUnit4ClassRunner.runChild(SpringJUnit4ClassRunner.java:231)
25-Oct-2019 22:41:31         at org.springframework.test.context.junit4.SpringJUnit4ClassRunner.runChild(SpringJUnit4ClassRunner.java:88)
25-Oct-2019 22:41:31         at org.junit.runners.ParentRunner$3.run(ParentRunner.java:238)
25-Oct-2019 22:41:31         at org.junit.runners.ParentRunner$1.schedule(ParentRunner.java:63)
25-Oct-2019 22:41:31         at org.junit.runners.ParentRunner.runChildren(ParentRunner.java:236)
25-Oct-2019 22:41:31         at org.junit.runners.ParentRunner.access$000(ParentRunner.java:53)
25-Oct-2019 22:41:31         at org.junit.runners.ParentRunner$2.evaluate(ParentRunner.java:229)
25-Oct-2019 22:41:31         at org.springframework.test.context.junit4.statements.RunBeforeTestClassCallbacks.evaluate(RunBeforeTestClassCallbacks.java:61)
25-Oct-2019 22:41:31         at org.junit.internal.runners.statements.RunAfters.evaluate(RunAfters.java:27)
25-Oct-2019 22:41:31         at org.springframework.test.context.junit4.statements.RunAfterTestClassCallbacks.evaluate(RunAfterTestClassCallbacks.java:71)
25-Oct-2019 22:41:31         at org.junit.runners.ParentRunner.run(ParentRunner.java:309)
25-Oct-2019 22:41:31         at org.springframework.test.context.junit4.SpringJUnit4ClassRunner.run(SpringJUnit4ClassRunner.java:174)
25-Oct-2019 22:41:31         at org.apache.maven.surefire.junit4.JUnit4TestSet.execute(JUnit4TestSet.java:59)
25-Oct-2019 22:41:31         at org.apache.maven.surefire.suite.AbstractDirectoryTestSuite.executeTestSet(AbstractDirectoryTestSuite.java:115)
25-Oct-2019 22:41:31         at org.apache.maven.surefire.suite.AbstractDirectoryTestSuite.execute(AbstractDirectoryTestSuite.java:102)
25-Oct-2019 22:41:31         at org.apache.maven.surefire.Surefire.run(Surefire.java:180)
25-Oct-2019 22:41:31         at sun.reflect.NativeMethodAccessorImpl.invoke0(Native Method)
25-Oct-2019 22:41:31         at sun.reflect.NativeMethodAccessorImpl.invoke(NativeMethodAccessorImpl.java:62)
25-Oct-2019 22:41:31         at sun.reflect.DelegatingMethodAccessorImpl.invoke(DelegatingMethodAccessorImpl.java:43)
25-Oct-2019 22:41:31         at java.lang.reflect.Method.invoke(Method.java:498)
25-Oct-2019 22:41:31         at org.apache.maven.surefire.booter.SurefireBooter.runSuitesInProcess(SurefireBooter.java:350)
25-Oct-2019 22:41:31         at org.apache.maven.surefire.booter.SurefireBooter.main(SurefireBooter.java:1021)
25-Oct-2019 22:41:32 Tests run: 2, Failures: 0, Errors: 0, Skipped: 0, Time elapsed: 0.233 sec
25-Oct-2019 22:41:32 Running org.openmrs.module.reporting.data.converter.DateConverterTest
25-Oct-2019 22:41:32 Tests run: 1, Failures: 0, Errors: 0, Skipped: 0, Time elapsed: 0.002 sec
25-Oct-2019 22:41:32 Running org.openmrs.module.reporting.dataset.definition.evaluator.EncounterAndObsDataSetEvaluatorTest
25-Oct-2019 22:41:32 Tests run: 1, Failures: 0, Errors: 0, Skipped: 0, Time elapsed: 0.219 sec
25-Oct-2019 22:41:32 Running org.openmrs.module.reporting.data.encounter.evaluator.PatientToEncounterDataEvaluatorTest
25-Oct-2019 22:41:32 Tests run: 3, Failures: 0, Errors: 0, Skipped: 0, Time elapsed: 0.298 sec
25-Oct-2019 22:41:32 Running org.openmrs.module.reporting.data.patient.evaluator.PatientIdDataEvaluatorTest
25-Oct-2019 22:41:32 Tests run: 1, Failures: 0, Errors: 0, Skipped: 0, Time elapsed: 0.123 sec
25-Oct-2019 22:41:32 Running org.openmrs.module.reporting.data.person.evaluator.RelationshipsForPersonDataEvaluatorTest
25-Oct-2019 22:41:33 Tests run: 3, Failures: 0, Errors: 0, Skipped: 0, Time elapsed: 0.355 sec
25-Oct-2019 22:41:33 Running org.openmrs.module.reporting.data.patient.evaluator.PersonToPatientDataEvaluatorTest
25-Oct-2019 22:41:33 Tests run: 1, Failures: 0, Errors: 0, Skipped: 0, Time elapsed: 0.133 sec
25-Oct-2019 22:41:33 Running org.openmrs.module.reporting.data.patient.service.PatientDataServiceImplTest
25-Oct-2019 22:41:33 Tests run: 6, Failures: 0, Errors: 0, Skipped: 0, Time elapsed: 0.709 sec
25-Oct-2019 22:41:33
25-Oct-2019 22:41:33 Results :
25-Oct-2019 22:41:33
25-Oct-2019 22:41:33 Tests run: 723, Failures: 0, Errors: 0, Skipped: 13
25-Oct-2019 22:41:33
25-Oct-2019 22:41:34 [INFO]
25-Oct-2019 22:41:34 [INFO] --- maven-jar-plugin:2.4:jar (default-jar) @ reporting-api-tests ---
25-Oct-2019 22:41:34 [WARNING] JAR will be empty - no content was marked for inclusion!
25-Oct-2019 22:41:34 [INFO] Building jar: /home/bamboo-agent/bamboo-agent/xml-data/build-dir/REP-REP-T1DOT12/api-tests/target/reporting-api-tests-1.19.0-SNAPSHOT.jar
25-Oct-2019 22:41:34 [INFO]
25-Oct-2019 22:41:34 [INFO] --- maven-jar-plugin:2.4:test-jar (default) @ reporting-api-tests ---
25-Oct-2019 22:41:34 [INFO] Building jar: /home/bamboo-agent/bamboo-agent/xml-data/build-dir/REP-REP-T1DOT12/api-tests/target/reporting-api-tests-1.19.0-SNAPSHOT-tests.jar
25-Oct-2019 22:41:34 [INFO]                                                                         
25-Oct-2019 22:41:34 [INFO] ------------------------------------------------------------------------
25-Oct-2019 22:41:34 [INFO] Building reporting Module api 1.10 1.19.0-SNAPSHOT
25-Oct-2019 22:41:34 [INFO] ------------------------------------------------------------------------
25-Oct-2019 22:41:34 [INFO]
25-Oct-2019 22:41:34 [INFO] --- maven-clean-plugin:2.5:clean (default-clean) @ reporting-api-1.10 ---
25-Oct-2019 22:41:34 [INFO]
25-Oct-2019 22:41:34 [INFO] --- maven-resources-plugin:2.6:resources (default-resources) @ reporting-api-1.10 ---
25-Oct-2019 22:41:34 [INFO] Using 'UTF-8' encoding to copy filtered resources.
25-Oct-2019 22:41:34 [INFO] skip non existing resourceDirectory /home/bamboo-agent/bamboo-agent/xml-data/build-dir/REP-REP-T1DOT12/api-1.10/src/main/resources
25-Oct-2019 22:41:34 [INFO]
25-Oct-2019 22:41:34 [INFO] --- maven-compiler-plugin:3.1:compile (default-compile) @ reporting-api-1.10 ---
25-Oct-2019 22:41:34 [INFO] Changes detected - recompiling the module!
25-Oct-2019 22:41:34 [INFO] Compiling 3 source files to /home/bamboo-agent/bamboo-agent/xml-data/build-dir/REP-REP-T1DOT12/api-1.10/target/classes
25-Oct-2019 22:41:34 [INFO]
25-Oct-2019 22:41:34 [INFO] --- build-helper-maven-plugin:1.7:parse-version (default) @ reporting-api-1.10 ---
25-Oct-2019 22:41:34 [INFO]
25-Oct-2019 22:41:34 [INFO] --- maven-resources-plugin:2.6:testResources (default-testResources) @ reporting-api-1.10 ---
25-Oct-2019 22:41:34 [INFO] Using 'UTF-8' encoding to copy filtered resources.
25-Oct-2019 22:41:34 [INFO] Copying 1 resource
25-Oct-2019 22:41:34 [INFO] Copying 0 resource
25-Oct-2019 22:41:34 [INFO]
25-Oct-2019 22:41:34 [INFO] --- maven-compiler-plugin:3.1:testCompile (default-testCompile) @ reporting-api-1.10 ---
25-Oct-2019 22:41:34 [INFO] Changes detected - recompiling the module!
25-Oct-2019 22:41:34 [INFO] Compiling 2 source files to /home/bamboo-agent/bamboo-agent/xml-data/build-dir/REP-REP-T1DOT12/api-1.10/target/test-classes
25-Oct-2019 22:41:34 [WARNING] /home/bamboo-agent/bamboo-agent/xml-data/build-dir/REP-REP-T1DOT12/api-1.10/src/test/java/org/openmrs/module/reporting/cohort/definition/evaluator/DrugOrderCohortDefinitionEvaluatorTest.java: /home/bamboo-agent/bamboo-agent/xml-data/build-dir/REP-REP-T1DOT12/api-1.10/src/test/java/org/openmrs/module/reporting/cohort/definition/evaluator/DrugOrderCohortDefinitionEvaluatorTest.java uses or overrides a deprecated API.
25-Oct-2019 22:41:34 [WARNING] /home/bamboo-agent/bamboo-agent/xml-data/build-dir/REP-REP-T1DOT12/api-1.10/src/test/java/org/openmrs/module/reporting/cohort/definition/evaluator/DrugOrderCohortDefinitionEvaluatorTest.java: Recompile with -Xlint:deprecation for details.
25-Oct-2019 22:41:34 [WARNING] /home/bamboo-agent/bamboo-agent/xml-data/build-dir/REP-REP-T1DOT12/api-1.10/src/test/java/org/openmrs/module/reporting/cohort/definition/evaluator/DrugOrderCohortDefinitionEvaluatorTest.java: /home/bamboo-agent/bamboo-agent/xml-data/build-dir/REP-REP-T1DOT12/api-1.10/src/test/java/org/openmrs/module/reporting/cohort/definition/evaluator/DrugOrderCohortDefinitionEvaluatorTest.java uses unchecked or unsafe operations.
25-Oct-2019 22:41:34 [WARNING] /home/bamboo-agent/bamboo-agent/xml-data/build-dir/REP-REP-T1DOT12/api-1.10/src/test/java/org/openmrs/module/reporting/cohort/definition/evaluator/DrugOrderCohortDefinitionEvaluatorTest.java: Recompile with -Xlint:unchecked for details.
25-Oct-2019 22:41:34 [INFO]
25-Oct-2019 22:41:34 [INFO] --- maven-surefire-plugin:2.5:test (default-test) @ reporting-api-1.10 ---
25-Oct-2019 22:41:34 [INFO] Surefire report directory: /home/bamboo-agent/bamboo-agent/xml-data/build-dir/REP-REP-T1DOT12/api-1.10/target/surefire-reports
25-Oct-2019 22:41:34 OpenJDK 64-Bit Server VM warning: ignoring option MaxPermSize=512m; support was removed in 8.0
25-Oct-2019 22:41:35
25-Oct-2019 22:41:35 -------------------------------------------------------
25-Oct-2019 22:41:35 T E S T S
25-Oct-2019 22:41:35 -------------------------------------------------------
25-Oct-2019 22:41:35 Running org.openmrs.module.reporting.cohort.definition.evaluator.DrugOrderCohortDefinitionEvaluatorTest
25-Oct-2019 22:41:35 log4j:WARN No appenders could be found for logger (org.springframework.test.context.junit4.SpringJUnit4ClassRunner).
25-Oct-2019 22:41:35 log4j:WARN Please initialize the log4j system properly.
25-Oct-2019 22:41:53 Tests run: 18, Failures: 0, Errors: 0, Skipped: 0, Time elapsed: 18.108 sec
25-Oct-2019 22:41:53 Running org.openmrs.module.reporting.cohort.definition.library.BuiltInCohortDefinitionLibrary1_10Test
25-Oct-2019 22:41:53 Tests run: 1, Failures: 0, Errors: 0, Skipped: 0, Time elapsed: 0.007 sec
25-Oct-2019 22:41:53
25-Oct-2019 22:41:53 Results :
25-Oct-2019 22:41:53
25-Oct-2019 22:41:53 Tests run: 19, Failures: 0, Errors: 0, Skipped: 0
25-Oct-2019 22:41:53
25-Oct-2019 22:41:53 [INFO]
25-Oct-2019 22:41:53 [INFO] --- maven-jar-plugin:2.4:jar (default-jar) @ reporting-api-1.10 ---
25-Oct-2019 22:41:53 [INFO] Building jar: /home/bamboo-agent/bamboo-agent/xml-data/build-dir/REP-REP-T1DOT12/api-1.10/target/reporting-api-1.10-1.19.0-SNAPSHOT.jar
25-Oct-2019 22:41:53 [INFO]
25-Oct-2019 22:41:53 [INFO] --- maven-jar-plugin:2.4:test-jar (default) @ reporting-api-1.10 ---
25-Oct-2019 22:41:53 [INFO] Building jar: /home/bamboo-agent/bamboo-agent/xml-data/build-dir/REP-REP-T1DOT12/api-1.10/target/reporting-api-1.10-1.19.0-SNAPSHOT-tests.jar
25-Oct-2019 22:41:53 [INFO]                                                                         
25-Oct-2019 22:41:53 [INFO] ------------------------------------------------------------------------
25-Oct-2019 22:41:53 [INFO] Building reporting Module api 2.0 1.19.0-SNAPSHOT
25-Oct-2019 22:41:53 [INFO] ------------------------------------------------------------------------
25-Oct-2019 22:41:53 [INFO]
25-Oct-2019 22:41:53 [INFO] --- maven-clean-plugin:2.5:clean (default-clean) @ reporting-api-2.0 ---
25-Oct-2019 22:41:53 [INFO]
25-Oct-2019 22:41:53 [INFO] --- maven-resources-plugin:2.6:resources (default-resources) @ reporting-api-2.0 ---
25-Oct-2019 22:41:53 [INFO] Using 'UTF-8' encoding to copy filtered resources.
25-Oct-2019 22:41:53 [INFO] skip non existing resourceDirectory /home/bamboo-agent/bamboo-agent/xml-data/build-dir/REP-REP-T1DOT12/api-2.0/src/main/resources
25-Oct-2019 22:41:53 [INFO]
25-Oct-2019 22:41:53 [INFO] --- maven-compiler-plugin:3.1:compile (default-compile) @ reporting-api-2.0 ---
25-Oct-2019 22:41:53 [INFO] Changes detected - recompiling the module!
25-Oct-2019 22:41:53 [INFO] Compiling 4 source files to /home/bamboo-agent/bamboo-agent/xml-data/build-dir/REP-REP-T1DOT12/api-2.0/target/classes
25-Oct-2019 22:41:53 [INFO]
25-Oct-2019 22:41:53 [INFO] --- build-helper-maven-plugin:1.7:parse-version (default) @ reporting-api-2.0 ---
25-Oct-2019 22:41:53 [INFO]
25-Oct-2019 22:41:53 [INFO] --- maven-resources-plugin:2.6:testResources (default-testResources) @ reporting-api-2.0 ---
25-Oct-2019 22:41:53 [INFO] Using 'UTF-8' encoding to copy filtered resources.
25-Oct-2019 22:41:53 [INFO] skip non existing resourceDirectory /home/bamboo-agent/bamboo-agent/xml-data/build-dir/REP-REP-T1DOT12/api-2.0/src/test/resources
25-Oct-2019 22:41:53 [INFO] skip non existing resourceDirectory /home/bamboo-agent/bamboo-agent/xml-data/build-dir/REP-REP-T1DOT12/api-2.0/src/test/resources
25-Oct-2019 22:41:53 [INFO]
25-Oct-2019 22:41:53 [INFO] --- maven-compiler-plugin:3.1:testCompile (default-testCompile) @ reporting-api-2.0 ---
25-Oct-2019 22:41:53 [INFO] No sources to compile
25-Oct-2019 22:41:53 [INFO]
25-Oct-2019 22:41:53 [INFO] --- maven-surefire-plugin:2.5:test (default-test) @ reporting-api-2.0 ---
25-Oct-2019 22:41:53 [INFO] No tests to run.
25-Oct-2019 22:41:53 [INFO]
25-Oct-2019 22:41:53 [INFO] --- maven-jar-plugin:2.4:jar (default-jar) @ reporting-api-2.0 ---
25-Oct-2019 22:41:53 [INFO] Building jar: /home/bamboo-agent/bamboo-agent/xml-data/build-dir/REP-REP-T1DOT12/api-2.0/target/reporting-api-2.0-1.19.0-SNAPSHOT.jar
25-Oct-2019 22:41:53 [INFO]
25-Oct-2019 22:41:53 [INFO] --- maven-jar-plugin:2.4:test-jar (default) @ reporting-api-2.0 ---
25-Oct-2019 22:41:53 [WARNING] JAR will be empty - no content was marked for inclusion!
25-Oct-2019 22:41:53 [INFO] Building jar: /home/bamboo-agent/bamboo-agent/xml-data/build-dir/REP-REP-T1DOT12/api-2.0/target/reporting-api-2.0-1.19.0-SNAPSHOT-tests.jar
25-Oct-2019 22:41:53 [INFO]                                                                         
25-Oct-2019 22:41:53 [INFO] ------------------------------------------------------------------------
25-Oct-2019 22:41:53 [INFO] Building reporting Module api 2.2 1.19.0-SNAPSHOT
25-Oct-2019 22:41:53 [INFO] ------------------------------------------------------------------------
25-Oct-2019 22:41:54 [INFO]
25-Oct-2019 22:41:54 [INFO] --- maven-clean-plugin:2.5:clean (default-clean) @ reporting-api-2.2 ---
25-Oct-2019 22:41:54 [INFO]
25-Oct-2019 22:41:54 [INFO] --- maven-resources-plugin:2.6:resources (default-resources) @ reporting-api-2.2 ---
25-Oct-2019 22:41:54 [INFO] Using 'UTF-8' encoding to copy filtered resources.
25-Oct-2019 22:41:54 [INFO] skip non existing resourceDirectory /home/bamboo-agent/bamboo-agent/xml-data/build-dir/REP-REP-T1DOT12/api-2.2/src/main/resources
25-Oct-2019 22:41:54 [INFO]
25-Oct-2019 22:41:54 [INFO] --- maven-compiler-plugin:3.1:compile (default-compile) @ reporting-api-2.2 ---
25-Oct-2019 22:41:54 [INFO] Changes detected - recompiling the module!
25-Oct-2019 22:41:54 [INFO] Compiling 3 source files to /home/bamboo-agent/bamboo-agent/xml-data/build-dir/REP-REP-T1DOT12/api-2.2/target/classes
25-Oct-2019 22:41:54 [INFO]
25-Oct-2019 22:41:54 [INFO] --- build-helper-maven-plugin:1.7:parse-version (default) @ reporting-api-2.2 ---
25-Oct-2019 22:41:54 [INFO]
25-Oct-2019 22:41:54 [INFO] --- maven-resources-plugin:2.6:testResources (default-testResources) @ reporting-api-2.2 ---
25-Oct-2019 22:41:54 [INFO] Using 'UTF-8' encoding to copy filtered resources.
25-Oct-2019 22:41:54 [INFO] Copying 1 resource
25-Oct-2019 22:41:54 [INFO] Copying 0 resource
25-Oct-2019 22:41:54 [INFO]
25-Oct-2019 22:41:54 [INFO] --- maven-compiler-plugin:3.1:testCompile (default-testCompile) @ reporting-api-2.2 ---
25-Oct-2019 22:41:54 [INFO] Changes detected - recompiling the module!
25-Oct-2019 22:41:54 [INFO] Compiling 2 source files to /home/bamboo-agent/bamboo-agent/xml-data/build-dir/REP-REP-T1DOT12/api-2.2/target/test-classes
25-Oct-2019 22:41:54 [INFO]
25-Oct-2019 22:41:54 [INFO] --- maven-surefire-plugin:2.5:test (default-test) @ reporting-api-2.2 ---
25-Oct-2019 22:41:54 [INFO] Surefire report directory: /home/bamboo-agent/bamboo-agent/xml-data/build-dir/REP-REP-T1DOT12/api-2.2/target/surefire-reports
25-Oct-2019 22:41:54 OpenJDK 64-Bit Server VM warning: ignoring option MaxPermSize=512m; support was removed in 8.0
25-Oct-2019 22:41:54
25-Oct-2019 22:41:54 -------------------------------------------------------
25-Oct-2019 22:41:54 T E S T S
25-Oct-2019 22:41:54 -------------------------------------------------------
25-Oct-2019 22:41:54 Running org.openmrs.module.reporting.cohort.definition.evaluator.ConditionCohortDefinitionEvaluatorTest
25-Oct-2019 22:41:55 log4j:WARN No appenders could be found for logger (org.springframework.test.context.junit4.SpringJUnit4ClassRunner).
25-Oct-2019 22:41:55 log4j:WARN Please initialize the log4j system properly.
25-Oct-2019 22:42:11 Tests run: 12, Failures: 0, Errors: 0, Skipped: 0, Time elapsed: 16.926 sec
25-Oct-2019 22:42:11 Running org.openmrs.module.reporting.cohort.definition.library.BuiltInCohortDefinitionLibrary2_2Test
25-Oct-2019 22:42:11 Tests run: 1, Failures: 0, Errors: 0, Skipped: 0, Time elapsed: 0.008 sec
25-Oct-2019 22:42:11
25-Oct-2019 22:42:11 Results :
25-Oct-2019 22:42:11
25-Oct-2019 22:42:11 Tests run: 13, Failures: 0, Errors: 0, Skipped: 0
25-Oct-2019 22:42:11
25-Oct-2019 22:42:12 [INFO]
25-Oct-2019 22:42:12 [INFO] --- maven-jar-plugin:2.4:jar (default-jar) @ reporting-api-2.2 ---
25-Oct-2019 22:42:12 [INFO] Building jar: /home/bamboo-agent/bamboo-agent/xml-data/build-dir/REP-REP-T1DOT12/api-2.2/target/reporting-api-2.2-1.19.0-SNAPSHOT.jar
25-Oct-2019 22:42:12 [INFO]
25-Oct-2019 22:42:12 [INFO] --- maven-jar-plugin:2.4:test-jar (default) @ reporting-api-2.2 ---
25-Oct-2019 22:42:12 [INFO] Building jar: /home/bamboo-agent/bamboo-agent/xml-data/build-dir/REP-REP-T1DOT12/api-2.2/target/reporting-api-2.2-1.19.0-SNAPSHOT-tests.jar
25-Oct-2019 22:42:12 [INFO]                                                                         
25-Oct-2019 22:42:12 [INFO] ------------------------------------------------------------------------
25-Oct-2019 22:42:12 [INFO] Building Reporting OMOD 1.19.0-SNAPSHOT
25-Oct-2019 22:42:12 [INFO] ------------------------------------------------------------------------
25-Oct-2019 22:42:12 [INFO]
25-Oct-2019 22:42:12 [INFO] --- maven-clean-plugin:2.5:clean (default-clean) @ reporting-omod ---
25-Oct-2019 22:42:12 [INFO]
25-Oct-2019 22:42:12 [INFO] --- maven-openmrs-plugin:1.0.1:initialize-module (init) @ reporting-omod ---
25-Oct-2019 22:42:12 [INFO]
25-Oct-2019 22:42:12 [INFO] --- maven-dependency-plugin:2.8:unpack-dependencies (Expand resources) @ reporting-omod ---
25-Oct-2019 22:42:12 [INFO] Unpacking /home/bamboo-agent/bamboo-agent/xml-data/build-dir/REP-REP-T1DOT12/api/target/reporting-api-1.19.0-SNAPSHOT.jar to /home/bamboo-agent/bamboo-agent/xml-data/build-dir/REP-REP-T1DOT12/omod/target/classes with includes "**\/*.xml,**\/*.properties" and excludes ""
25-Oct-2019 22:42:13 [INFO]
25-Oct-2019 22:42:13 [INFO] --- maven-resources-plugin:2.6:resources (default-resources) @ reporting-omod ---
25-Oct-2019 22:42:13 [INFO] Using 'UTF-8' encoding to copy filtered resources.
25-Oct-2019 22:42:13 [INFO] Copying 0 resource
25-Oct-2019 22:42:13 [INFO] Copying 2 resources
25-Oct-2019 22:42:13 [INFO] Copying 224 resources to web/module
25-Oct-2019 22:42:13 [INFO] Copying 224 resources to web/module
25-Oct-2019 22:42:13 [INFO]
25-Oct-2019 22:42:13 [INFO] --- maven-compiler-plugin:3.1:compile (default-compile) @ reporting-omod ---
25-Oct-2019 22:42:13 [INFO] Changes detected - recompiling the module!
25-Oct-2019 22:42:13 [INFO] Compiling 113 source files to /home/bamboo-agent/bamboo-agent/xml-data/build-dir/REP-REP-T1DOT12/omod/target/classes
25-Oct-2019 22:42:14 [WARNING] /home/bamboo-agent/bamboo-agent/xml-data/build-dir/REP-REP-T1DOT12/omod/src/main/java/org/openmrs/module/reporting/web/datasets/LogicDataSetEditor.java: Some input files use or override a deprecated API.
25-Oct-2019 22:42:14 [WARNING] /home/bamboo-agent/bamboo-agent/xml-data/build-dir/REP-REP-T1DOT12/omod/src/main/java/org/openmrs/module/reporting/web/datasets/LogicDataSetEditor.java: Recompile with -Xlint:deprecation for details.
25-Oct-2019 22:42:14 [WARNING] /home/bamboo-agent/bamboo-agent/xml-data/build-dir/REP-REP-T1DOT12/omod/src/main/java/org/openmrs/module/reporting/web/controller/SqlDefinitionController.java: Some input files use unchecked or unsafe operations.
25-Oct-2019 22:42:14 [WARNING] /home/bamboo-agent/bamboo-agent/xml-data/build-dir/REP-REP-T1DOT12/omod/src/main/java/org/openmrs/module/reporting/web/controller/SqlDefinitionController.java: Recompile with -Xlint:unchecked for details.
25-Oct-2019 22:42:14 [INFO]
25-Oct-2019 22:42:14 [INFO] --- build-helper-maven-plugin:1.7:parse-version (default) @ reporting-omod ---
25-Oct-2019 22:42:14 [INFO]
25-Oct-2019 22:42:14 [INFO] --- maven-resources-plugin:2.6:testResources (default-testResources) @ reporting-omod ---
25-Oct-2019 22:42:14 [INFO] Using 'UTF-8' encoding to copy filtered resources.
25-Oct-2019 22:42:14 [INFO] skip non existing resourceDirectory /home/bamboo-agent/bamboo-agent/xml-data/build-dir/REP-REP-T1DOT12/omod/src/test/resources
25-Oct-2019 22:42:14 [INFO] skip non existing resourceDirectory /home/bamboo-agent/bamboo-agent/xml-data/build-dir/REP-REP-T1DOT12/omod/src/test/resources
25-Oct-2019 22:42:14 [INFO]
25-Oct-2019 22:42:14 [INFO] --- maven-compiler-plugin:3.1:testCompile (default-testCompile) @ reporting-omod ---
25-Oct-2019 22:42:14 [INFO] No sources to compile
25-Oct-2019 22:42:14 [INFO]
25-Oct-2019 22:42:14 [INFO] --- maven-surefire-plugin:2.5:test (default-test) @ reporting-omod ---
25-Oct-2019 22:42:14 [INFO] No tests to run.
25-Oct-2019 22:42:14 [INFO]
25-Oct-2019 22:42:14 [INFO] --- maven-jar-plugin:2.4:jar (default-jar) @ reporting-omod ---
25-Oct-2019 22:42:14 [INFO] Building jar: /home/bamboo-agent/bamboo-agent/xml-data/build-dir/REP-REP-T1DOT12/omod/target/reporting-1.19.0-SNAPSHOT.jar
25-Oct-2019 22:42:14 [INFO]
25-Oct-2019 22:42:14 [INFO] --- maven-openmrs-plugin:1.0.1:package-module (pack) @ reporting-omod ---
25-Oct-2019 22:42:14 [INFO] Packaging OpenMRS module
25-Oct-2019 22:42:14 [INFO] Building jar: /home/bamboo-agent/bamboo-agent/xml-data/build-dir/REP-REP-T1DOT12/omod/target/reporting-1.19.0-SNAPSHOT.omod
25-Oct-2019 22:42:15 [INFO]
25-Oct-2019 22:42:15 [INFO] --- maven-jar-plugin:2.4:test-jar (default) @ reporting-omod ---
25-Oct-2019 22:42:15 [WARNING] JAR will be empty - no content was marked for inclusion!
25-Oct-2019 22:42:15 [INFO] Building jar: /home/bamboo-agent/bamboo-agent/xml-data/build-dir/REP-REP-T1DOT12/omod/target/reporting-1.19.0-SNAPSHOT-tests.jar
25-Oct-2019 22:42:15 [INFO] ------------------------------------------------------------------------
25-Oct-2019 22:42:15 [INFO] Reactor Summary:
25-Oct-2019 22:42:15 [INFO]
25-Oct-2019 22:42:15 [INFO] Reporting .......................................... SUCCESS [  4.436 s]
25-Oct-2019 22:42:15 [INFO] Reporting API ...................................... SUCCESS [  6.851 s]
25-Oct-2019 22:42:15 [INFO] reporting Module api 1.9 ........................... SUCCESS [  1.146 s]
25-Oct-2019 22:42:15 [INFO] reporting API Tests ................................ SUCCESS [01:27 min]
25-Oct-2019 22:42:15 [INFO] reporting Module api 1.10 .......................... SUCCESS [ 19.200 s]
25-Oct-2019 22:42:15 [INFO] reporting Module api 2.0 ........................... SUCCESS [  0.420 s]
25-Oct-2019 22:42:15 [INFO] reporting Module api 2.2 ........................... SUCCESS [ 18.401 s]
25-Oct-2019 22:42:15 [INFO] Reporting OMOD ..................................... SUCCESS [  3.029 s]
25-Oct-2019 22:42:15 [INFO] ------------------------------------------------------------------------
25-Oct-2019 22:42:15 [INFO] BUILD SUCCESS
25-Oct-2019 22:42:15 [INFO] ------------------------------------------------------------------------
25-Oct-2019 22:42:15 [INFO] Total time: 02:21 min
25-Oct-2019 22:42:15 [INFO] Finished at: 2019-10-25T22:42:15+00:00
25-Oct-2019 22:42:15 [INFO] Final Memory: 63M/411M
25-Oct-2019 22:42:15 [INFO] ------------------------------------------------------------------------
25-Oct-2019 22:42:15 Parsing test results under /home/bamboo-agent/bamboo-agent/xml-data/build-dir/REP-REP-T1DOT12...
25-Oct-2019 22:42:16 Finished task 'Maven 3.x' with result: Success
25-Oct-2019 22:42:16 Running post build plugin 'Docker Container Cleanup'
25-Oct-2019 22:42:16 Running post build plugin 'NCover Results Collector'
25-Oct-2019 22:42:16 Running post build plugin 'Clover Results Collector'
25-Oct-2019 22:42:16 Running post build plugin 'Sauce OnDemand Post Runner'
25-Oct-2019 22:42:16 Running post build plugin 'npm Cache Cleanup'
25-Oct-2019 22:42:16 Running post build plugin 'Artifact Copier'
25-Oct-2019 22:42:16 Finalising the build...
25-Oct-2019 22:42:16 Stopping timer.
25-Oct-2019 22:42:16 Build REP-REP-T1DOT12-795 completed.
25-Oct-2019 22:42:16 Running on server: post build plugin 'NCover Results Collector'
25-Oct-2019 22:42:16 Running on server: post build plugin 'Build Hanging Detection Configuration'
25-Oct-2019 22:42:16 Running on server: post build plugin 'Clover Delta Calculator'
25-Oct-2019 22:42:16 Running on server: post build plugin 'Maven Dependencies Postprocessor'
25-Oct-2019 22:42:16 All post build plugins have finished
25-Oct-2019 22:42:16 Generating build results summary...
25-Oct-2019 22:42:16 Saving build results to disk...
25-Oct-2019 22:42:16 Logging substituted variables...
25-Oct-2019 22:42:16 Indexing build results...
25-Oct-2019 22:42:16 Finished building REP-REP-T1DOT12-795.