Sonar metrics for OpenMRS Core Master

Build: #1014 failed Manual run by Daniel Kayiwa

Build result summary

Details

Completed
Duration
19 minutes
Labels
None
Revision
fe36e2190fa849d14bdb737ec80bc89f35df7756 fe36e2190fa849d14bdb737ec80bc89f35df7756
Total tests
3316
Failing since
#1013 (Scheduled with changes by 5 people)
Fixed in
#1015 (Scheduled)

Tests

Responsible

Code commits

Author Commit Message Commit date
dkayiwa <kayiwadaniel@gmail.com> dkayiwa <kayiwadaniel@gmail.com> fe36e2190fa849d14bdb737ec80bc89f35df7756 fe36e2190fa849d14bdb737ec80bc89f35df7756 Adding setmember to concept with retired set members either does not get added up or gets added in the wrong position - TRUNK-4945

Tests

New test failures 2813
Status Test View job Duration
Collapse Failed AllergenTest isSameAllergen_shouldReturnFalseForDifferentCodedAllergen History
Sonar Full Analysis < 1 sec
java.awt.HeadlessException: 
No X11 DISPLAY variable was set, but this program performed an operation which requires it.
	at java.awt.GraphicsEnvironment.checkHeadless(GraphicsEnvironment.java:204)
	at java.awt.Window.<init>(Window.java:536)
	at java.awt.Frame.<init>(Frame.java:420)
	at java.awt.Frame.<init>(Frame.java:385)
	at javax.swing.JFrame.<init>(JFrame.java:189)
	at org.openmrs.test.BaseContextSensitiveTest.askForUsernameAndPassword(BaseContextSensitiveTest.java:479)
(33 more lines...)
Collapse Failed AllergenTest isSameAllergen_shouldReturnTrueForSameCodedAllergen History
Sonar Full Analysis < 1 sec
java.awt.HeadlessException: 
No X11 DISPLAY variable was set, but this program performed an operation which requires it.
	at java.awt.GraphicsEnvironment.checkHeadless(GraphicsEnvironment.java:204)
	at java.awt.Window.<init>(Window.java:536)
	at java.awt.Frame.<init>(Frame.java:420)
	at java.awt.Frame.<init>(Frame.java:385)
	at javax.swing.JFrame.<init>(JFrame.java:189)
	at org.openmrs.test.BaseContextSensitiveTest.askForUsernameAndPassword(BaseContextSensitiveTest.java:479)
(33 more lines...)
Collapse Failed AllergenTest shouldEitherBeCodedOrFreeText History
Sonar Full Analysis < 1 sec
java.awt.HeadlessException: 
No X11 DISPLAY variable was set, but this program performed an operation which requires it.
	at java.awt.GraphicsEnvironment.checkHeadless(GraphicsEnvironment.java:204)
	at java.awt.Window.<init>(Window.java:536)
	at java.awt.Frame.<init>(Frame.java:420)
	at java.awt.Frame.<init>(Frame.java:385)
	at javax.swing.JFrame.<init>(JFrame.java:189)
	at org.openmrs.test.BaseContextSensitiveTest.askForUsernameAndPassword(BaseContextSensitiveTest.java:479)
(33 more lines...)
Collapse Failed AllergenTest isSameAllergen_shouldBeCaseInsensitiveForNonCodedAllergen History
Sonar Full Analysis < 1 sec
java.awt.HeadlessException: 
No X11 DISPLAY variable was set, but this program performed an operation which requires it.
	at java.awt.GraphicsEnvironment.checkHeadless(GraphicsEnvironment.java:204)
	at java.awt.Window.<init>(Window.java:536)
	at java.awt.Frame.<init>(Frame.java:420)
	at java.awt.Frame.<init>(Frame.java:385)
	at javax.swing.JFrame.<init>(JFrame.java:189)
	at org.openmrs.test.BaseContextSensitiveTest.askForUsernameAndPassword(BaseContextSensitiveTest.java:479)
(33 more lines...)
Collapse Failed AllergenTest isSameAllergen_shouldReturnFalseForDifferentNonCodedAllergen History
Sonar Full Analysis < 1 sec
java.awt.HeadlessException: 
No X11 DISPLAY variable was set, but this program performed an operation which requires it.
	at java.awt.GraphicsEnvironment.checkHeadless(GraphicsEnvironment.java:204)
	at java.awt.Window.<init>(Window.java:536)
	at java.awt.Frame.<init>(Frame.java:420)
	at java.awt.Frame.<init>(Frame.java:385)
	at javax.swing.JFrame.<init>(JFrame.java:189)
	at org.openmrs.test.BaseContextSensitiveTest.askForUsernameAndPassword(BaseContextSensitiveTest.java:479)
(33 more lines...)
Collapse Failed AllergenTest isSameAllergen_shouldReturnTrueForSameNonCodedAllergen History
Sonar Full Analysis < 1 sec
java.awt.HeadlessException: 
No X11 DISPLAY variable was set, but this program performed an operation which requires it.
	at java.awt.GraphicsEnvironment.checkHeadless(GraphicsEnvironment.java:204)
	at java.awt.Window.<init>(Window.java:536)
	at java.awt.Frame.<init>(Frame.java:420)
	at java.awt.Frame.<init>(Frame.java:385)
	at javax.swing.JFrame.<init>(JFrame.java:189)
	at org.openmrs.test.BaseContextSensitiveTest.askForUsernameAndPassword(BaseContextSensitiveTest.java:479)
(33 more lines...)
Collapse Failed AllergiesTest addAll2_shouldAllowNonDuplicateCodedAllergen History
Sonar Full Analysis < 1 sec
java.awt.HeadlessException: 
No X11 DISPLAY variable was set, but this program performed an operation which requires it.
	at java.awt.GraphicsEnvironment.checkHeadless(GraphicsEnvironment.java:204)
	at java.awt.Window.<init>(Window.java:536)
	at java.awt.Frame.<init>(Frame.java:420)
	at java.awt.Frame.<init>(Frame.java:385)
	at javax.swing.JFrame.<init>(JFrame.java:189)
	at org.openmrs.test.BaseContextSensitiveTest.askForUsernameAndPassword(BaseContextSensitiveTest.java:479)
(33 more lines...)
Collapse Failed AllergiesTest addAll_shouldAllowNonDuplicateNonCodedAllergen History
Sonar Full Analysis < 1 sec
java.awt.HeadlessException: 
No X11 DISPLAY variable was set, but this program performed an operation which requires it.
	at java.awt.GraphicsEnvironment.checkHeadless(GraphicsEnvironment.java:204)
	at java.awt.Window.<init>(Window.java:536)
	at java.awt.Frame.<init>(Frame.java:420)
	at java.awt.Frame.<init>(Frame.java:385)
	at javax.swing.JFrame.<init>(JFrame.java:189)
	at org.openmrs.test.BaseContextSensitiveTest.askForUsernameAndPassword(BaseContextSensitiveTest.java:479)
(33 more lines...)
Collapse Failed AllergiesTest addAll7_shouldNotAllowDuplicateNonCodedAllergen History
Sonar Full Analysis < 1 sec
java.awt.HeadlessException: 
No X11 DISPLAY variable was set, but this program performed an operation which requires it.
	at java.awt.GraphicsEnvironment.checkHeadless(GraphicsEnvironment.java:204)
	at java.awt.Window.<init>(Window.java:536)
	at java.awt.Frame.<init>(Frame.java:420)
	at java.awt.Frame.<init>(Frame.java:385)
	at javax.swing.JFrame.<init>(JFrame.java:189)
	at org.openmrs.test.BaseContextSensitiveTest.askForUsernameAndPassword(BaseContextSensitiveTest.java:479)
(33 more lines...)
Collapse Failed AllergiesTest shouldConfirmNoKnownAllergies History
Sonar Full Analysis < 1 sec
java.awt.HeadlessException: 
No X11 DISPLAY variable was set, but this program performed an operation which requires it.
	at java.awt.GraphicsEnvironment.checkHeadless(GraphicsEnvironment.java:204)
	at java.awt.Window.<init>(Window.java:536)
	at java.awt.Frame.<init>(Frame.java:420)
	at java.awt.Frame.<init>(Frame.java:385)
	at javax.swing.JFrame.<init>(JFrame.java:189)
	at org.openmrs.test.BaseContextSensitiveTest.askForUsernameAndPassword(BaseContextSensitiveTest.java:479)
(33 more lines...)
Collapse Failed AllergiesTest shouldClearAllergyAndSetCorrectStatus History
Sonar Full Analysis < 1 sec
java.awt.HeadlessException: 
No X11 DISPLAY variable was set, but this program performed an operation which requires it.
	at java.awt.GraphicsEnvironment.checkHeadless(GraphicsEnvironment.java:204)
	at java.awt.Window.<init>(Window.java:536)
	at java.awt.Frame.<init>(Frame.java:420)
	at java.awt.Frame.<init>(Frame.java:385)
	at javax.swing.JFrame.<init>(JFrame.java:189)
	at org.openmrs.test.BaseContextSensitiveTest.askForUsernameAndPassword(BaseContextSensitiveTest.java:479)
(33 more lines...)
Collapse Failed AllergiesTest addAll2_shouldAllowNonDuplicateNonCodedAllergen History
Sonar Full Analysis < 1 sec
java.awt.HeadlessException: 
No X11 DISPLAY variable was set, but this program performed an operation which requires it.
	at java.awt.GraphicsEnvironment.checkHeadless(GraphicsEnvironment.java:204)
	at java.awt.Window.<init>(Window.java:536)
	at java.awt.Frame.<init>(Frame.java:420)
	at java.awt.Frame.<init>(Frame.java:385)
	at javax.swing.JFrame.<init>(JFrame.java:189)
	at org.openmrs.test.BaseContextSensitiveTest.askForUsernameAndPassword(BaseContextSensitiveTest.java:479)
(33 more lines...)
Collapse Failed AllergiesTest addAll5_shouldNotAllowDuplicateCodedAllergen History
Sonar Full Analysis < 1 sec
java.awt.HeadlessException: 
No X11 DISPLAY variable was set, but this program performed an operation which requires it.
	at java.awt.GraphicsEnvironment.checkHeadless(GraphicsEnvironment.java:204)
	at java.awt.Window.<init>(Window.java:536)
	at java.awt.Frame.<init>(Frame.java:420)
	at java.awt.Frame.<init>(Frame.java:385)
	at javax.swing.JFrame.<init>(JFrame.java:189)
	at org.openmrs.test.BaseContextSensitiveTest.askForUsernameAndPassword(BaseContextSensitiveTest.java:479)
(33 more lines...)
Collapse Failed AllergiesTest add_shouldAllowNonDuplicateNonCodedAllergen History
Sonar Full Analysis < 1 sec
java.awt.HeadlessException: 
No X11 DISPLAY variable was set, but this program performed an operation which requires it.
	at java.awt.GraphicsEnvironment.checkHeadless(GraphicsEnvironment.java:204)
	at java.awt.Window.<init>(Window.java:536)
	at java.awt.Frame.<init>(Frame.java:420)
	at java.awt.Frame.<init>(Frame.java:385)
	at javax.swing.JFrame.<init>(JFrame.java:189)
	at org.openmrs.test.BaseContextSensitiveTest.askForUsernameAndPassword(BaseContextSensitiveTest.java:479)
(33 more lines...)
Collapse Failed AllergiesTest addAll_shouldNotAllowDuplicateNonCodedAllergen History
Sonar Full Analysis < 1 sec
java.awt.HeadlessException: 
No X11 DISPLAY variable was set, but this program performed an operation which requires it.
	at java.awt.GraphicsEnvironment.checkHeadless(GraphicsEnvironment.java:204)
	at java.awt.Window.<init>(Window.java:536)
	at java.awt.Frame.<init>(Frame.java:420)
	at java.awt.Frame.<init>(Frame.java:385)
	at javax.swing.JFrame.<init>(JFrame.java:189)
	at org.openmrs.test.BaseContextSensitiveTest.askForUsernameAndPassword(BaseContextSensitiveTest.java:479)
(33 more lines...)
Collapse Failed AllergiesTest add_shouldAllowNonDuplicateCodedAllergen History
Sonar Full Analysis < 1 sec
java.awt.HeadlessException: 
No X11 DISPLAY variable was set, but this program performed an operation which requires it.
	at java.awt.GraphicsEnvironment.checkHeadless(GraphicsEnvironment.java:204)
	at java.awt.Window.<init>(Window.java:536)
	at java.awt.Frame.<init>(Frame.java:420)
	at java.awt.Frame.<init>(Frame.java:385)
	at javax.swing.JFrame.<init>(JFrame.java:189)
	at org.openmrs.test.BaseContextSensitiveTest.askForUsernameAndPassword(BaseContextSensitiveTest.java:479)
(33 more lines...)
Collapse Failed AllergiesTest shouldThrowAnErrorWhenTryingConfirmNoKnowAllergiesWhileAllergiesIsNotEmpty History
Sonar Full Analysis < 1 sec
java.awt.HeadlessException: 
No X11 DISPLAY variable was set, but this program performed an operation which requires it.
	at java.awt.GraphicsEnvironment.checkHeadless(GraphicsEnvironment.java:204)
	at java.awt.Window.<init>(Window.java:536)
	at java.awt.Frame.<init>(Frame.java:420)
	at java.awt.Frame.<init>(Frame.java:385)
	at javax.swing.JFrame.<init>(JFrame.java:189)
	at org.openmrs.test.BaseContextSensitiveTest.askForUsernameAndPassword(BaseContextSensitiveTest.java:479)
(33 more lines...)
Collapse Failed AllergiesTest addAll2_shouldNotAllowDuplicateCodedAllergen History
Sonar Full Analysis < 1 sec
java.awt.HeadlessException: 
No X11 DISPLAY variable was set, but this program performed an operation which requires it.
	at java.awt.GraphicsEnvironment.checkHeadless(GraphicsEnvironment.java:204)
	at java.awt.Window.<init>(Window.java:536)
	at java.awt.Frame.<init>(Frame.java:420)
	at java.awt.Frame.<init>(Frame.java:385)
	at javax.swing.JFrame.<init>(JFrame.java:189)
	at org.openmrs.test.BaseContextSensitiveTest.askForUsernameAndPassword(BaseContextSensitiveTest.java:479)
(33 more lines...)
Collapse Failed AllergiesTest addAll_shouldAllowNonDuplicateCodedAllergen History
Sonar Full Analysis < 1 sec
java.awt.HeadlessException: 
No X11 DISPLAY variable was set, but this program performed an operation which requires it.
	at java.awt.GraphicsEnvironment.checkHeadless(GraphicsEnvironment.java:204)
	at java.awt.Window.<init>(Window.java:536)
	at java.awt.Frame.<init>(Frame.java:420)
	at java.awt.Frame.<init>(Frame.java:385)
	at javax.swing.JFrame.<init>(JFrame.java:189)
	at org.openmrs.test.BaseContextSensitiveTest.askForUsernameAndPassword(BaseContextSensitiveTest.java:479)
(33 more lines...)
Collapse Failed AllergiesTest shouldAddAllergyAndSetCorrectStatus History
Sonar Full Analysis < 1 sec
java.awt.HeadlessException: 
No X11 DISPLAY variable was set, but this program performed an operation which requires it.
	at java.awt.GraphicsEnvironment.checkHeadless(GraphicsEnvironment.java:204)
	at java.awt.Window.<init>(Window.java:536)
	at java.awt.Frame.<init>(Frame.java:420)
	at java.awt.Frame.<init>(Frame.java:385)
	at javax.swing.JFrame.<init>(JFrame.java:189)
	at org.openmrs.test.BaseContextSensitiveTest.askForUsernameAndPassword(BaseContextSensitiveTest.java:479)
(33 more lines...)
Collapse Failed AllergiesTest shouldRemoveAllergyAndSetCorrectStatus History
Sonar Full Analysis < 1 sec
java.awt.HeadlessException: 
No X11 DISPLAY variable was set, but this program performed an operation which requires it.
	at java.awt.GraphicsEnvironment.checkHeadless(GraphicsEnvironment.java:204)
	at java.awt.Window.<init>(Window.java:536)
	at java.awt.Frame.<init>(Frame.java:420)
	at java.awt.Frame.<init>(Frame.java:385)
	at javax.swing.JFrame.<init>(JFrame.java:189)
	at org.openmrs.test.BaseContextSensitiveTest.askForUsernameAndPassword(BaseContextSensitiveTest.java:479)
(33 more lines...)
Collapse Failed AllergiesTest addAll_shouldNotAllowDuplicateCodedAllergen History
Sonar Full Analysis < 1 sec
java.awt.HeadlessException: 
No X11 DISPLAY variable was set, but this program performed an operation which requires it.
	at java.awt.GraphicsEnvironment.checkHeadless(GraphicsEnvironment.java:204)
	at java.awt.Window.<init>(Window.java:536)
	at java.awt.Frame.<init>(Frame.java:420)
	at java.awt.Frame.<init>(Frame.java:385)
	at javax.swing.JFrame.<init>(JFrame.java:189)
	at org.openmrs.test.BaseContextSensitiveTest.askForUsernameAndPassword(BaseContextSensitiveTest.java:479)
(33 more lines...)
Collapse Failed AllergiesTest add2_shouldNotAllowDuplicateNonCodedAllergen History
Sonar Full Analysis < 1 sec
java.awt.HeadlessException: 
No X11 DISPLAY variable was set, but this program performed an operation which requires it.
	at java.awt.GraphicsEnvironment.checkHeadless(GraphicsEnvironment.java:204)
	at java.awt.Window.<init>(Window.java:536)
	at java.awt.Frame.<init>(Frame.java:420)
	at java.awt.Frame.<init>(Frame.java:385)
	at javax.swing.JFrame.<init>(JFrame.java:189)
	at org.openmrs.test.BaseContextSensitiveTest.askForUsernameAndPassword(BaseContextSensitiveTest.java:479)
(33 more lines...)
Collapse Failed AllergiesTest addAll4_shouldNotAllowDuplicateCodedAllergen History
Sonar Full Analysis < 1 sec
java.awt.HeadlessException: 
No X11 DISPLAY variable was set, but this program performed an operation which requires it.
	at java.awt.GraphicsEnvironment.checkHeadless(GraphicsEnvironment.java:204)
	at java.awt.Window.<init>(Window.java:536)
	at java.awt.Frame.<init>(Frame.java:420)
	at java.awt.Frame.<init>(Frame.java:385)
	at javax.swing.JFrame.<init>(JFrame.java:189)
	at org.openmrs.test.BaseContextSensitiveTest.askForUsernameAndPassword(BaseContextSensitiveTest.java:479)
(33 more lines...)
Collapse Failed AllergiesTest addAll2_shouldNotAllowDuplicateNonCodedAllergen History
Sonar Full Analysis < 1 sec
java.awt.HeadlessException: 
No X11 DISPLAY variable was set, but this program performed an operation which requires it.
	at java.awt.GraphicsEnvironment.checkHeadless(GraphicsEnvironment.java:204)
	at java.awt.Window.<init>(Window.java:536)
	at java.awt.Frame.<init>(Frame.java:420)
	at java.awt.Frame.<init>(Frame.java:385)
	at javax.swing.JFrame.<init>(JFrame.java:189)
	at org.openmrs.test.BaseContextSensitiveTest.askForUsernameAndPassword(BaseContextSensitiveTest.java:479)
(33 more lines...)
Collapse Failed AllergiesTest add_shouldNotAllowDuplicateCodedAllergen History
Sonar Full Analysis < 1 sec
java.awt.HeadlessException: 
No X11 DISPLAY variable was set, but this program performed an operation which requires it.
	at java.awt.GraphicsEnvironment.checkHeadless(GraphicsEnvironment.java:204)
	at java.awt.Window.<init>(Window.java:536)
	at java.awt.Frame.<init>(Frame.java:420)
	at java.awt.Frame.<init>(Frame.java:385)
	at javax.swing.JFrame.<init>(JFrame.java:189)
	at org.openmrs.test.BaseContextSensitiveTest.askForUsernameAndPassword(BaseContextSensitiveTest.java:479)
(33 more lines...)
Collapse Failed AllergiesTest shouldAddAllergyCollectionAndSetCorrectStatus History
Sonar Full Analysis < 1 sec
java.awt.HeadlessException: 
No X11 DISPLAY variable was set, but this program performed an operation which requires it.
	at java.awt.GraphicsEnvironment.checkHeadless(GraphicsEnvironment.java:204)
	at java.awt.Window.<init>(Window.java:536)
	at java.awt.Frame.<init>(Frame.java:420)
	at java.awt.Frame.<init>(Frame.java:385)
	at javax.swing.JFrame.<init>(JFrame.java:189)
	at org.openmrs.test.BaseContextSensitiveTest.askForUsernameAndPassword(BaseContextSensitiveTest.java:479)
(33 more lines...)
Collapse Failed AllergiesTest add2_shouldAllowNonDuplicateCodedAllergen History
Sonar Full Analysis < 1 sec
java.awt.HeadlessException: 
No X11 DISPLAY variable was set, but this program performed an operation which requires it.
	at java.awt.GraphicsEnvironment.checkHeadless(GraphicsEnvironment.java:204)
	at java.awt.Window.<init>(Window.java:536)
	at java.awt.Frame.<init>(Frame.java:420)
	at java.awt.Frame.<init>(Frame.java:385)
	at javax.swing.JFrame.<init>(JFrame.java:189)
	at org.openmrs.test.BaseContextSensitiveTest.askForUsernameAndPassword(BaseContextSensitiveTest.java:479)
(33 more lines...)
Collapse Failed AllergiesTest add2_shouldNotAllowDuplicateCodedAllergen History
Sonar Full Analysis < 1 sec
java.awt.HeadlessException: 
No X11 DISPLAY variable was set, but this program performed an operation which requires it.
	at java.awt.GraphicsEnvironment.checkHeadless(GraphicsEnvironment.java:204)
	at java.awt.Window.<init>(Window.java:536)
	at java.awt.Frame.<init>(Frame.java:420)
	at java.awt.Frame.<init>(Frame.java:385)
	at javax.swing.JFrame.<init>(JFrame.java:189)
	at org.openmrs.test.BaseContextSensitiveTest.askForUsernameAndPassword(BaseContextSensitiveTest.java:479)
(33 more lines...)
Collapse Failed AllergiesTest add2_shouldAllowNonDuplicateNonCodedAllergen History
Sonar Full Analysis < 1 sec
java.awt.HeadlessException: 
No X11 DISPLAY variable was set, but this program performed an operation which requires it.
	at java.awt.GraphicsEnvironment.checkHeadless(GraphicsEnvironment.java:204)
	at java.awt.Window.<init>(Window.java:536)
	at java.awt.Frame.<init>(Frame.java:420)
	at java.awt.Frame.<init>(Frame.java:385)
	at javax.swing.JFrame.<init>(JFrame.java:189)
	at org.openmrs.test.BaseContextSensitiveTest.askForUsernameAndPassword(BaseContextSensitiveTest.java:479)
(33 more lines...)
Collapse Failed AllergiesTest addAll6_shouldNotAllowDuplicateNonCodedAllergen History
Sonar Full Analysis < 1 sec
java.awt.HeadlessException: 
No X11 DISPLAY variable was set, but this program performed an operation which requires it.
	at java.awt.GraphicsEnvironment.checkHeadless(GraphicsEnvironment.java:204)
	at java.awt.Window.<init>(Window.java:536)
	at java.awt.Frame.<init>(Frame.java:420)
	at java.awt.Frame.<init>(Frame.java:385)
	at javax.swing.JFrame.<init>(JFrame.java:189)
	at org.openmrs.test.BaseContextSensitiveTest.askForUsernameAndPassword(BaseContextSensitiveTest.java:479)
(33 more lines...)
Collapse Failed AllergiesTest add_shouldNotAllowDuplicateNonCodedAllergen History
Sonar Full Analysis < 1 sec
java.awt.HeadlessException: 
No X11 DISPLAY variable was set, but this program performed an operation which requires it.
	at java.awt.GraphicsEnvironment.checkHeadless(GraphicsEnvironment.java:204)
	at java.awt.Window.<init>(Window.java:536)
	at java.awt.Frame.<init>(Frame.java:420)
	at java.awt.Frame.<init>(Frame.java:385)
	at javax.swing.JFrame.<init>(JFrame.java:189)
	at org.openmrs.test.BaseContextSensitiveTest.askForUsernameAndPassword(BaseContextSensitiveTest.java:479)
(33 more lines...)
Collapse Failed BaseCustomizableMetadataTest setAttribute_shouldWorkForAttriubutesWithDatatypesWhoseValuesAreStoredInOtherTables History
Sonar Full Analysis < 1 sec
java.awt.HeadlessException: 
No X11 DISPLAY variable was set, but this program performed an operation which requires it.
	at java.awt.GraphicsEnvironment.checkHeadless(GraphicsEnvironment.java:204)
	at java.awt.Window.<init>(Window.java:536)
	at java.awt.Frame.<init>(Frame.java:420)
	at java.awt.Frame.<init>(Frame.java:385)
	at javax.swing.JFrame.<init>(JFrame.java:189)
	at org.openmrs.test.BaseContextSensitiveTest.askForUsernameAndPassword(BaseContextSensitiveTest.java:479)
(33 more lines...)
Collapse Failed BaseCustomizableMetadataTest setAttribute_shouldVoidTheAttributeIfAnAttributeWithSameAttributeTypeAlreadyExistsAndTheMaxOccursIsSetTo1 History
Sonar Full Analysis < 1 sec
java.awt.HeadlessException: 
No X11 DISPLAY variable was set, but this program performed an operation which requires it.
	at java.awt.GraphicsEnvironment.checkHeadless(GraphicsEnvironment.java:204)
	at java.awt.Window.<init>(Window.java:536)
	at java.awt.Frame.<init>(Frame.java:420)
	at java.awt.Frame.<init>(Frame.java:385)
	at javax.swing.JFrame.<init>(JFrame.java:189)
	at org.openmrs.test.BaseContextSensitiveTest.askForUsernameAndPassword(BaseContextSensitiveTest.java:479)
(33 more lines...)
Collapse Failed BaseOpenmrsObjectTest toString_shouldIncludeUuidIfNotNull History
Sonar Full Analysis < 1 sec
java.awt.HeadlessException: 
No X11 DISPLAY variable was set, but this program performed an operation which requires it.
	at java.awt.GraphicsEnvironment.checkHeadless(GraphicsEnvironment.java:204)
	at java.awt.Window.<init>(Window.java:536)
	at java.awt.Frame.<init>(Frame.java:420)
	at java.awt.Frame.<init>(Frame.java:385)
	at javax.swing.JFrame.<init>(JFrame.java:189)
	at org.openmrs.test.BaseContextSensitiveTest.askForUsernameAndPassword(BaseContextSensitiveTest.java:479)
(33 more lines...)
Collapse Failed BaseOpenmrsObjectTest equals_shouldReturnFalseIfGivenObjectIsNotSubclassOfSuperOrExtendingClass History
Sonar Full Analysis < 1 sec
java.awt.HeadlessException: 
No X11 DISPLAY variable was set, but this program performed an operation which requires it.
	at java.awt.GraphicsEnvironment.checkHeadless(GraphicsEnvironment.java:204)
	at java.awt.Window.<init>(Window.java:536)
	at java.awt.Frame.<init>(Frame.java:420)
	at java.awt.Frame.<init>(Frame.java:385)
	at javax.swing.JFrame.<init>(JFrame.java:189)
	at org.openmrs.test.BaseContextSensitiveTest.askForUsernameAndPassword(BaseContextSensitiveTest.java:479)
(34 more lines...)
Collapse Failed BaseOpenmrsObjectTest equals_shouldReturnFalseIfGivenObjIsNull History
Sonar Full Analysis < 1 sec
java.awt.HeadlessException: 
No X11 DISPLAY variable was set, but this program performed an operation which requires it.
	at java.awt.GraphicsEnvironment.checkHeadless(GraphicsEnvironment.java:204)
	at java.awt.Window.<init>(Window.java:536)
	at java.awt.Frame.<init>(Frame.java:420)
	at java.awt.Frame.<init>(Frame.java:385)
	at javax.swing.JFrame.<init>(JFrame.java:189)
	at org.openmrs.test.BaseContextSensitiveTest.askForUsernameAndPassword(BaseContextSensitiveTest.java:479)
(34 more lines...)
Collapse Failed BaseOpenmrsObjectTest equals_shouldReturnTrueIfGivenObjectIsInstanceOfSuperOrExtendingClass History
Sonar Full Analysis < 1 sec
java.awt.HeadlessException: 
No X11 DISPLAY variable was set, but this program performed an operation which requires it.
	at java.awt.GraphicsEnvironment.checkHeadless(GraphicsEnvironment.java:204)
	at java.awt.Window.<init>(Window.java:536)
	at java.awt.Frame.<init>(Frame.java:420)
	at java.awt.Frame.<init>(Frame.java:385)
	at javax.swing.JFrame.<init>(JFrame.java:189)
	at org.openmrs.test.BaseContextSensitiveTest.askForUsernameAndPassword(BaseContextSensitiveTest.java:479)
(33 more lines...)
Collapse Failed BaseOpenmrsObjectTest shouldNotBeEqualWhenDifferentClassesAndSameId History
Sonar Full Analysis < 1 sec
java.awt.HeadlessException: 
No X11 DISPLAY variable was set, but this program performed an operation which requires it.
	at java.awt.GraphicsEnvironment.checkHeadless(GraphicsEnvironment.java:204)
	at java.awt.Window.<init>(Window.java:536)
	at java.awt.Frame.<init>(Frame.java:420)
	at java.awt.Frame.<init>(Frame.java:385)
	at javax.swing.JFrame.<init>(JFrame.java:189)
	at org.openmrs.test.BaseContextSensitiveTest.askForUsernameAndPassword(BaseContextSensitiveTest.java:479)
(33 more lines...)
Collapse Failed BaseOpenmrsObjectTest hashCode_shouldNotFailIfUuidIsNull History
Sonar Full Analysis < 1 sec
java.awt.HeadlessException: 
No X11 DISPLAY variable was set, but this program performed an operation which requires it.
	at java.awt.GraphicsEnvironment.checkHeadless(GraphicsEnvironment.java:204)
	at java.awt.Window.<init>(Window.java:536)
	at java.awt.Frame.<init>(Frame.java:420)
	at java.awt.Frame.<init>(Frame.java:385)
	at javax.swing.JFrame.<init>(JFrame.java:189)
	at org.openmrs.test.BaseContextSensitiveTest.askForUsernameAndPassword(BaseContextSensitiveTest.java:479)
(33 more lines...)
Collapse Failed BaseOpenmrsObjectTest equals_shouldReturnTrueIfUuidsAreEqual History
Sonar Full Analysis 3 secs
java.awt.HeadlessException: 
No X11 DISPLAY variable was set, but this program performed an operation which requires it.
	at java.awt.GraphicsEnvironment.checkHeadless(GraphicsEnvironment.java:204)
	at java.awt.Window.<init>(Window.java:536)
	at java.awt.Frame.<init>(Frame.java:420)
	at java.awt.Frame.<init>(Frame.java:385)
	at javax.swing.JFrame.<init>(JFrame.java:189)
	at org.openmrs.test.BaseContextSensitiveTest.askForUsernameAndPassword(BaseContextSensitiveTest.java:479)
(34 more lines...)
Collapse Failed BaseOpenmrsObjectTest shouldNotBeEqualWhenFirstIsNull History
Sonar Full Analysis < 1 sec
java.awt.HeadlessException: 
No X11 DISPLAY variable was set, but this program performed an operation which requires it.
	at java.awt.GraphicsEnvironment.checkHeadless(GraphicsEnvironment.java:204)
	at java.awt.Window.<init>(Window.java:536)
	at java.awt.Frame.<init>(Frame.java:420)
	at java.awt.Frame.<init>(Frame.java:385)
	at javax.swing.JFrame.<init>(JFrame.java:189)
	at org.openmrs.test.BaseContextSensitiveTest.askForUsernameAndPassword(BaseContextSensitiveTest.java:479)
(33 more lines...)
Collapse Failed BaseOpenmrsObjectTest equals_shouldReturnFalseIfGivenObjIsNotInstanceOfBaseOpenmrsObject History
Sonar Full Analysis < 1 sec
java.awt.HeadlessException: 
No X11 DISPLAY variable was set, but this program performed an operation which requires it.
	at java.awt.GraphicsEnvironment.checkHeadless(GraphicsEnvironment.java:204)
	at java.awt.Window.<init>(Window.java:536)
	at java.awt.Frame.<init>(Frame.java:420)
	at java.awt.Frame.<init>(Frame.java:385)
	at javax.swing.JFrame.<init>(JFrame.java:189)
	at org.openmrs.test.BaseContextSensitiveTest.askForUsernameAndPassword(BaseContextSensitiveTest.java:479)
(33 more lines...)
Collapse Failed BaseOpenmrsObjectTest equals_shouldReturnFalseIfGivenObjIsNotInstanceOfSuperOrExtendingClass History
Sonar Full Analysis < 1 sec
java.awt.HeadlessException: 
No X11 DISPLAY variable was set, but this program performed an operation which requires it.
	at java.awt.GraphicsEnvironment.checkHeadless(GraphicsEnvironment.java:204)
	at java.awt.Window.<init>(Window.java:536)
	at java.awt.Frame.<init>(Frame.java:420)
	at java.awt.Frame.<init>(Frame.java:385)
	at javax.swing.JFrame.<init>(JFrame.java:189)
	at org.openmrs.test.BaseContextSensitiveTest.askForUsernameAndPassword(BaseContextSensitiveTest.java:479)
(34 more lines...)
Collapse Failed BaseOpenmrsObjectTest equals_shouldReturnTrueIfHibernateProxyOfSomeObjectComparedToAnotherHibernateProxyOfTheSameObject History
Sonar Full Analysis < 1 sec
java.awt.HeadlessException: 
No X11 DISPLAY variable was set, but this program performed an operation which requires it.
	at java.awt.GraphicsEnvironment.checkHeadless(GraphicsEnvironment.java:204)
	at java.awt.Window.<init>(Window.java:536)
	at java.awt.Frame.<init>(Frame.java:420)
	at java.awt.Frame.<init>(Frame.java:385)
	at javax.swing.JFrame.<init>(JFrame.java:189)
	at org.openmrs.test.BaseContextSensitiveTest.askForUsernameAndPassword(BaseContextSensitiveTest.java:479)
(34 more lines...)
Collapse Failed BaseOpenmrsObjectTest equals_shouldReturnTrueIfHibernateProxyOfOneObjectComparedToNonHibernateProxyOfTheSameObject History
Sonar Full Analysis < 1 sec
java.awt.HeadlessException: 
No X11 DISPLAY variable was set, but this program performed an operation which requires it.
	at java.awt.GraphicsEnvironment.checkHeadless(GraphicsEnvironment.java:204)
	at java.awt.Window.<init>(Window.java:536)
	at java.awt.Frame.<init>(Frame.java:420)
	at java.awt.Frame.<init>(Frame.java:385)
	at javax.swing.JFrame.<init>(JFrame.java:189)
	at org.openmrs.test.BaseContextSensitiveTest.askForUsernameAndPassword(BaseContextSensitiveTest.java:479)
(33 more lines...)
Collapse Failed BaseOpenmrsObjectTest equals_shouldReturnFalseIfUuidIsNull History
Sonar Full Analysis < 1 sec
java.awt.HeadlessException: 
No X11 DISPLAY variable was set, but this program performed an operation which requires it.
	at java.awt.GraphicsEnvironment.checkHeadless(GraphicsEnvironment.java:204)
	at java.awt.Window.<init>(Window.java:536)
	at java.awt.Frame.<init>(Frame.java:420)
	at java.awt.Frame.<init>(Frame.java:385)
	at javax.swing.JFrame.<init>(JFrame.java:189)
	at org.openmrs.test.BaseContextSensitiveTest.askForUsernameAndPassword(BaseContextSensitiveTest.java:479)
(33 more lines...)
Collapse Failed BaseOpenmrsObjectTest toString_shouldIncludeHashCodeIfUuidIsNull History
Sonar Full Analysis < 1 sec
java.awt.HeadlessException: 
No X11 DISPLAY variable was set, but this program performed an operation which requires it.
	at java.awt.GraphicsEnvironment.checkHeadless(GraphicsEnvironment.java:204)
	at java.awt.Window.<init>(Window.java:536)
	at java.awt.Frame.<init>(Frame.java:420)
	at java.awt.Frame.<init>(Frame.java:385)
	at javax.swing.JFrame.<init>(JFrame.java:189)
	at org.openmrs.test.BaseContextSensitiveTest.askForUsernameAndPassword(BaseContextSensitiveTest.java:479)
(33 more lines...)
Collapse Failed BaseOpenmrsObjectTest equals_shouldReturnfalseIfHibernateProxyOfOneThingIsComparedtoHibernateProxyofSomething History
Sonar Full Analysis < 1 sec
java.awt.HeadlessException: 
No X11 DISPLAY variable was set, but this program performed an operation which requires it.
	at java.awt.GraphicsEnvironment.checkHeadless(GraphicsEnvironment.java:204)
	at java.awt.Window.<init>(Window.java:536)
	at java.awt.Frame.<init>(Frame.java:420)
	at java.awt.Frame.<init>(Frame.java:385)
	at javax.swing.JFrame.<init>(JFrame.java:189)
	at org.openmrs.test.BaseContextSensitiveTest.askForUsernameAndPassword(BaseContextSensitiveTest.java:479)
(33 more lines...)
Collapse Failed BaseOpenmrsObjectTest equals_shouldReturnTrueIfGivenObjectIsSubclassOfSuperOrExtendingClass History
Sonar Full Analysis < 1 sec
java.awt.HeadlessException: 
No X11 DISPLAY variable was set, but this program performed an operation which requires it.
	at java.awt.GraphicsEnvironment.checkHeadless(GraphicsEnvironment.java:204)
	at java.awt.Window.<init>(Window.java:536)
	at java.awt.Frame.<init>(Frame.java:420)
	at java.awt.Frame.<init>(Frame.java:385)
	at javax.swing.JFrame.<init>(JFrame.java:189)
	at org.openmrs.test.BaseContextSensitiveTest.askForUsernameAndPassword(BaseContextSensitiveTest.java:479)
(34 more lines...)

Jira issues

IssueDescriptionStatus
Unknown Issue TypeTRUNK-4945Could not obtain issue details from Jira