Sonar metrics for OpenMRS Core Master

Build: #1210 failed Scheduled with changes by 3 people

Test results

  • 3,452 tests in total
  • 3 tests failed
  • 3 failures are new
  • 38 tests were quarantined / skipped
  • 64 minutes taken in total.
New test failures 3
Status Test View job Duration
Collapse Failed ReflectTest getInheritedFields_shouldReturnOnlyTheSubClassFieldsOfGivenParameterizedClass History
Sonar Full Analysis < 1 sec
java.lang.IllegalArgumentException: Field not found!
	at org.openmrs.util.ReflectTest.findFieldByName(ReflectTest.java:62)
	at org.openmrs.util.ReflectTest.getInheritedFields_shouldReturnOnlyTheSubClassFieldsOfGivenParameterizedClass(ReflectTest.java:133)
Collapse Failed ReflectTest isCollection_shouldReturnFalseIfGivenFieldClassIsNotACollectionClass History
Sonar Full Analysis < 1 sec
java.lang.IllegalArgumentException: Field not found!
	at org.openmrs.util.ReflectTest.findFieldByName(ReflectTest.java:62)
	at org.openmrs.util.ReflectTest.isCollection_shouldReturnFalseIfGivenFieldClassIsNotACollectionClass(ReflectTest.java:86)
Collapse Failed ReflectTest getAllFields_shouldReturnAllFieldsIncludePrivateAndSuperClasses History
Sonar Full Analysis < 1 sec
java.lang.IllegalArgumentException: Field not found!
	at org.openmrs.util.ReflectTest.findFieldByName(ReflectTest.java:62)
	at org.openmrs.util.ReflectTest.getAllFields_shouldReturnAllFieldsIncludePrivateAndSuperClasses(ReflectTest.java:74)
Quarantined tests 1
Status Test Failing since Quarantined by View job Duration
Successful ModuleActivatorTest shouldStopDependantModulesOnStopModule History
Rafal Korytkowski Rafal Korytkowski
Sonar Full Analysis 20 secs
Skipped tests 37
Status Test Failing since View job
Skipped ObsBehaviorTest shouldVoidAndReplaceOnlyEditedUnvoidedObsWhenTheyAreFlushedToTheDatabase History
Sonar Full Analysis
Skipped OpenmrsProfileExcludeFilterTest shouldBeIgnoredIfModuleDoesNotMatch History
Failing since build #1014 (Manual run by Daniel Kayiwa) Sonar Full Analysis
Skipped OpenmrsProfileExcludeFilterTest shouldBeIgnoredIfOpenmrsVersionDoesNotMatch History
Failing since build #1014 (Manual run by Daniel Kayiwa) Sonar Full Analysis
Skipped AdministrationServiceTest setImplementationId_shouldSetUuidOnImplementationIdGlobalProperty History
Sonar Full Analysis
Skipped AdministrationServiceTest setImplementationId_shouldOverwriteImplementationIdInDatabaseIfExists History
Sonar Full Analysis
Skipped AdministrationServiceTest getPresentationLocales_shouldReturnAtLeastOneLocaleIfNoLocalesDefinedInDatabaseYet History
Sonar Full Analysis
Skipped AdministrationServiceTest setImplementationId_shouldCreateImplementationIdInDatabase History
Sonar Full Analysis
Skipped ConceptServiceTest saveConcept_shouldNotSetAuditInfoIfTheConceptIsNotEdited History
Sonar Full Analysis
Skipped EncounterServiceTest getEncounters_shouldNotReturnVoidedEncountersIfIncludeVoidedIsSetToTrue History
Sonar Full Analysis
Skipped EncounterServiceTest getEncounters_shouldGetAllTheUniqueEncountersThatMatchTheSpecifiedParameterValues History
Sonar Full Analysis
Skipped OpenmrsServiceTest shouldCheckThatAMethodIsNotRolledBackInCaseOfAnErrorInAnotherInvokedInsideIt History
Sonar Full Analysis
Skipped OrderServiceTest saveOrder_shouldPassForRevisionOrderIfAnActiveTestOrderForTheSameConceptAndCareSettingsExists History
Sonar Full Analysis
Skipped OrderServiceTest saveOrder_shouldSaveRevisionOrderScheduledOnDateNotOverlappingWithAnActiveOrderForTheSameConceptAndCareSetting History
Sonar Full Analysis
Skipped OrderServiceTest saveOrder_shouldFailForRevisionOrderIfAnActiveDrugOrderForTheSameConceptAndCareSettingsExists History
Sonar Full Analysis
Skipped PatientServiceTest voidPatient_shouldReturnNullWhenPatientIsNull History
Sonar Full Analysis
Skipped ProviderServiceTest getCountOfProviders_shouldIncludeRetiredProvidersIfIncludeRetiredIsSetToTrue History
Sonar Full Analysis
Skipped ProviderServiceTest getCountOfProviders_shouldExcludeRetiredProviders History
Sonar Full Analysis
Skipped UserServiceTest changeQuestionAnswer_shouldChangeTheSecretQuestionAndAnswerForGivenUser History
Sonar Full Analysis
Skipped ConceptDAOTest getConcepts_shouldReturnCorrectResultsIfAConceptNameContainsSameWordMoreThanOnce History
Sonar Full Analysis
Skipped ConceptDAOTest getConcepts_shouldReturnCorrectResultsForConceptWithNamesThatContainsWordsWithMoreWeight History
Sonar Full Analysis
Skipped PatientDAOTest getPatients_shouldFindPatientsEfficiently History
Sonar Full Analysis
Skipped SerializedObjectDAOTest org.openmrs.api.db.SerializedObjectDAOTest History
Sonar Full Analysis
Skipped HL7ServiceTest processHL7InQueue_shouldParseOruR01MessageUsingOverriddenParserProvidedByAModule History
Sonar Full Analysis
Skipped HL7ServiceTest processHL7Message_shouldParseMessageTypeSuppliedByModule History
Sonar Full Analysis
Skipped SchedulerServiceTest org.openmrs.scheduler.SchedulerServiceTest History
Sonar Full Analysis
Skipped ConceptReferenceTermValidatorTest validate_shouldFailIfTheNameIsNull History
Sonar Full Analysis
Skipped ConceptReferenceTermValidatorTest validate_shouldFailIfTheNameIsAnEmptyString History
Sonar Full Analysis
Skipped ConceptReferenceTermValidatorTest validate_shouldFailIfTheNameIsAWhiteSpaceCharacter History
Sonar Full Analysis
Skipped PersonNameValidatorTest validate_shouldFailValidationIfPersonNameFamilyName2HasLeadingSpaces History
Sonar Full Analysis
Skipped PersonNameValidatorTest validate_shouldFailValidationIfPersonNameMiddleNameHasTrailingSpaces History
Sonar Full Analysis
Skipped PersonNameValidatorTest validate_shouldFailValidationIfPersonNameFamilyName2HasTrailingSpaces History
Sonar Full Analysis
Skipped PersonNameValidatorTest validate_shouldFailValidationIfPersonNameFamilyNameHasTrailingSpaces History
Sonar Full Analysis
Skipped PersonNameValidatorTest validate_shouldFailValidationIfPersonNameFamilyNameHasLeadingSpaces History
Sonar Full Analysis
Skipped PersonNameValidatorTest validate_shouldFailValidationIfPersonNameGivenNameHasTrailingSpaces History
Sonar Full Analysis
Skipped PersonNameValidatorTest validate_shouldFailValidationIfPersonNameGivenNameHasLeadingSpaces History
Sonar Full Analysis
Skipped PersonNameValidatorTest validate_shouldFailValidationIfPersonNameMiddleNameHasLeadingSpaces History
Sonar Full Analysis
Skipped VisitValidatorTest validate_shouldFailIfAnAttributeIsBad History
Sonar Full Analysis