Build: #271 failed Changes by dkayiwa <kayiwadaniel@gmail.com>

Stages & jobs

  1. Default Stage

  2. Deploy

  3. Release

    Requires a user to start manually

Test results

  • 2,254 tests in total
  • 13 tests failed
  • 12 failures are new
  • 26 tests were quarantined / skipped
  • 3 minutes taken in total.
New test failures 12
Status Test View job Duration
Collapse Failed SchedulerServiceTest saveTask_shouldSaveTaskToTheDatabase History
Default Job < 1 sec
org.springframework.beans.FatalBeanException: Failed to obtain BeanInfo for class [org.openmrs.scheduler.TaskDefinition]; nested exception is java.beans.IntrospectionException: type mismatch between read and write methods
	at org.springframework.beans.CachedIntrospectionResults.<init>(CachedIntrospectionResults.java:262)
	at org.springframework.beans.CachedIntrospectionResults.forClass(CachedIntrospectionResults.java:149)
	at org.springframework.beans.BeanWrapperImpl.getCachedIntrospectionResults(BeanWrapperImpl.java:324)
	at org.springframework.beans.BeanWrapperImpl.getPropertyValue(BeanWrapperImpl.java:727)
	at org.springframework.beans.BeanWrapperImpl.getPropertyValue(BeanWrapperImpl.java:721)
	at org.springframework.validation.AbstractPropertyBindingResult.getActualFieldValue(AbstractPropertyBindingResult.java:99)
	at org.springframework.validation.AbstractBindingResult.getFieldValue(AbstractBindingResult.java:226)
(146 more lines...)
Collapse Failed SchedulerServiceTest shouldSaveLastExecutionTime History
Default Job < 1 sec
org.springframework.beans.FatalBeanException: Failed to obtain BeanInfo for class [org.openmrs.scheduler.TaskDefinition]; nested exception is java.beans.IntrospectionException: type mismatch between read and write methods
	at org.springframework.beans.CachedIntrospectionResults.<init>(CachedIntrospectionResults.java:262)
	at org.springframework.beans.CachedIntrospectionResults.forClass(CachedIntrospectionResults.java:149)
	at org.springframework.beans.BeanWrapperImpl.getCachedIntrospectionResults(BeanWrapperImpl.java:324)
	at org.springframework.beans.BeanWrapperImpl.getPropertyValue(BeanWrapperImpl.java:727)
	at org.springframework.beans.BeanWrapperImpl.getPropertyValue(BeanWrapperImpl.java:721)
	at org.springframework.validation.AbstractPropertyBindingResult.getActualFieldValue(AbstractPropertyBindingResult.java:99)
	at org.springframework.validation.AbstractBindingResult.getFieldValue(AbstractBindingResult.java:226)
(148 more lines...)
Collapse Failed SchedulerServiceTest shouldNotThrowExceptionWhenTaskDefinitionIsNull History
Default Job < 1 sec
org.openmrs.scheduler.SchedulerException: Failed to schedule task
	at org.openmrs.scheduler.timer.TimerSchedulerServiceImpl.scheduleTask(TimerSchedulerServiceImpl.java:257)
	at sun.reflect.NativeMethodAccessorImpl.invoke0(Native Method)
	at sun.reflect.NativeMethodAccessorImpl.invoke(NativeMethodAccessorImpl.java:62)
	at sun.reflect.DelegatingMethodAccessorImpl.invoke(DelegatingMethodAccessorImpl.java:43)
	at java.lang.reflect.Method.invoke(Method.java:498)
	at org.springframework.aop.support.AopUtils.invokeJoinpointUsingReflection(AopUtils.java:318)
	at org.springframework.aop.framework.ReflectiveMethodInvocation.invokeJoinpoint(ReflectiveMethodInvocation.java:183)
(149 more lines...)
Collapse Failed SchedulerServiceTest shouldNotAllowTaskExecuteToRunBeforeInitializationIsComplete History
Default Job < 1 sec
org.openmrs.scheduler.SchedulerException: Failed to schedule task
	at org.openmrs.scheduler.timer.TimerSchedulerServiceImpl.scheduleTask(TimerSchedulerServiceImpl.java:257)
	at sun.reflect.NativeMethodAccessorImpl.invoke0(Native Method)
	at sun.reflect.NativeMethodAccessorImpl.invoke(NativeMethodAccessorImpl.java:62)
	at sun.reflect.DelegatingMethodAccessorImpl.invoke(DelegatingMethodAccessorImpl.java:43)
	at java.lang.reflect.Method.invoke(Method.java:498)
	at org.springframework.aop.support.AopUtils.invokeJoinpointUsingReflection(AopUtils.java:318)
	at org.springframework.aop.framework.ReflectiveMethodInvocation.invokeJoinpoint(ReflectiveMethodInvocation.java:183)
(152 more lines...)
Collapse Failed SchedulerFormValidatorTest validate_shouldFailValidationIfNameIsNullOrEmptyOrWhitespace History
Default Job < 1 sec
org.springframework.beans.FatalBeanException: Failed to obtain BeanInfo for class [org.openmrs.scheduler.TaskDefinition]; nested exception is java.beans.IntrospectionException: type mismatch between read and write methods
	at org.springframework.beans.CachedIntrospectionResults.<init>(CachedIntrospectionResults.java:262)
	at org.springframework.beans.CachedIntrospectionResults.forClass(CachedIntrospectionResults.java:149)
	at org.springframework.beans.BeanWrapperImpl.getCachedIntrospectionResults(BeanWrapperImpl.java:324)
	at org.springframework.beans.BeanWrapperImpl.getPropertyValue(BeanWrapperImpl.java:727)
	at org.springframework.beans.BeanWrapperImpl.getPropertyValue(BeanWrapperImpl.java:721)
	at org.springframework.validation.AbstractPropertyBindingResult.getActualFieldValue(AbstractPropertyBindingResult.java:99)
	at org.springframework.validation.AbstractBindingResult.getFieldValue(AbstractBindingResult.java:226)
(40 more lines...)
Collapse Failed SchedulerFormValidatorTest validate_shouldFailValidationIfClassIsNotAccessible History
Default Job < 1 sec
org.springframework.beans.FatalBeanException: Failed to obtain BeanInfo for class [org.openmrs.scheduler.TaskDefinition]; nested exception is java.beans.IntrospectionException: type mismatch between read and write methods
	at org.springframework.beans.CachedIntrospectionResults.<init>(CachedIntrospectionResults.java:262)
	at org.springframework.beans.CachedIntrospectionResults.forClass(CachedIntrospectionResults.java:149)
	at org.springframework.beans.BeanWrapperImpl.getCachedIntrospectionResults(BeanWrapperImpl.java:324)
	at org.springframework.beans.BeanWrapperImpl.getPropertyValue(BeanWrapperImpl.java:727)
	at org.springframework.beans.BeanWrapperImpl.getPropertyValue(BeanWrapperImpl.java:721)
	at org.springframework.validation.AbstractPropertyBindingResult.getActualFieldValue(AbstractPropertyBindingResult.java:99)
	at org.springframework.validation.AbstractBindingResult.getFieldValue(AbstractBindingResult.java:226)
(40 more lines...)
Collapse Failed SchedulerFormValidatorTest validate_shouldPassValidationIfAllRequiredFieldsHaveProperValues History
Default Job < 1 sec
org.springframework.beans.FatalBeanException: Failed to obtain BeanInfo for class [org.openmrs.scheduler.TaskDefinition]; nested exception is java.beans.IntrospectionException: type mismatch between read and write methods
	at org.springframework.beans.CachedIntrospectionResults.<init>(CachedIntrospectionResults.java:262)
	at org.springframework.beans.CachedIntrospectionResults.forClass(CachedIntrospectionResults.java:149)
	at org.springframework.beans.BeanWrapperImpl.getCachedIntrospectionResults(BeanWrapperImpl.java:324)
	at org.springframework.beans.BeanWrapperImpl.getPropertyValue(BeanWrapperImpl.java:727)
	at org.springframework.beans.BeanWrapperImpl.getPropertyValue(BeanWrapperImpl.java:721)
	at org.springframework.validation.AbstractPropertyBindingResult.getActualFieldValue(AbstractPropertyBindingResult.java:99)
	at org.springframework.validation.AbstractBindingResult.getFieldValue(AbstractBindingResult.java:226)
(40 more lines...)
Collapse Failed SchedulerFormValidatorTest validate_shouldFailValidationIfClassNotFound History
Default Job < 1 sec
org.springframework.beans.FatalBeanException: Failed to obtain BeanInfo for class [org.openmrs.scheduler.TaskDefinition]; nested exception is java.beans.IntrospectionException: type mismatch between read and write methods
	at org.springframework.beans.CachedIntrospectionResults.<init>(CachedIntrospectionResults.java:262)
	at org.springframework.beans.CachedIntrospectionResults.forClass(CachedIntrospectionResults.java:149)
	at org.springframework.beans.BeanWrapperImpl.getCachedIntrospectionResults(BeanWrapperImpl.java:324)
	at org.springframework.beans.BeanWrapperImpl.getPropertyValue(BeanWrapperImpl.java:727)
	at org.springframework.beans.BeanWrapperImpl.getPropertyValue(BeanWrapperImpl.java:721)
	at org.springframework.validation.AbstractPropertyBindingResult.getActualFieldValue(AbstractPropertyBindingResult.java:99)
	at org.springframework.validation.AbstractBindingResult.getFieldValue(AbstractBindingResult.java:226)
(40 more lines...)
Collapse Failed SchedulerFormValidatorTest validate_shouldFailValidationIfRepeatIntervalIsNullOrEmptyOrWhitespace History
Default Job < 1 sec
org.springframework.beans.FatalBeanException: Failed to obtain BeanInfo for class [org.openmrs.scheduler.TaskDefinition]; nested exception is java.beans.IntrospectionException: type mismatch between read and write methods
	at org.springframework.beans.CachedIntrospectionResults.<init>(CachedIntrospectionResults.java:262)
	at org.springframework.beans.CachedIntrospectionResults.forClass(CachedIntrospectionResults.java:149)
	at org.springframework.beans.BeanWrapperImpl.getCachedIntrospectionResults(BeanWrapperImpl.java:324)
	at org.springframework.beans.BeanWrapperImpl.getPropertyValue(BeanWrapperImpl.java:727)
	at org.springframework.beans.BeanWrapperImpl.getPropertyValue(BeanWrapperImpl.java:721)
	at org.springframework.validation.AbstractPropertyBindingResult.getActualFieldValue(AbstractPropertyBindingResult.java:99)
	at org.springframework.validation.AbstractBindingResult.getFieldValue(AbstractBindingResult.java:226)
(40 more lines...)
Collapse Failed SchedulerFormValidatorTest validate_shouldFailValidationIfClassCannotBeInstantiated History
Default Job < 1 sec
org.springframework.beans.FatalBeanException: Failed to obtain BeanInfo for class [org.openmrs.scheduler.TaskDefinition]; nested exception is java.beans.IntrospectionException: type mismatch between read and write methods
	at org.springframework.beans.CachedIntrospectionResults.<init>(CachedIntrospectionResults.java:262)
	at org.springframework.beans.CachedIntrospectionResults.forClass(CachedIntrospectionResults.java:149)
	at org.springframework.beans.BeanWrapperImpl.getCachedIntrospectionResults(BeanWrapperImpl.java:324)
	at org.springframework.beans.BeanWrapperImpl.getPropertyValue(BeanWrapperImpl.java:727)
	at org.springframework.beans.BeanWrapperImpl.getPropertyValue(BeanWrapperImpl.java:721)
	at org.springframework.validation.AbstractPropertyBindingResult.getActualFieldValue(AbstractPropertyBindingResult.java:99)
	at org.springframework.validation.AbstractBindingResult.getFieldValue(AbstractBindingResult.java:226)
(40 more lines...)
Collapse Failed SchedulerFormValidatorTest validate_shouldFailValidationIfTaskClassIsEmptyOrWhitespace History
Default Job < 1 sec
org.springframework.beans.FatalBeanException: Failed to obtain BeanInfo for class [org.openmrs.scheduler.TaskDefinition]; nested exception is java.beans.IntrospectionException: type mismatch between read and write methods
	at org.springframework.beans.CachedIntrospectionResults.<init>(CachedIntrospectionResults.java:262)
	at org.springframework.beans.CachedIntrospectionResults.forClass(CachedIntrospectionResults.java:149)
	at org.springframework.beans.BeanWrapperImpl.getCachedIntrospectionResults(BeanWrapperImpl.java:324)
	at org.springframework.beans.BeanWrapperImpl.getPropertyValue(BeanWrapperImpl.java:727)
	at org.springframework.beans.BeanWrapperImpl.getPropertyValue(BeanWrapperImpl.java:721)
	at org.springframework.validation.AbstractPropertyBindingResult.getActualFieldValue(AbstractPropertyBindingResult.java:99)
	at org.springframework.validation.AbstractBindingResult.getFieldValue(AbstractBindingResult.java:226)
(40 more lines...)
Collapse Failed SchedulerFormValidatorTest validate_shouldFailValidationIfClassIsNotInstanceOfTask History
Default Job < 1 sec
org.springframework.beans.FatalBeanException: Failed to obtain BeanInfo for class [org.openmrs.scheduler.TaskDefinition]; nested exception is java.beans.IntrospectionException: type mismatch between read and write methods
	at org.springframework.beans.CachedIntrospectionResults.<init>(CachedIntrospectionResults.java:262)
	at org.springframework.beans.CachedIntrospectionResults.forClass(CachedIntrospectionResults.java:149)
	at org.springframework.beans.BeanWrapperImpl.getCachedIntrospectionResults(BeanWrapperImpl.java:324)
	at org.springframework.beans.BeanWrapperImpl.getPropertyValue(BeanWrapperImpl.java:727)
	at org.springframework.beans.BeanWrapperImpl.getPropertyValue(BeanWrapperImpl.java:721)
	at org.springframework.validation.AbstractPropertyBindingResult.getActualFieldValue(AbstractPropertyBindingResult.java:99)
	at org.springframework.validation.AbstractBindingResult.getFieldValue(AbstractBindingResult.java:226)
(40 more lines...)
Existing test failures 1
Status Test Failing since View job Duration
java.lang.NullPointerException
	at java.lang.String.startsWith(String.java:1405)
	at java.lang.String.startsWith(String.java:1434)
	at org.openmrs.api.context.ServiceContext.getModuleOpenmrsServices(ServiceContext.java:1023)
	at org.openmrs.api.context.Context.getModuleOpenmrsServices(Context.java:1246)
	at org.openmrs.module.ModuleFactory.stopModule(ModuleFactory.java:1009)
	at org.openmrs.module.ModuleUtil.shutdown(ModuleUtil.java:154)
	at org.openmrs.test.BaseContextSensitiveTest.closeSessionAfterEachClass(BaseContextSensitiveTest.java:779)
(20 more lines...)
Skipped tests 26
Status Test Failing since View job
Skipped AdministrationServiceTest setImplementationId_shouldOverwriteImplementationIdInDatabaseIfExists History
Default Job
Skipped AdministrationServiceTest getPresentationLocales_shouldReturnAtLeastOneLocaleIfNoLocalesDefinedInDatabaseYet History
Default Job
Skipped AdministrationServiceTest setImplementationId_shouldSetUuidOnImplementationIdGlobalProperty History
Default Job
Skipped AdministrationServiceTest setImplementationId_shouldCreateImplementationIdInDatabase History
Default Job
Skipped EncounterServiceTest saveEncounter_shouldVoidAndCreateNewObsWhenSavingEncounter History
Default Job
Skipped EncounterServiceTest getEncounters_shouldGetAllTheUniqueEncountersThatMatchTheSpecifiedParameterValues History
Default Job
Skipped EncounterServiceTest getEncounters_shouldNotReturnVoidedEncountersIfIncludeVoidedIsSetToTrue History
Default Job
Skipped LocationServiceTest retireLocation_shouldThrowIllegalArgumentExceptionWhenNoReasonIsGiven History
Default Job
Skipped LocationServiceTest retireLocationTag_shouldThrowIllegalArgumentExceptionWhenNoReasonIsGiven History
Default Job
Skipped PatientServiceTest voidPatient_shouldReturnNullWhenPatientIsNull History
Default Job
Skipped PatientServiceTest checkPatientIdentifiers_shouldThrowErrorWhenPatientHasIdenticalIdentifiers History
Default Job
Skipped PersonServiceTest unvoidPerson_shouldUnvoidTheGivenPerson History
Default Job
Skipped PersonServiceTest voidPerson_shouldReturnVoidedPersonWithGivenReason History
Default Job
Skipped ProviderServiceTest getCountOfProviders_shouldExcludeRetiredProviders History
Default Job
Skipped ProviderServiceTest getCountOfProviders_shouldIncludeRetiredProvidersIfIncludeRetiredIsSetToTrue History
Default Job
Skipped UserServiceTest changeQuestionAnswer_shouldChangeTheSecretQuestionAndAnswerForGivenUser History
Default Job
Skipped ArdenServiceTest compileFile_shouldGetAndParseMlms History
Default Job
Skipped HL7ServiceTest processHL7Message_shouldParseMessageTypeSuppliedByModule History
Default Job
Skipped HL7ServiceTest processHL7InQueue_shouldParseOruR01MessageUsingOverriddenParserProvidedByAModule History
Default Job
Skipped ModuleActivatorTest shouldStopDependantModulesOnStopModule History
Failing since build #210 (Manual run by Rafal Korytkowski) Default Job
Skipped SchedulerServiceTest shouldAllowTwoTasksToRunConcurrently History
Default Job
Skipped SchedulerServiceTest shouldAllowTwoTasksInitMethodsToRunConcurrently History
Default Job
Skipped ConceptReferenceTermValidatorTest validate_shouldFailIfTheNameIsAWhiteSpaceCharacter History
Default Job
Skipped ConceptReferenceTermValidatorTest validate_shouldFailIfTheNameIsNull History
Default Job
Skipped ConceptReferenceTermValidatorTest validate_shouldFailIfTheNameIsAnEmptyString History
Default Job
Skipped VisitValidatorTest validate_shouldFailIfAnAttributeIsBad History
Default Job