Build: #1927 failed Changes by dkayiwa <kayiwadaniel@gmail.com>

Stages & jobs

  1. Build and Test

  2. Deploy

  3. Release

    Requires a user to start manually

Build result summary

Details

Completed
Duration
1 minute
Labels
None
Revisions
openmrs-core
0759d1451d1dec493189146785d02541f818cc6e 0759d1451d1dec493189146785d02541f818cc6e
openmrs-standalone
5b99613f0bffb1ab3ffd50123096c7aa265d6620 5b99613f0bffb1ab3ffd50123096c7aa265d6620
Release scripts
5b416af0a90e6a162755d06d53b81d906ec4ef36 5b416af0a90e6a162755d06d53b81d906ec4ef36
Total tests
4063
Fixed in
#1928 (Changes by dkayiwa <kayiwadaniel@gmail.com>)

Responsible

No one has taken responsibility for this failure

Code commits

openmrs-core
Author Commit Message Commit date
dkayiwa <kayiwadaniel@gmail.com> dkayiwa <kayiwadaniel@gmail.com> 0759d1451d1dec493189146785d02541f818cc6e 0759d1451d1dec493189146785d02541f818cc6e Escaping the MySQL reserved condition keyword - TRUNK-5338

Tests

New test failures 3339
Status Test View job Duration
Collapse Failed AllergenTest isSameAllergen_shouldBeCaseInsensitiveForNonCodedAllergen History
Build and Test < 1 sec
org.dbunit.DatabaseUnitRuntimeException: org.dbunit.dataset.NoSuchTableException: Did not find table 'CONDITION' in schema 'null'
	at org.openmrs.test.BaseContextSensitiveTest.deleteAllData(BaseContextSensitiveTest.java:841)
	at org.openmrs.test.BaseContextSensitiveTest.baseSetupWithStandardDataAndAuthentication(BaseContextSensitiveTest.java:883)
	at sun.reflect.GeneratedMethodAccessor43.invoke(Unknown Source)
	at sun.reflect.DelegatingMethodAccessorImpl.invoke(DelegatingMethodAccessorImpl.java:43)
	at java.lang.reflect.Method.invoke(Method.java:498)
	at org.junit.runners.model.FrameworkMethod$1.runReflectiveCall(FrameworkMethod.java:50)
	at org.junit.internal.runners.model.ReflectiveCallable.run(ReflectiveCallable.java:12)
(63 more lines...)
Collapse Failed AllergenTest isSameAllergen_shouldReturnFalseForDifferentCodedAllergen History
Build and Test < 1 sec
org.dbunit.DatabaseUnitRuntimeException: org.dbunit.dataset.NoSuchTableException: Did not find table 'CONDITION' in schema 'null'
	at org.openmrs.test.BaseContextSensitiveTest.deleteAllData(BaseContextSensitiveTest.java:841)
	at org.openmrs.test.BaseContextSensitiveTest.baseSetupWithStandardDataAndAuthentication(BaseContextSensitiveTest.java:883)
	at sun.reflect.GeneratedMethodAccessor43.invoke(Unknown Source)
	at sun.reflect.DelegatingMethodAccessorImpl.invoke(DelegatingMethodAccessorImpl.java:43)
	at java.lang.reflect.Method.invoke(Method.java:498)
	at org.junit.runners.model.FrameworkMethod$1.runReflectiveCall(FrameworkMethod.java:50)
	at org.junit.internal.runners.model.ReflectiveCallable.run(ReflectiveCallable.java:12)
(63 more lines...)
Collapse Failed AllergenTest isSameAllergen_shouldReturnTrueForSameNonCodedAllergen History
Build and Test < 1 sec
org.dbunit.DatabaseUnitRuntimeException: org.dbunit.dataset.NoSuchTableException: Did not find table 'CONDITION' in schema 'null'
	at org.openmrs.test.BaseContextSensitiveTest.deleteAllData(BaseContextSensitiveTest.java:841)
	at org.openmrs.test.BaseContextSensitiveTest.baseSetupWithStandardDataAndAuthentication(BaseContextSensitiveTest.java:883)
	at sun.reflect.GeneratedMethodAccessor43.invoke(Unknown Source)
	at sun.reflect.DelegatingMethodAccessorImpl.invoke(DelegatingMethodAccessorImpl.java:43)
	at java.lang.reflect.Method.invoke(Method.java:498)
	at org.junit.runners.model.FrameworkMethod$1.runReflectiveCall(FrameworkMethod.java:50)
	at org.junit.internal.runners.model.ReflectiveCallable.run(ReflectiveCallable.java:12)
(63 more lines...)
Collapse Failed AllergenTest shouldEitherBeCodedOrFreeText History
Build and Test < 1 sec
org.dbunit.DatabaseUnitRuntimeException: org.dbunit.dataset.NoSuchTableException: Did not find table 'CONDITION' in schema 'null'
	at org.openmrs.test.BaseContextSensitiveTest.deleteAllData(BaseContextSensitiveTest.java:841)
	at org.openmrs.test.BaseContextSensitiveTest.baseSetupWithStandardDataAndAuthentication(BaseContextSensitiveTest.java:883)
	at sun.reflect.GeneratedMethodAccessor43.invoke(Unknown Source)
	at sun.reflect.DelegatingMethodAccessorImpl.invoke(DelegatingMethodAccessorImpl.java:43)
	at java.lang.reflect.Method.invoke(Method.java:498)
	at org.junit.runners.model.FrameworkMethod$1.runReflectiveCall(FrameworkMethod.java:50)
	at org.junit.internal.runners.model.ReflectiveCallable.run(ReflectiveCallable.java:12)
(63 more lines...)
Collapse Failed AllergenTest isSameAllergen_shouldReturnTrueForSameCodedAllergen History
Build and Test < 1 sec
org.dbunit.DatabaseUnitRuntimeException: org.dbunit.dataset.NoSuchTableException: Did not find table 'CONDITION' in schema 'null'
	at org.openmrs.test.BaseContextSensitiveTest.deleteAllData(BaseContextSensitiveTest.java:841)
	at org.openmrs.test.BaseContextSensitiveTest.baseSetupWithStandardDataAndAuthentication(BaseContextSensitiveTest.java:883)
	at sun.reflect.GeneratedMethodAccessor43.invoke(Unknown Source)
	at sun.reflect.DelegatingMethodAccessorImpl.invoke(DelegatingMethodAccessorImpl.java:43)
	at java.lang.reflect.Method.invoke(Method.java:498)
	at org.junit.runners.model.FrameworkMethod$1.runReflectiveCall(FrameworkMethod.java:50)
	at org.junit.internal.runners.model.ReflectiveCallable.run(ReflectiveCallable.java:12)
(63 more lines...)
Collapse Failed AllergenTest isSameAllergen_shouldReturnFalseForDifferentNonCodedAllergen History
Build and Test < 1 sec
org.dbunit.DatabaseUnitRuntimeException: org.dbunit.dataset.NoSuchTableException: Did not find table 'CONDITION' in schema 'null'
	at org.openmrs.test.BaseContextSensitiveTest.deleteAllData(BaseContextSensitiveTest.java:841)
	at org.openmrs.test.BaseContextSensitiveTest.baseSetupWithStandardDataAndAuthentication(BaseContextSensitiveTest.java:883)
	at sun.reflect.GeneratedMethodAccessor43.invoke(Unknown Source)
	at sun.reflect.DelegatingMethodAccessorImpl.invoke(DelegatingMethodAccessorImpl.java:43)
	at java.lang.reflect.Method.invoke(Method.java:498)
	at org.junit.runners.model.FrameworkMethod$1.runReflectiveCall(FrameworkMethod.java:50)
	at org.junit.internal.runners.model.ReflectiveCallable.run(ReflectiveCallable.java:12)
(63 more lines...)
Collapse Failed AllergiesTest addAll5_shouldNotAllowDuplicateCodedAllergen History
Build and Test < 1 sec
org.dbunit.DatabaseUnitRuntimeException: org.dbunit.dataset.NoSuchTableException: Did not find table 'CONDITION' in schema 'null'
	at org.openmrs.test.BaseContextSensitiveTest.deleteAllData(BaseContextSensitiveTest.java:841)
	at org.openmrs.test.BaseContextSensitiveTest.baseSetupWithStandardDataAndAuthentication(BaseContextSensitiveTest.java:883)
	at sun.reflect.GeneratedMethodAccessor43.invoke(Unknown Source)
	at sun.reflect.DelegatingMethodAccessorImpl.invoke(DelegatingMethodAccessorImpl.java:43)
	at java.lang.reflect.Method.invoke(Method.java:498)
	at org.junit.runners.model.FrameworkMethod$1.runReflectiveCall(FrameworkMethod.java:50)
	at org.junit.internal.runners.model.ReflectiveCallable.run(ReflectiveCallable.java:12)
(63 more lines...)
Collapse Failed AllergiesTest addAll_shouldAllowNonDuplicateNonCodedAllergen History
Build and Test < 1 sec
org.dbunit.DatabaseUnitRuntimeException: org.dbunit.dataset.NoSuchTableException: Did not find table 'CONDITION' in schema 'null'
	at org.openmrs.test.BaseContextSensitiveTest.deleteAllData(BaseContextSensitiveTest.java:841)
	at org.openmrs.test.BaseContextSensitiveTest.baseSetupWithStandardDataAndAuthentication(BaseContextSensitiveTest.java:883)
	at sun.reflect.GeneratedMethodAccessor43.invoke(Unknown Source)
	at sun.reflect.DelegatingMethodAccessorImpl.invoke(DelegatingMethodAccessorImpl.java:43)
	at java.lang.reflect.Method.invoke(Method.java:498)
	at org.junit.runners.model.FrameworkMethod$1.runReflectiveCall(FrameworkMethod.java:50)
	at org.junit.internal.runners.model.ReflectiveCallable.run(ReflectiveCallable.java:12)
(63 more lines...)
Collapse Failed AllergiesTest addAll_shouldNotAllowDuplicateCodedAllergen History
Build and Test < 1 sec
org.dbunit.DatabaseUnitRuntimeException: org.dbunit.dataset.NoSuchTableException: Did not find table 'CONDITION' in schema 'null'
	at org.openmrs.test.BaseContextSensitiveTest.deleteAllData(BaseContextSensitiveTest.java:841)
	at org.openmrs.test.BaseContextSensitiveTest.baseSetupWithStandardDataAndAuthentication(BaseContextSensitiveTest.java:883)
	at sun.reflect.GeneratedMethodAccessor43.invoke(Unknown Source)
	at sun.reflect.DelegatingMethodAccessorImpl.invoke(DelegatingMethodAccessorImpl.java:43)
	at java.lang.reflect.Method.invoke(Method.java:498)
	at org.junit.runners.model.FrameworkMethod$1.runReflectiveCall(FrameworkMethod.java:50)
	at org.junit.internal.runners.model.ReflectiveCallable.run(ReflectiveCallable.java:12)
(63 more lines...)
Collapse Failed AllergiesTest addAll2_shouldAllowNonDuplicateCodedAllergen History
Build and Test < 1 sec
org.dbunit.DatabaseUnitRuntimeException: org.dbunit.dataset.NoSuchTableException: Did not find table 'CONDITION' in schema 'null'
	at org.openmrs.test.BaseContextSensitiveTest.deleteAllData(BaseContextSensitiveTest.java:841)
	at org.openmrs.test.BaseContextSensitiveTest.baseSetupWithStandardDataAndAuthentication(BaseContextSensitiveTest.java:883)
	at sun.reflect.GeneratedMethodAccessor43.invoke(Unknown Source)
	at sun.reflect.DelegatingMethodAccessorImpl.invoke(DelegatingMethodAccessorImpl.java:43)
	at java.lang.reflect.Method.invoke(Method.java:498)
	at org.junit.runners.model.FrameworkMethod$1.runReflectiveCall(FrameworkMethod.java:50)
	at org.junit.internal.runners.model.ReflectiveCallable.run(ReflectiveCallable.java:12)
(63 more lines...)
Collapse Failed AllergiesTest add_shouldNotAllowDuplicateNonCodedAllergen History
Build and Test < 1 sec
org.dbunit.DatabaseUnitRuntimeException: org.dbunit.dataset.NoSuchTableException: Did not find table 'CONDITION' in schema 'null'
	at org.openmrs.test.BaseContextSensitiveTest.deleteAllData(BaseContextSensitiveTest.java:841)
	at org.openmrs.test.BaseContextSensitiveTest.baseSetupWithStandardDataAndAuthentication(BaseContextSensitiveTest.java:883)
	at sun.reflect.GeneratedMethodAccessor43.invoke(Unknown Source)
	at sun.reflect.DelegatingMethodAccessorImpl.invoke(DelegatingMethodAccessorImpl.java:43)
	at java.lang.reflect.Method.invoke(Method.java:498)
	at org.junit.runners.model.FrameworkMethod$1.runReflectiveCall(FrameworkMethod.java:50)
	at org.junit.internal.runners.model.ReflectiveCallable.run(ReflectiveCallable.java:12)
(63 more lines...)
Collapse Failed AllergiesTest add_shouldNotAllowDuplicateCodedAllergen History
Build and Test < 1 sec
org.dbunit.DatabaseUnitRuntimeException: org.dbunit.dataset.NoSuchTableException: Did not find table 'CONDITION' in schema 'null'
	at org.openmrs.test.BaseContextSensitiveTest.deleteAllData(BaseContextSensitiveTest.java:841)
	at org.openmrs.test.BaseContextSensitiveTest.baseSetupWithStandardDataAndAuthentication(BaseContextSensitiveTest.java:883)
	at sun.reflect.GeneratedMethodAccessor43.invoke(Unknown Source)
	at sun.reflect.DelegatingMethodAccessorImpl.invoke(DelegatingMethodAccessorImpl.java:43)
	at java.lang.reflect.Method.invoke(Method.java:498)
	at org.junit.runners.model.FrameworkMethod$1.runReflectiveCall(FrameworkMethod.java:50)
	at org.junit.internal.runners.model.ReflectiveCallable.run(ReflectiveCallable.java:12)
(63 more lines...)
Collapse Failed AllergiesTest shouldAddAllergyAndSetCorrectStatus History
Build and Test < 1 sec
org.dbunit.DatabaseUnitRuntimeException: org.dbunit.dataset.NoSuchTableException: Did not find table 'CONDITION' in schema 'null'
	at org.openmrs.test.BaseContextSensitiveTest.deleteAllData(BaseContextSensitiveTest.java:841)
	at org.openmrs.test.BaseContextSensitiveTest.baseSetupWithStandardDataAndAuthentication(BaseContextSensitiveTest.java:883)
	at sun.reflect.GeneratedMethodAccessor43.invoke(Unknown Source)
	at sun.reflect.DelegatingMethodAccessorImpl.invoke(DelegatingMethodAccessorImpl.java:43)
	at java.lang.reflect.Method.invoke(Method.java:498)
	at org.junit.runners.model.FrameworkMethod$1.runReflectiveCall(FrameworkMethod.java:50)
	at org.junit.internal.runners.model.ReflectiveCallable.run(ReflectiveCallable.java:12)
(63 more lines...)
Collapse Failed AllergiesTest shouldClearAllergyAndSetCorrectStatus History
Build and Test < 1 sec
org.dbunit.DatabaseUnitRuntimeException: org.dbunit.dataset.NoSuchTableException: Did not find table 'CONDITION' in schema 'null'
	at org.openmrs.test.BaseContextSensitiveTest.deleteAllData(BaseContextSensitiveTest.java:841)
	at org.openmrs.test.BaseContextSensitiveTest.baseSetupWithStandardDataAndAuthentication(BaseContextSensitiveTest.java:883)
	at sun.reflect.GeneratedMethodAccessor43.invoke(Unknown Source)
	at sun.reflect.DelegatingMethodAccessorImpl.invoke(DelegatingMethodAccessorImpl.java:43)
	at java.lang.reflect.Method.invoke(Method.java:498)
	at org.junit.runners.model.FrameworkMethod$1.runReflectiveCall(FrameworkMethod.java:50)
	at org.junit.internal.runners.model.ReflectiveCallable.run(ReflectiveCallable.java:12)
(63 more lines...)
Collapse Failed AllergiesTest addAll_shouldNotAllowDuplicateNonCodedAllergen History
Build and Test < 1 sec
org.dbunit.DatabaseUnitRuntimeException: org.dbunit.dataset.NoSuchTableException: Did not find table 'CONDITION' in schema 'null'
	at org.openmrs.test.BaseContextSensitiveTest.deleteAllData(BaseContextSensitiveTest.java:841)
	at org.openmrs.test.BaseContextSensitiveTest.baseSetupWithStandardDataAndAuthentication(BaseContextSensitiveTest.java:883)
	at sun.reflect.GeneratedMethodAccessor43.invoke(Unknown Source)
	at sun.reflect.DelegatingMethodAccessorImpl.invoke(DelegatingMethodAccessorImpl.java:43)
	at java.lang.reflect.Method.invoke(Method.java:498)
	at org.junit.runners.model.FrameworkMethod$1.runReflectiveCall(FrameworkMethod.java:50)
	at org.junit.internal.runners.model.ReflectiveCallable.run(ReflectiveCallable.java:12)
(63 more lines...)
Collapse Failed AllergiesTest shouldAddAllergyCollectionAndSetCorrectStatus History
Build and Test < 1 sec
org.dbunit.DatabaseUnitRuntimeException: org.dbunit.dataset.NoSuchTableException: Did not find table 'CONDITION' in schema 'null'
	at org.openmrs.test.BaseContextSensitiveTest.deleteAllData(BaseContextSensitiveTest.java:841)
	at org.openmrs.test.BaseContextSensitiveTest.baseSetupWithStandardDataAndAuthentication(BaseContextSensitiveTest.java:883)
	at sun.reflect.GeneratedMethodAccessor43.invoke(Unknown Source)
	at sun.reflect.DelegatingMethodAccessorImpl.invoke(DelegatingMethodAccessorImpl.java:43)
	at java.lang.reflect.Method.invoke(Method.java:498)
	at org.junit.runners.model.FrameworkMethod$1.runReflectiveCall(FrameworkMethod.java:50)
	at org.junit.internal.runners.model.ReflectiveCallable.run(ReflectiveCallable.java:12)
(63 more lines...)
Collapse Failed AllergiesTest shouldConfirmNoKnownAllergies History
Build and Test < 1 sec
org.dbunit.DatabaseUnitRuntimeException: org.dbunit.dataset.NoSuchTableException: Did not find table 'CONDITION' in schema 'null'
	at org.openmrs.test.BaseContextSensitiveTest.deleteAllData(BaseContextSensitiveTest.java:841)
	at org.openmrs.test.BaseContextSensitiveTest.baseSetupWithStandardDataAndAuthentication(BaseContextSensitiveTest.java:883)
	at sun.reflect.GeneratedMethodAccessor43.invoke(Unknown Source)
	at sun.reflect.DelegatingMethodAccessorImpl.invoke(DelegatingMethodAccessorImpl.java:43)
	at java.lang.reflect.Method.invoke(Method.java:498)
	at org.junit.runners.model.FrameworkMethod$1.runReflectiveCall(FrameworkMethod.java:50)
	at org.junit.internal.runners.model.ReflectiveCallable.run(ReflectiveCallable.java:12)
(63 more lines...)
Collapse Failed AllergiesTest addAll4_shouldNotAllowDuplicateCodedAllergen History
Build and Test < 1 sec
org.dbunit.DatabaseUnitRuntimeException: org.dbunit.dataset.NoSuchTableException: Did not find table 'CONDITION' in schema 'null'
	at org.openmrs.test.BaseContextSensitiveTest.deleteAllData(BaseContextSensitiveTest.java:841)
	at org.openmrs.test.BaseContextSensitiveTest.baseSetupWithStandardDataAndAuthentication(BaseContextSensitiveTest.java:883)
	at sun.reflect.GeneratedMethodAccessor43.invoke(Unknown Source)
	at sun.reflect.DelegatingMethodAccessorImpl.invoke(DelegatingMethodAccessorImpl.java:43)
	at java.lang.reflect.Method.invoke(Method.java:498)
	at org.junit.runners.model.FrameworkMethod$1.runReflectiveCall(FrameworkMethod.java:50)
	at org.junit.internal.runners.model.ReflectiveCallable.run(ReflectiveCallable.java:12)
(63 more lines...)
Collapse Failed AllergiesTest shouldRemoveAllergyAndSetCorrectStatus History
Build and Test < 1 sec
org.dbunit.DatabaseUnitRuntimeException: org.dbunit.dataset.NoSuchTableException: Did not find table 'CONDITION' in schema 'null'
	at org.openmrs.test.BaseContextSensitiveTest.deleteAllData(BaseContextSensitiveTest.java:841)
	at org.openmrs.test.BaseContextSensitiveTest.baseSetupWithStandardDataAndAuthentication(BaseContextSensitiveTest.java:883)
	at sun.reflect.GeneratedMethodAccessor43.invoke(Unknown Source)
	at sun.reflect.DelegatingMethodAccessorImpl.invoke(DelegatingMethodAccessorImpl.java:43)
	at java.lang.reflect.Method.invoke(Method.java:498)
	at org.junit.runners.model.FrameworkMethod$1.runReflectiveCall(FrameworkMethod.java:50)
	at org.junit.internal.runners.model.ReflectiveCallable.run(ReflectiveCallable.java:12)
(63 more lines...)
Collapse Failed AllergiesTest add2_shouldAllowNonDuplicateCodedAllergen History
Build and Test < 1 sec
org.dbunit.DatabaseUnitRuntimeException: org.dbunit.dataset.NoSuchTableException: Did not find table 'CONDITION' in schema 'null'
	at org.openmrs.test.BaseContextSensitiveTest.deleteAllData(BaseContextSensitiveTest.java:841)
	at org.openmrs.test.BaseContextSensitiveTest.baseSetupWithStandardDataAndAuthentication(BaseContextSensitiveTest.java:883)
	at sun.reflect.GeneratedMethodAccessor43.invoke(Unknown Source)
	at sun.reflect.DelegatingMethodAccessorImpl.invoke(DelegatingMethodAccessorImpl.java:43)
	at java.lang.reflect.Method.invoke(Method.java:498)
	at org.junit.runners.model.FrameworkMethod$1.runReflectiveCall(FrameworkMethod.java:50)
	at org.junit.internal.runners.model.ReflectiveCallable.run(ReflectiveCallable.java:12)
(63 more lines...)
Collapse Failed AllergiesTest addAll2_shouldNotAllowDuplicateCodedAllergen History
Build and Test < 1 sec
org.dbunit.DatabaseUnitRuntimeException: org.dbunit.dataset.NoSuchTableException: Did not find table 'CONDITION' in schema 'null'
	at org.openmrs.test.BaseContextSensitiveTest.deleteAllData(BaseContextSensitiveTest.java:841)
	at org.openmrs.test.BaseContextSensitiveTest.baseSetupWithStandardDataAndAuthentication(BaseContextSensitiveTest.java:883)
	at sun.reflect.GeneratedMethodAccessor43.invoke(Unknown Source)
	at sun.reflect.DelegatingMethodAccessorImpl.invoke(DelegatingMethodAccessorImpl.java:43)
	at java.lang.reflect.Method.invoke(Method.java:498)
	at org.junit.runners.model.FrameworkMethod$1.runReflectiveCall(FrameworkMethod.java:50)
	at org.junit.internal.runners.model.ReflectiveCallable.run(ReflectiveCallable.java:12)
(63 more lines...)
Collapse Failed AllergiesTest addAll_shouldAllowNonDuplicateCodedAllergen History
Build and Test < 1 sec
org.dbunit.DatabaseUnitRuntimeException: org.dbunit.dataset.NoSuchTableException: Did not find table 'CONDITION' in schema 'null'
	at org.openmrs.test.BaseContextSensitiveTest.deleteAllData(BaseContextSensitiveTest.java:841)
	at org.openmrs.test.BaseContextSensitiveTest.baseSetupWithStandardDataAndAuthentication(BaseContextSensitiveTest.java:883)
	at sun.reflect.GeneratedMethodAccessor43.invoke(Unknown Source)
	at sun.reflect.DelegatingMethodAccessorImpl.invoke(DelegatingMethodAccessorImpl.java:43)
	at java.lang.reflect.Method.invoke(Method.java:498)
	at org.junit.runners.model.FrameworkMethod$1.runReflectiveCall(FrameworkMethod.java:50)
	at org.junit.internal.runners.model.ReflectiveCallable.run(ReflectiveCallable.java:12)
(63 more lines...)
Collapse Failed AllergiesTest add2_shouldAllowNonDuplicateNonCodedAllergen History
Build and Test < 1 sec
org.dbunit.DatabaseUnitRuntimeException: org.dbunit.dataset.NoSuchTableException: Did not find table 'CONDITION' in schema 'null'
	at org.openmrs.test.BaseContextSensitiveTest.deleteAllData(BaseContextSensitiveTest.java:841)
	at org.openmrs.test.BaseContextSensitiveTest.baseSetupWithStandardDataAndAuthentication(BaseContextSensitiveTest.java:883)
	at sun.reflect.GeneratedMethodAccessor43.invoke(Unknown Source)
	at sun.reflect.DelegatingMethodAccessorImpl.invoke(DelegatingMethodAccessorImpl.java:43)
	at java.lang.reflect.Method.invoke(Method.java:498)
	at org.junit.runners.model.FrameworkMethod$1.runReflectiveCall(FrameworkMethod.java:50)
	at org.junit.internal.runners.model.ReflectiveCallable.run(ReflectiveCallable.java:12)
(63 more lines...)
Collapse Failed AllergiesTest addAll2_shouldAllowNonDuplicateNonCodedAllergen History
Build and Test < 1 sec
org.dbunit.DatabaseUnitRuntimeException: org.dbunit.dataset.NoSuchTableException: Did not find table 'CONDITION' in schema 'null'
	at org.openmrs.test.BaseContextSensitiveTest.deleteAllData(BaseContextSensitiveTest.java:841)
	at org.openmrs.test.BaseContextSensitiveTest.baseSetupWithStandardDataAndAuthentication(BaseContextSensitiveTest.java:883)
	at sun.reflect.GeneratedMethodAccessor43.invoke(Unknown Source)
	at sun.reflect.DelegatingMethodAccessorImpl.invoke(DelegatingMethodAccessorImpl.java:43)
	at java.lang.reflect.Method.invoke(Method.java:498)
	at org.junit.runners.model.FrameworkMethod$1.runReflectiveCall(FrameworkMethod.java:50)
	at org.junit.internal.runners.model.ReflectiveCallable.run(ReflectiveCallable.java:12)
(63 more lines...)
Collapse Failed AllergiesTest addAll7_shouldNotAllowDuplicateNonCodedAllergen History
Build and Test < 1 sec
org.dbunit.DatabaseUnitRuntimeException: org.dbunit.dataset.NoSuchTableException: Did not find table 'CONDITION' in schema 'null'
	at org.openmrs.test.BaseContextSensitiveTest.deleteAllData(BaseContextSensitiveTest.java:841)
	at org.openmrs.test.BaseContextSensitiveTest.baseSetupWithStandardDataAndAuthentication(BaseContextSensitiveTest.java:883)
	at sun.reflect.GeneratedMethodAccessor43.invoke(Unknown Source)
	at sun.reflect.DelegatingMethodAccessorImpl.invoke(DelegatingMethodAccessorImpl.java:43)
	at java.lang.reflect.Method.invoke(Method.java:498)
	at org.junit.runners.model.FrameworkMethod$1.runReflectiveCall(FrameworkMethod.java:50)
	at org.junit.internal.runners.model.ReflectiveCallable.run(ReflectiveCallable.java:12)
(63 more lines...)
Collapse Failed AllergiesTest add2_shouldNotAllowDuplicateCodedAllergen History
Build and Test < 1 sec
org.dbunit.DatabaseUnitRuntimeException: org.dbunit.dataset.NoSuchTableException: Did not find table 'CONDITION' in schema 'null'
	at org.openmrs.test.BaseContextSensitiveTest.deleteAllData(BaseContextSensitiveTest.java:841)
	at org.openmrs.test.BaseContextSensitiveTest.baseSetupWithStandardDataAndAuthentication(BaseContextSensitiveTest.java:883)
	at sun.reflect.GeneratedMethodAccessor43.invoke(Unknown Source)
	at sun.reflect.DelegatingMethodAccessorImpl.invoke(DelegatingMethodAccessorImpl.java:43)
	at java.lang.reflect.Method.invoke(Method.java:498)
	at org.junit.runners.model.FrameworkMethod$1.runReflectiveCall(FrameworkMethod.java:50)
	at org.junit.internal.runners.model.ReflectiveCallable.run(ReflectiveCallable.java:12)
(63 more lines...)
Collapse Failed AllergiesTest add2_shouldNotAllowDuplicateNonCodedAllergen History
Build and Test < 1 sec
org.dbunit.DatabaseUnitRuntimeException: org.dbunit.dataset.NoSuchTableException: Did not find table 'CONDITION' in schema 'null'
	at org.openmrs.test.BaseContextSensitiveTest.deleteAllData(BaseContextSensitiveTest.java:841)
	at org.openmrs.test.BaseContextSensitiveTest.baseSetupWithStandardDataAndAuthentication(BaseContextSensitiveTest.java:883)
	at sun.reflect.GeneratedMethodAccessor43.invoke(Unknown Source)
	at sun.reflect.DelegatingMethodAccessorImpl.invoke(DelegatingMethodAccessorImpl.java:43)
	at java.lang.reflect.Method.invoke(Method.java:498)
	at org.junit.runners.model.FrameworkMethod$1.runReflectiveCall(FrameworkMethod.java:50)
	at org.junit.internal.runners.model.ReflectiveCallable.run(ReflectiveCallable.java:12)
(63 more lines...)
Collapse Failed AllergiesTest add_shouldAllowNonDuplicateCodedAllergen History
Build and Test < 1 sec
org.dbunit.DatabaseUnitRuntimeException: org.dbunit.dataset.NoSuchTableException: Did not find table 'CONDITION' in schema 'null'
	at org.openmrs.test.BaseContextSensitiveTest.deleteAllData(BaseContextSensitiveTest.java:841)
	at org.openmrs.test.BaseContextSensitiveTest.baseSetupWithStandardDataAndAuthentication(BaseContextSensitiveTest.java:883)
	at sun.reflect.GeneratedMethodAccessor43.invoke(Unknown Source)
	at sun.reflect.DelegatingMethodAccessorImpl.invoke(DelegatingMethodAccessorImpl.java:43)
	at java.lang.reflect.Method.invoke(Method.java:498)
	at org.junit.runners.model.FrameworkMethod$1.runReflectiveCall(FrameworkMethod.java:50)
	at org.junit.internal.runners.model.ReflectiveCallable.run(ReflectiveCallable.java:12)
(63 more lines...)
Collapse Failed AllergiesTest addAll6_shouldNotAllowDuplicateNonCodedAllergen History
Build and Test < 1 sec
org.dbunit.DatabaseUnitRuntimeException: org.dbunit.dataset.NoSuchTableException: Did not find table 'CONDITION' in schema 'null'
	at org.openmrs.test.BaseContextSensitiveTest.deleteAllData(BaseContextSensitiveTest.java:841)
	at org.openmrs.test.BaseContextSensitiveTest.baseSetupWithStandardDataAndAuthentication(BaseContextSensitiveTest.java:883)
	at sun.reflect.GeneratedMethodAccessor43.invoke(Unknown Source)
	at sun.reflect.DelegatingMethodAccessorImpl.invoke(DelegatingMethodAccessorImpl.java:43)
	at java.lang.reflect.Method.invoke(Method.java:498)
	at org.junit.runners.model.FrameworkMethod$1.runReflectiveCall(FrameworkMethod.java:50)
	at org.junit.internal.runners.model.ReflectiveCallable.run(ReflectiveCallable.java:12)
(63 more lines...)
Collapse Failed AllergiesTest shouldThrowAnErrorWhenTryingConfirmNoKnowAllergiesWhileAllergiesIsNotEmpty History
Build and Test < 1 sec
org.dbunit.DatabaseUnitRuntimeException: org.dbunit.dataset.NoSuchTableException: Did not find table 'CONDITION' in schema 'null'
	at org.openmrs.test.BaseContextSensitiveTest.deleteAllData(BaseContextSensitiveTest.java:841)
	at org.openmrs.test.BaseContextSensitiveTest.baseSetupWithStandardDataAndAuthentication(BaseContextSensitiveTest.java:883)
	at sun.reflect.GeneratedMethodAccessor43.invoke(Unknown Source)
	at sun.reflect.DelegatingMethodAccessorImpl.invoke(DelegatingMethodAccessorImpl.java:43)
	at java.lang.reflect.Method.invoke(Method.java:498)
	at org.junit.runners.model.FrameworkMethod$1.runReflectiveCall(FrameworkMethod.java:50)
	at org.junit.internal.runners.model.ReflectiveCallable.run(ReflectiveCallable.java:12)
(63 more lines...)
Collapse Failed AllergiesTest add_shouldAllowNonDuplicateNonCodedAllergen History
Build and Test < 1 sec
org.dbunit.DatabaseUnitRuntimeException: org.dbunit.dataset.NoSuchTableException: Did not find table 'CONDITION' in schema 'null'
	at org.openmrs.test.BaseContextSensitiveTest.deleteAllData(BaseContextSensitiveTest.java:841)
	at org.openmrs.test.BaseContextSensitiveTest.baseSetupWithStandardDataAndAuthentication(BaseContextSensitiveTest.java:883)
	at sun.reflect.GeneratedMethodAccessor43.invoke(Unknown Source)
	at sun.reflect.DelegatingMethodAccessorImpl.invoke(DelegatingMethodAccessorImpl.java:43)
	at java.lang.reflect.Method.invoke(Method.java:498)
	at org.junit.runners.model.FrameworkMethod$1.runReflectiveCall(FrameworkMethod.java:50)
	at org.junit.internal.runners.model.ReflectiveCallable.run(ReflectiveCallable.java:12)
(63 more lines...)
Collapse Failed AllergiesTest addAll2_shouldNotAllowDuplicateNonCodedAllergen History
Build and Test < 1 sec
org.dbunit.DatabaseUnitRuntimeException: org.dbunit.dataset.NoSuchTableException: Did not find table 'CONDITION' in schema 'null'
	at org.openmrs.test.BaseContextSensitiveTest.deleteAllData(BaseContextSensitiveTest.java:841)
	at org.openmrs.test.BaseContextSensitiveTest.baseSetupWithStandardDataAndAuthentication(BaseContextSensitiveTest.java:883)
	at sun.reflect.GeneratedMethodAccessor43.invoke(Unknown Source)
	at sun.reflect.DelegatingMethodAccessorImpl.invoke(DelegatingMethodAccessorImpl.java:43)
	at java.lang.reflect.Method.invoke(Method.java:498)
	at org.junit.runners.model.FrameworkMethod$1.runReflectiveCall(FrameworkMethod.java:50)
	at org.junit.internal.runners.model.ReflectiveCallable.run(ReflectiveCallable.java:12)
(63 more lines...)
Collapse Failed BaseCustomizableMetadataTest setAttribute_shouldVoidTheAttributeIfAnAttributeWithSameAttributeTypeAlreadyExistsAndTheMaxOccursIsSetTo1 History
Build and Test < 1 sec
org.dbunit.DatabaseUnitRuntimeException: org.dbunit.dataset.NoSuchTableException: Did not find table 'CONDITION' in schema 'null'
	at org.openmrs.test.BaseContextSensitiveTest.deleteAllData(BaseContextSensitiveTest.java:841)
	at org.openmrs.test.BaseContextSensitiveTest.baseSetupWithStandardDataAndAuthentication(BaseContextSensitiveTest.java:883)
	at sun.reflect.GeneratedMethodAccessor43.invoke(Unknown Source)
	at sun.reflect.DelegatingMethodAccessorImpl.invoke(DelegatingMethodAccessorImpl.java:43)
	at java.lang.reflect.Method.invoke(Method.java:498)
	at org.junit.runners.model.FrameworkMethod$1.runReflectiveCall(FrameworkMethod.java:50)
	at org.junit.internal.runners.model.ReflectiveCallable.run(ReflectiveCallable.java:12)
(63 more lines...)
Collapse Failed BaseCustomizableMetadataTest setAttribute_shouldWorkForAttriubutesWithDatatypesWhoseValuesAreStoredInOtherTables History
Build and Test < 1 sec
org.dbunit.DatabaseUnitRuntimeException: org.dbunit.dataset.NoSuchTableException: Did not find table 'CONDITION' in schema 'null'
	at org.openmrs.test.BaseContextSensitiveTest.deleteAllData(BaseContextSensitiveTest.java:841)
	at org.openmrs.test.BaseContextSensitiveTest.baseSetupWithStandardDataAndAuthentication(BaseContextSensitiveTest.java:883)
	at sun.reflect.GeneratedMethodAccessor43.invoke(Unknown Source)
	at sun.reflect.DelegatingMethodAccessorImpl.invoke(DelegatingMethodAccessorImpl.java:43)
	at java.lang.reflect.Method.invoke(Method.java:498)
	at org.junit.runners.model.FrameworkMethod$1.runReflectiveCall(FrameworkMethod.java:50)
	at org.junit.internal.runners.model.ReflectiveCallable.run(ReflectiveCallable.java:12)
(63 more lines...)
Collapse Failed BaseOpenmrsObjectTest equals_shouldReturnFalseIfGivenObjIsNotInstanceOfBaseOpenmrsObject History
Build and Test < 1 sec
org.dbunit.DatabaseUnitRuntimeException: org.dbunit.dataset.NoSuchTableException: Did not find table 'CONDITION' in schema 'null'
	at org.openmrs.test.BaseContextSensitiveTest.deleteAllData(BaseContextSensitiveTest.java:841)
	at org.openmrs.test.BaseContextSensitiveTest.baseSetupWithStandardDataAndAuthentication(BaseContextSensitiveTest.java:883)
	at sun.reflect.GeneratedMethodAccessor43.invoke(Unknown Source)
	at sun.reflect.DelegatingMethodAccessorImpl.invoke(DelegatingMethodAccessorImpl.java:43)
	at java.lang.reflect.Method.invoke(Method.java:498)
	at org.junit.runners.model.FrameworkMethod$1.runReflectiveCall(FrameworkMethod.java:50)
	at org.junit.internal.runners.model.ReflectiveCallable.run(ReflectiveCallable.java:12)
(63 more lines...)
Collapse Failed BaseOpenmrsObjectTest equals_shouldReturnFalseIfHibernateProxyOfOneThingIsComparedtoNonHibernateProxyofSomething History
Build and Test < 1 sec
org.dbunit.DatabaseUnitRuntimeException: org.dbunit.dataset.NoSuchTableException: Did not find table 'CONDITION' in schema 'null'
	at org.openmrs.test.BaseContextSensitiveTest.deleteAllData(BaseContextSensitiveTest.java:841)
	at org.openmrs.test.BaseContextSensitiveTest.baseSetupWithStandardDataAndAuthentication(BaseContextSensitiveTest.java:883)
	at sun.reflect.GeneratedMethodAccessor43.invoke(Unknown Source)
	at sun.reflect.DelegatingMethodAccessorImpl.invoke(DelegatingMethodAccessorImpl.java:43)
	at java.lang.reflect.Method.invoke(Method.java:498)
	at org.junit.runners.model.FrameworkMethod$1.runReflectiveCall(FrameworkMethod.java:50)
	at org.junit.internal.runners.model.ReflectiveCallable.run(ReflectiveCallable.java:12)
(63 more lines...)
Collapse Failed BaseOpenmrsObjectTest equals_shouldReturnTrueIfGivenObjectIsSubclassOfSuperOrExtendingClass History
Build and Test < 1 sec
org.dbunit.DatabaseUnitRuntimeException: org.dbunit.dataset.NoSuchTableException: Did not find table 'CONDITION' in schema 'null'
	at org.openmrs.test.BaseContextSensitiveTest.deleteAllData(BaseContextSensitiveTest.java:841)
	at org.openmrs.test.BaseContextSensitiveTest.baseSetupWithStandardDataAndAuthentication(BaseContextSensitiveTest.java:883)
	at sun.reflect.GeneratedMethodAccessor43.invoke(Unknown Source)
	at sun.reflect.DelegatingMethodAccessorImpl.invoke(DelegatingMethodAccessorImpl.java:43)
	at java.lang.reflect.Method.invoke(Method.java:498)
	at org.junit.runners.model.FrameworkMethod$1.runReflectiveCall(FrameworkMethod.java:50)
	at org.junit.internal.runners.model.ReflectiveCallable.run(ReflectiveCallable.java:12)
(63 more lines...)
Collapse Failed BaseOpenmrsObjectTest equals_shouldReturnFalseIfUuidIsNull History
Build and Test < 1 sec
org.dbunit.DatabaseUnitRuntimeException: org.dbunit.dataset.NoSuchTableException: Did not find table 'CONDITION' in schema 'null'
	at org.openmrs.test.BaseContextSensitiveTest.deleteAllData(BaseContextSensitiveTest.java:841)
	at org.openmrs.test.BaseContextSensitiveTest.baseSetupWithStandardDataAndAuthentication(BaseContextSensitiveTest.java:883)
	at sun.reflect.GeneratedMethodAccessor43.invoke(Unknown Source)
	at sun.reflect.DelegatingMethodAccessorImpl.invoke(DelegatingMethodAccessorImpl.java:43)
	at java.lang.reflect.Method.invoke(Method.java:498)
	at org.junit.runners.model.FrameworkMethod$1.runReflectiveCall(FrameworkMethod.java:50)
	at org.junit.internal.runners.model.ReflectiveCallable.run(ReflectiveCallable.java:12)
(63 more lines...)
Collapse Failed BaseOpenmrsObjectTest equals_shouldReturnTrueIfHibernateProxyOfOneObjectComparedToNonHibernateProxyOfTheSameObject History
Build and Test < 1 sec
org.dbunit.DatabaseUnitRuntimeException: org.dbunit.dataset.NoSuchTableException: Did not find table 'CONDITION' in schema 'null'
	at org.openmrs.test.BaseContextSensitiveTest.deleteAllData(BaseContextSensitiveTest.java:841)
	at org.openmrs.test.BaseContextSensitiveTest.baseSetupWithStandardDataAndAuthentication(BaseContextSensitiveTest.java:883)
	at sun.reflect.GeneratedMethodAccessor43.invoke(Unknown Source)
	at sun.reflect.DelegatingMethodAccessorImpl.invoke(DelegatingMethodAccessorImpl.java:43)
	at java.lang.reflect.Method.invoke(Method.java:498)
	at org.junit.runners.model.FrameworkMethod$1.runReflectiveCall(FrameworkMethod.java:50)
	at org.junit.internal.runners.model.ReflectiveCallable.run(ReflectiveCallable.java:12)
(63 more lines...)
Collapse Failed BaseOpenmrsObjectTest equals_shouldReturnTrueIfHibernateProxyOfSomeObjectComparedToAnotherHibernateProxyOfTheSameObject History
Build and Test < 1 sec
org.dbunit.DatabaseUnitRuntimeException: org.dbunit.dataset.NoSuchTableException: Did not find table 'CONDITION' in schema 'null'
	at org.openmrs.test.BaseContextSensitiveTest.deleteAllData(BaseContextSensitiveTest.java:841)
	at org.openmrs.test.BaseContextSensitiveTest.baseSetupWithStandardDataAndAuthentication(BaseContextSensitiveTest.java:883)
	at sun.reflect.GeneratedMethodAccessor43.invoke(Unknown Source)
	at sun.reflect.DelegatingMethodAccessorImpl.invoke(DelegatingMethodAccessorImpl.java:43)
	at java.lang.reflect.Method.invoke(Method.java:498)
	at org.junit.runners.model.FrameworkMethod$1.runReflectiveCall(FrameworkMethod.java:50)
	at org.junit.internal.runners.model.ReflectiveCallable.run(ReflectiveCallable.java:12)
(63 more lines...)
Collapse Failed BaseOpenmrsObjectTest equals_shouldReturnTrueIfGivenObjectIsInstanceOfSuperOrExtendingClass History
Build and Test < 1 sec
org.dbunit.DatabaseUnitRuntimeException: org.dbunit.dataset.NoSuchTableException: Did not find table 'CONDITION' in schema 'null'
	at org.openmrs.test.BaseContextSensitiveTest.deleteAllData(BaseContextSensitiveTest.java:841)
	at org.openmrs.test.BaseContextSensitiveTest.baseSetupWithStandardDataAndAuthentication(BaseContextSensitiveTest.java:883)
	at sun.reflect.GeneratedMethodAccessor43.invoke(Unknown Source)
	at sun.reflect.DelegatingMethodAccessorImpl.invoke(DelegatingMethodAccessorImpl.java:43)
	at java.lang.reflect.Method.invoke(Method.java:498)
	at org.junit.runners.model.FrameworkMethod$1.runReflectiveCall(FrameworkMethod.java:50)
	at org.junit.internal.runners.model.ReflectiveCallable.run(ReflectiveCallable.java:12)
(63 more lines...)
Collapse Failed BaseOpenmrsObjectTest equals_shouldReturnFalseIfGivenObjHasNullUuid History
Build and Test < 1 sec
org.dbunit.DatabaseUnitRuntimeException: org.dbunit.dataset.NoSuchTableException: Did not find table 'CONDITION' in schema 'null'
	at org.openmrs.test.BaseContextSensitiveTest.deleteAllData(BaseContextSensitiveTest.java:841)
	at org.openmrs.test.BaseContextSensitiveTest.baseSetupWithStandardDataAndAuthentication(BaseContextSensitiveTest.java:883)
	at sun.reflect.GeneratedMethodAccessor43.invoke(Unknown Source)
	at sun.reflect.DelegatingMethodAccessorImpl.invoke(DelegatingMethodAccessorImpl.java:43)
	at java.lang.reflect.Method.invoke(Method.java:498)
	at org.junit.runners.model.FrameworkMethod$1.runReflectiveCall(FrameworkMethod.java:50)
	at org.junit.internal.runners.model.ReflectiveCallable.run(ReflectiveCallable.java:12)
(63 more lines...)
Collapse Failed BaseOpenmrsObjectTest toString_shouldIncludeUuidIfNotNull History
Build and Test < 1 sec
org.dbunit.DatabaseUnitRuntimeException: org.dbunit.dataset.NoSuchTableException: Did not find table 'CONDITION' in schema 'null'
	at org.openmrs.test.BaseContextSensitiveTest.deleteAllData(BaseContextSensitiveTest.java:841)
	at org.openmrs.test.BaseContextSensitiveTest.baseSetupWithStandardDataAndAuthentication(BaseContextSensitiveTest.java:883)
	at sun.reflect.GeneratedMethodAccessor43.invoke(Unknown Source)
	at sun.reflect.DelegatingMethodAccessorImpl.invoke(DelegatingMethodAccessorImpl.java:43)
	at java.lang.reflect.Method.invoke(Method.java:498)
	at org.junit.runners.model.FrameworkMethod$1.runReflectiveCall(FrameworkMethod.java:50)
	at org.junit.internal.runners.model.ReflectiveCallable.run(ReflectiveCallable.java:12)
(63 more lines...)
Collapse Failed BaseOpenmrsObjectTest equals_shouldReturnFalseIfGivenObjIsNull History
Build and Test < 1 sec
org.dbunit.DatabaseUnitRuntimeException: org.dbunit.dataset.NoSuchTableException: Did not find table 'CONDITION' in schema 'null'
	at org.openmrs.test.BaseContextSensitiveTest.deleteAllData(BaseContextSensitiveTest.java:841)
	at org.openmrs.test.BaseContextSensitiveTest.baseSetupWithStandardDataAndAuthentication(BaseContextSensitiveTest.java:883)
	at sun.reflect.GeneratedMethodAccessor43.invoke(Unknown Source)
	at sun.reflect.DelegatingMethodAccessorImpl.invoke(DelegatingMethodAccessorImpl.java:43)
	at java.lang.reflect.Method.invoke(Method.java:498)
	at org.junit.runners.model.FrameworkMethod$1.runReflectiveCall(FrameworkMethod.java:50)
	at org.junit.internal.runners.model.ReflectiveCallable.run(ReflectiveCallable.java:12)
(63 more lines...)
Collapse Failed BaseOpenmrsObjectTest equals_shouldReturnTrueIfUuidsAreEqual History
Build and Test < 1 sec
org.dbunit.DatabaseUnitRuntimeException: org.dbunit.dataset.NoSuchTableException: Did not find table 'CONDITION' in schema 'null'
	at org.openmrs.test.BaseContextSensitiveTest.deleteAllData(BaseContextSensitiveTest.java:841)
	at org.openmrs.test.BaseContextSensitiveTest.baseSetupWithStandardDataAndAuthentication(BaseContextSensitiveTest.java:883)
	at sun.reflect.GeneratedMethodAccessor43.invoke(Unknown Source)
	at sun.reflect.DelegatingMethodAccessorImpl.invoke(DelegatingMethodAccessorImpl.java:43)
	at java.lang.reflect.Method.invoke(Method.java:498)
	at org.junit.runners.model.FrameworkMethod$1.runReflectiveCall(FrameworkMethod.java:50)
	at org.junit.internal.runners.model.ReflectiveCallable.run(ReflectiveCallable.java:12)
(63 more lines...)
Collapse Failed BaseOpenmrsObjectTest shouldNotBeEqualWhenDifferentClassesAndSameId History
Build and Test < 1 sec
org.dbunit.DatabaseUnitRuntimeException: org.dbunit.dataset.NoSuchTableException: Did not find table 'CONDITION' in schema 'null'
	at org.openmrs.test.BaseContextSensitiveTest.deleteAllData(BaseContextSensitiveTest.java:841)
	at org.openmrs.test.BaseContextSensitiveTest.baseSetupWithStandardDataAndAuthentication(BaseContextSensitiveTest.java:883)
	at sun.reflect.GeneratedMethodAccessor43.invoke(Unknown Source)
	at sun.reflect.DelegatingMethodAccessorImpl.invoke(DelegatingMethodAccessorImpl.java:43)
	at java.lang.reflect.Method.invoke(Method.java:498)
	at org.junit.runners.model.FrameworkMethod$1.runReflectiveCall(FrameworkMethod.java:50)
	at org.junit.internal.runners.model.ReflectiveCallable.run(ReflectiveCallable.java:12)
(63 more lines...)
Collapse Failed BaseOpenmrsObjectTest equals_shouldWorkOnNonHibernateManagedClasses History
Build and Test < 1 sec
org.dbunit.DatabaseUnitRuntimeException: org.dbunit.dataset.NoSuchTableException: Did not find table 'CONDITION' in schema 'null'
	at org.openmrs.test.BaseContextSensitiveTest.deleteAllData(BaseContextSensitiveTest.java:841)
	at org.openmrs.test.BaseContextSensitiveTest.baseSetupWithStandardDataAndAuthentication(BaseContextSensitiveTest.java:883)
	at sun.reflect.GeneratedMethodAccessor43.invoke(Unknown Source)
	at sun.reflect.DelegatingMethodAccessorImpl.invoke(DelegatingMethodAccessorImpl.java:43)
	at java.lang.reflect.Method.invoke(Method.java:498)
	at org.junit.runners.model.FrameworkMethod$1.runReflectiveCall(FrameworkMethod.java:50)
	at org.junit.internal.runners.model.ReflectiveCallable.run(ReflectiveCallable.java:12)
(63 more lines...)
Collapse Failed BaseOpenmrsObjectTest hashCode_shouldNotFailIfUuidIsNull History
Build and Test < 1 sec
org.dbunit.DatabaseUnitRuntimeException: org.dbunit.dataset.NoSuchTableException: Did not find table 'CONDITION' in schema 'null'
	at org.openmrs.test.BaseContextSensitiveTest.deleteAllData(BaseContextSensitiveTest.java:841)
	at org.openmrs.test.BaseContextSensitiveTest.baseSetupWithStandardDataAndAuthentication(BaseContextSensitiveTest.java:883)
	at sun.reflect.GeneratedMethodAccessor43.invoke(Unknown Source)
	at sun.reflect.DelegatingMethodAccessorImpl.invoke(DelegatingMethodAccessorImpl.java:43)
	at java.lang.reflect.Method.invoke(Method.java:498)
	at org.junit.runners.model.FrameworkMethod$1.runReflectiveCall(FrameworkMethod.java:50)
	at org.junit.internal.runners.model.ReflectiveCallable.run(ReflectiveCallable.java:12)
(63 more lines...)
Collapse Failed BaseOpenmrsObjectTest equals_shouldReturnFalseIfGivenObjIsNotInstanceOfSuperOrExtendingClass History
Build and Test < 1 sec
org.dbunit.DatabaseUnitRuntimeException: org.dbunit.dataset.NoSuchTableException: Did not find table 'CONDITION' in schema 'null'
	at org.openmrs.test.BaseContextSensitiveTest.deleteAllData(BaseContextSensitiveTest.java:841)
	at org.openmrs.test.BaseContextSensitiveTest.baseSetupWithStandardDataAndAuthentication(BaseContextSensitiveTest.java:883)
	at sun.reflect.GeneratedMethodAccessor43.invoke(Unknown Source)
	at sun.reflect.DelegatingMethodAccessorImpl.invoke(DelegatingMethodAccessorImpl.java:43)
	at java.lang.reflect.Method.invoke(Method.java:498)
	at org.junit.runners.model.FrameworkMethod$1.runReflectiveCall(FrameworkMethod.java:50)
	at org.junit.internal.runners.model.ReflectiveCallable.run(ReflectiveCallable.java:12)
(63 more lines...)
Collapse Failed BaseOpenmrsObjectTest equals_shouldReturnfalseIfHibernateProxyOfOneThingIsComparedtoHibernateProxyofSomething History
Build and Test < 1 sec
org.dbunit.DatabaseUnitRuntimeException: org.dbunit.dataset.NoSuchTableException: Did not find table 'CONDITION' in schema 'null'
	at org.openmrs.test.BaseContextSensitiveTest.deleteAllData(BaseContextSensitiveTest.java:841)
	at org.openmrs.test.BaseContextSensitiveTest.baseSetupWithStandardDataAndAuthentication(BaseContextSensitiveTest.java:883)
	at sun.reflect.GeneratedMethodAccessor43.invoke(Unknown Source)
	at sun.reflect.DelegatingMethodAccessorImpl.invoke(DelegatingMethodAccessorImpl.java:43)
	at java.lang.reflect.Method.invoke(Method.java:498)
	at org.junit.runners.model.FrameworkMethod$1.runReflectiveCall(FrameworkMethod.java:50)
	at org.junit.internal.runners.model.ReflectiveCallable.run(ReflectiveCallable.java:12)
(63 more lines...)
Existing test failures 2
Status Test Failing since View job Duration
org.dbunit.DatabaseUnitRuntimeException: org.dbunit.dataset.NoSuchTableException: Did not find table 'CONDITION' in schema 'null'
	at org.openmrs.test.BaseContextSensitiveTest.deleteAllData(BaseContextSensitiveTest.java:841)
	at org.openmrs.test.BaseContextSensitiveTest.baseSetupWithStandardDataAndAuthentication(BaseContextSensitiveTest.java:883)
	at sun.reflect.GeneratedMethodAccessor43.invoke(Unknown Source)
	at sun.reflect.DelegatingMethodAccessorImpl.invoke(DelegatingMethodAccessorImpl.java:43)
	at java.lang.reflect.Method.invoke(Method.java:498)
	at org.junit.runners.model.FrameworkMethod$1.runReflectiveCall(FrameworkMethod.java:50)
	at org.junit.internal.runners.model.ReflectiveCallable.run(ReflectiveCallable.java:12)
(63 more lines...)
org.dbunit.DatabaseUnitRuntimeException: org.dbunit.dataset.NoSuchTableException: Did not find table 'CONDITION' in schema 'null'
	at org.openmrs.test.BaseContextSensitiveTest.deleteAllData(BaseContextSensitiveTest.java:841)
	at org.openmrs.test.BaseContextSensitiveTest.baseSetupWithStandardDataAndAuthentication(BaseContextSensitiveTest.java:883)
	at sun.reflect.GeneratedMethodAccessor43.invoke(Unknown Source)
	at sun.reflect.DelegatingMethodAccessorImpl.invoke(DelegatingMethodAccessorImpl.java:43)
	at java.lang.reflect.Method.invoke(Method.java:498)
	at org.junit.runners.model.FrameworkMethod$1.runReflectiveCall(FrameworkMethod.java:50)
	at org.junit.internal.runners.model.ReflectiveCallable.run(ReflectiveCallable.java:12)
(63 more lines...)

JIRA issues

IssueDescriptionStatus
Unknown Issue TypeTRUNK-5338Could not obtain issue details from JIRA