Build: #1927 failed

Job: Build and Test failed

Stages & jobs

  1. Build and Test

  2. Deploy

  3. Release

    Requires a user to start manually

Job result summary

Completed
Duration
1 minute
Revision
0759d1451d1dec493189146785d02541f818cc6e 0759d1451d1dec493189146785d02541f818cc6e
Total tests
4010
Fixed in
#1928 (Code changes detected)

Tests

  • 4,010 tests in total
  • 3,291 tests failed
  • 3,289 failures are new
  • 34 tests were quarantined / skipped
  • 30 seconds taken in total.
New test failures 3289
Status Test Duration
Collapse Failed AllergenTest isSameAllergen_shouldBeCaseInsensitiveForNonCodedAllergen History
< 1 sec
org.dbunit.DatabaseUnitRuntimeException: org.dbunit.dataset.NoSuchTableException: Did not find table 'CONDITION' in schema 'null'
	at org.openmrs.test.BaseContextSensitiveTest.deleteAllData(BaseContextSensitiveTest.java:841)
	at org.openmrs.test.BaseContextSensitiveTest.baseSetupWithStandardDataAndAuthentication(BaseContextSensitiveTest.java:883)
	at sun.reflect.GeneratedMethodAccessor43.invoke(Unknown Source)
	at sun.reflect.DelegatingMethodAccessorImpl.invoke(DelegatingMethodAccessorImpl.java:43)
	at java.lang.reflect.Method.invoke(Method.java:498)
	at org.junit.runners.model.FrameworkMethod$1.runReflectiveCall(FrameworkMethod.java:50)
	at org.junit.internal.runners.model.ReflectiveCallable.run(ReflectiveCallable.java:12)
(63 more lines...)
Collapse Failed AllergenTest isSameAllergen_shouldReturnFalseForDifferentCodedAllergen History
< 1 sec
org.dbunit.DatabaseUnitRuntimeException: org.dbunit.dataset.NoSuchTableException: Did not find table 'CONDITION' in schema 'null'
	at org.openmrs.test.BaseContextSensitiveTest.deleteAllData(BaseContextSensitiveTest.java:841)
	at org.openmrs.test.BaseContextSensitiveTest.baseSetupWithStandardDataAndAuthentication(BaseContextSensitiveTest.java:883)
	at sun.reflect.GeneratedMethodAccessor43.invoke(Unknown Source)
	at sun.reflect.DelegatingMethodAccessorImpl.invoke(DelegatingMethodAccessorImpl.java:43)
	at java.lang.reflect.Method.invoke(Method.java:498)
	at org.junit.runners.model.FrameworkMethod$1.runReflectiveCall(FrameworkMethod.java:50)
	at org.junit.internal.runners.model.ReflectiveCallable.run(ReflectiveCallable.java:12)
(63 more lines...)
Collapse Failed AllergenTest isSameAllergen_shouldReturnFalseForDifferentNonCodedAllergen History
< 1 sec
org.dbunit.DatabaseUnitRuntimeException: org.dbunit.dataset.NoSuchTableException: Did not find table 'CONDITION' in schema 'null'
	at org.openmrs.test.BaseContextSensitiveTest.deleteAllData(BaseContextSensitiveTest.java:841)
	at org.openmrs.test.BaseContextSensitiveTest.baseSetupWithStandardDataAndAuthentication(BaseContextSensitiveTest.java:883)
	at sun.reflect.GeneratedMethodAccessor43.invoke(Unknown Source)
	at sun.reflect.DelegatingMethodAccessorImpl.invoke(DelegatingMethodAccessorImpl.java:43)
	at java.lang.reflect.Method.invoke(Method.java:498)
	at org.junit.runners.model.FrameworkMethod$1.runReflectiveCall(FrameworkMethod.java:50)
	at org.junit.internal.runners.model.ReflectiveCallable.run(ReflectiveCallable.java:12)
(63 more lines...)
Collapse Failed AllergenTest isSameAllergen_shouldReturnTrueForSameCodedAllergen History
< 1 sec
org.dbunit.DatabaseUnitRuntimeException: org.dbunit.dataset.NoSuchTableException: Did not find table 'CONDITION' in schema 'null'
	at org.openmrs.test.BaseContextSensitiveTest.deleteAllData(BaseContextSensitiveTest.java:841)
	at org.openmrs.test.BaseContextSensitiveTest.baseSetupWithStandardDataAndAuthentication(BaseContextSensitiveTest.java:883)
	at sun.reflect.GeneratedMethodAccessor43.invoke(Unknown Source)
	at sun.reflect.DelegatingMethodAccessorImpl.invoke(DelegatingMethodAccessorImpl.java:43)
	at java.lang.reflect.Method.invoke(Method.java:498)
	at org.junit.runners.model.FrameworkMethod$1.runReflectiveCall(FrameworkMethod.java:50)
	at org.junit.internal.runners.model.ReflectiveCallable.run(ReflectiveCallable.java:12)
(63 more lines...)
Collapse Failed AllergenTest isSameAllergen_shouldReturnTrueForSameNonCodedAllergen History
< 1 sec
org.dbunit.DatabaseUnitRuntimeException: org.dbunit.dataset.NoSuchTableException: Did not find table 'CONDITION' in schema 'null'
	at org.openmrs.test.BaseContextSensitiveTest.deleteAllData(BaseContextSensitiveTest.java:841)
	at org.openmrs.test.BaseContextSensitiveTest.baseSetupWithStandardDataAndAuthentication(BaseContextSensitiveTest.java:883)
	at sun.reflect.GeneratedMethodAccessor43.invoke(Unknown Source)
	at sun.reflect.DelegatingMethodAccessorImpl.invoke(DelegatingMethodAccessorImpl.java:43)
	at java.lang.reflect.Method.invoke(Method.java:498)
	at org.junit.runners.model.FrameworkMethod$1.runReflectiveCall(FrameworkMethod.java:50)
	at org.junit.internal.runners.model.ReflectiveCallable.run(ReflectiveCallable.java:12)
(63 more lines...)
Collapse Failed AllergenTest shouldEitherBeCodedOrFreeText History
< 1 sec
org.dbunit.DatabaseUnitRuntimeException: org.dbunit.dataset.NoSuchTableException: Did not find table 'CONDITION' in schema 'null'
	at org.openmrs.test.BaseContextSensitiveTest.deleteAllData(BaseContextSensitiveTest.java:841)
	at org.openmrs.test.BaseContextSensitiveTest.baseSetupWithStandardDataAndAuthentication(BaseContextSensitiveTest.java:883)
	at sun.reflect.GeneratedMethodAccessor43.invoke(Unknown Source)
	at sun.reflect.DelegatingMethodAccessorImpl.invoke(DelegatingMethodAccessorImpl.java:43)
	at java.lang.reflect.Method.invoke(Method.java:498)
	at org.junit.runners.model.FrameworkMethod$1.runReflectiveCall(FrameworkMethod.java:50)
	at org.junit.internal.runners.model.ReflectiveCallable.run(ReflectiveCallable.java:12)
(63 more lines...)
Collapse Failed AllergiesTest add2_shouldAllowNonDuplicateCodedAllergen History
< 1 sec
org.dbunit.DatabaseUnitRuntimeException: org.dbunit.dataset.NoSuchTableException: Did not find table 'CONDITION' in schema 'null'
	at org.openmrs.test.BaseContextSensitiveTest.deleteAllData(BaseContextSensitiveTest.java:841)
	at org.openmrs.test.BaseContextSensitiveTest.baseSetupWithStandardDataAndAuthentication(BaseContextSensitiveTest.java:883)
	at sun.reflect.GeneratedMethodAccessor43.invoke(Unknown Source)
	at sun.reflect.DelegatingMethodAccessorImpl.invoke(DelegatingMethodAccessorImpl.java:43)
	at java.lang.reflect.Method.invoke(Method.java:498)
	at org.junit.runners.model.FrameworkMethod$1.runReflectiveCall(FrameworkMethod.java:50)
	at org.junit.internal.runners.model.ReflectiveCallable.run(ReflectiveCallable.java:12)
(63 more lines...)
Collapse Failed AllergiesTest add2_shouldAllowNonDuplicateNonCodedAllergen History
< 1 sec
org.dbunit.DatabaseUnitRuntimeException: org.dbunit.dataset.NoSuchTableException: Did not find table 'CONDITION' in schema 'null'
	at org.openmrs.test.BaseContextSensitiveTest.deleteAllData(BaseContextSensitiveTest.java:841)
	at org.openmrs.test.BaseContextSensitiveTest.baseSetupWithStandardDataAndAuthentication(BaseContextSensitiveTest.java:883)
	at sun.reflect.GeneratedMethodAccessor43.invoke(Unknown Source)
	at sun.reflect.DelegatingMethodAccessorImpl.invoke(DelegatingMethodAccessorImpl.java:43)
	at java.lang.reflect.Method.invoke(Method.java:498)
	at org.junit.runners.model.FrameworkMethod$1.runReflectiveCall(FrameworkMethod.java:50)
	at org.junit.internal.runners.model.ReflectiveCallable.run(ReflectiveCallable.java:12)
(63 more lines...)
Collapse Failed AllergiesTest add2_shouldNotAllowDuplicateCodedAllergen History
< 1 sec
org.dbunit.DatabaseUnitRuntimeException: org.dbunit.dataset.NoSuchTableException: Did not find table 'CONDITION' in schema 'null'
	at org.openmrs.test.BaseContextSensitiveTest.deleteAllData(BaseContextSensitiveTest.java:841)
	at org.openmrs.test.BaseContextSensitiveTest.baseSetupWithStandardDataAndAuthentication(BaseContextSensitiveTest.java:883)
	at sun.reflect.GeneratedMethodAccessor43.invoke(Unknown Source)
	at sun.reflect.DelegatingMethodAccessorImpl.invoke(DelegatingMethodAccessorImpl.java:43)
	at java.lang.reflect.Method.invoke(Method.java:498)
	at org.junit.runners.model.FrameworkMethod$1.runReflectiveCall(FrameworkMethod.java:50)
	at org.junit.internal.runners.model.ReflectiveCallable.run(ReflectiveCallable.java:12)
(63 more lines...)
Collapse Failed AllergiesTest add2_shouldNotAllowDuplicateNonCodedAllergen History
< 1 sec
org.dbunit.DatabaseUnitRuntimeException: org.dbunit.dataset.NoSuchTableException: Did not find table 'CONDITION' in schema 'null'
	at org.openmrs.test.BaseContextSensitiveTest.deleteAllData(BaseContextSensitiveTest.java:841)
	at org.openmrs.test.BaseContextSensitiveTest.baseSetupWithStandardDataAndAuthentication(BaseContextSensitiveTest.java:883)
	at sun.reflect.GeneratedMethodAccessor43.invoke(Unknown Source)
	at sun.reflect.DelegatingMethodAccessorImpl.invoke(DelegatingMethodAccessorImpl.java:43)
	at java.lang.reflect.Method.invoke(Method.java:498)
	at org.junit.runners.model.FrameworkMethod$1.runReflectiveCall(FrameworkMethod.java:50)
	at org.junit.internal.runners.model.ReflectiveCallable.run(ReflectiveCallable.java:12)
(63 more lines...)
Collapse Failed AllergiesTest addAll2_shouldAllowNonDuplicateCodedAllergen History
< 1 sec
org.dbunit.DatabaseUnitRuntimeException: org.dbunit.dataset.NoSuchTableException: Did not find table 'CONDITION' in schema 'null'
	at org.openmrs.test.BaseContextSensitiveTest.deleteAllData(BaseContextSensitiveTest.java:841)
	at org.openmrs.test.BaseContextSensitiveTest.baseSetupWithStandardDataAndAuthentication(BaseContextSensitiveTest.java:883)
	at sun.reflect.GeneratedMethodAccessor43.invoke(Unknown Source)
	at sun.reflect.DelegatingMethodAccessorImpl.invoke(DelegatingMethodAccessorImpl.java:43)
	at java.lang.reflect.Method.invoke(Method.java:498)
	at org.junit.runners.model.FrameworkMethod$1.runReflectiveCall(FrameworkMethod.java:50)
	at org.junit.internal.runners.model.ReflectiveCallable.run(ReflectiveCallable.java:12)
(63 more lines...)
Collapse Failed AllergiesTest addAll2_shouldAllowNonDuplicateNonCodedAllergen History
< 1 sec
org.dbunit.DatabaseUnitRuntimeException: org.dbunit.dataset.NoSuchTableException: Did not find table 'CONDITION' in schema 'null'
	at org.openmrs.test.BaseContextSensitiveTest.deleteAllData(BaseContextSensitiveTest.java:841)
	at org.openmrs.test.BaseContextSensitiveTest.baseSetupWithStandardDataAndAuthentication(BaseContextSensitiveTest.java:883)
	at sun.reflect.GeneratedMethodAccessor43.invoke(Unknown Source)
	at sun.reflect.DelegatingMethodAccessorImpl.invoke(DelegatingMethodAccessorImpl.java:43)
	at java.lang.reflect.Method.invoke(Method.java:498)
	at org.junit.runners.model.FrameworkMethod$1.runReflectiveCall(FrameworkMethod.java:50)
	at org.junit.internal.runners.model.ReflectiveCallable.run(ReflectiveCallable.java:12)
(63 more lines...)
Collapse Failed AllergiesTest addAll2_shouldNotAllowDuplicateCodedAllergen History
< 1 sec
org.dbunit.DatabaseUnitRuntimeException: org.dbunit.dataset.NoSuchTableException: Did not find table 'CONDITION' in schema 'null'
	at org.openmrs.test.BaseContextSensitiveTest.deleteAllData(BaseContextSensitiveTest.java:841)
	at org.openmrs.test.BaseContextSensitiveTest.baseSetupWithStandardDataAndAuthentication(BaseContextSensitiveTest.java:883)
	at sun.reflect.GeneratedMethodAccessor43.invoke(Unknown Source)
	at sun.reflect.DelegatingMethodAccessorImpl.invoke(DelegatingMethodAccessorImpl.java:43)
	at java.lang.reflect.Method.invoke(Method.java:498)
	at org.junit.runners.model.FrameworkMethod$1.runReflectiveCall(FrameworkMethod.java:50)
	at org.junit.internal.runners.model.ReflectiveCallable.run(ReflectiveCallable.java:12)
(63 more lines...)
Collapse Failed AllergiesTest addAll2_shouldNotAllowDuplicateNonCodedAllergen History
< 1 sec
org.dbunit.DatabaseUnitRuntimeException: org.dbunit.dataset.NoSuchTableException: Did not find table 'CONDITION' in schema 'null'
	at org.openmrs.test.BaseContextSensitiveTest.deleteAllData(BaseContextSensitiveTest.java:841)
	at org.openmrs.test.BaseContextSensitiveTest.baseSetupWithStandardDataAndAuthentication(BaseContextSensitiveTest.java:883)
	at sun.reflect.GeneratedMethodAccessor43.invoke(Unknown Source)
	at sun.reflect.DelegatingMethodAccessorImpl.invoke(DelegatingMethodAccessorImpl.java:43)
	at java.lang.reflect.Method.invoke(Method.java:498)
	at org.junit.runners.model.FrameworkMethod$1.runReflectiveCall(FrameworkMethod.java:50)
	at org.junit.internal.runners.model.ReflectiveCallable.run(ReflectiveCallable.java:12)
(63 more lines...)
Collapse Failed AllergiesTest addAll4_shouldNotAllowDuplicateCodedAllergen History
< 1 sec
org.dbunit.DatabaseUnitRuntimeException: org.dbunit.dataset.NoSuchTableException: Did not find table 'CONDITION' in schema 'null'
	at org.openmrs.test.BaseContextSensitiveTest.deleteAllData(BaseContextSensitiveTest.java:841)
	at org.openmrs.test.BaseContextSensitiveTest.baseSetupWithStandardDataAndAuthentication(BaseContextSensitiveTest.java:883)
	at sun.reflect.GeneratedMethodAccessor43.invoke(Unknown Source)
	at sun.reflect.DelegatingMethodAccessorImpl.invoke(DelegatingMethodAccessorImpl.java:43)
	at java.lang.reflect.Method.invoke(Method.java:498)
	at org.junit.runners.model.FrameworkMethod$1.runReflectiveCall(FrameworkMethod.java:50)
	at org.junit.internal.runners.model.ReflectiveCallable.run(ReflectiveCallable.java:12)
(63 more lines...)
Collapse Failed AllergiesTest addAll5_shouldNotAllowDuplicateCodedAllergen History
< 1 sec
org.dbunit.DatabaseUnitRuntimeException: org.dbunit.dataset.NoSuchTableException: Did not find table 'CONDITION' in schema 'null'
	at org.openmrs.test.BaseContextSensitiveTest.deleteAllData(BaseContextSensitiveTest.java:841)
	at org.openmrs.test.BaseContextSensitiveTest.baseSetupWithStandardDataAndAuthentication(BaseContextSensitiveTest.java:883)
	at sun.reflect.GeneratedMethodAccessor43.invoke(Unknown Source)
	at sun.reflect.DelegatingMethodAccessorImpl.invoke(DelegatingMethodAccessorImpl.java:43)
	at java.lang.reflect.Method.invoke(Method.java:498)
	at org.junit.runners.model.FrameworkMethod$1.runReflectiveCall(FrameworkMethod.java:50)
	at org.junit.internal.runners.model.ReflectiveCallable.run(ReflectiveCallable.java:12)
(63 more lines...)
Collapse Failed AllergiesTest addAll6_shouldNotAllowDuplicateNonCodedAllergen History
< 1 sec
org.dbunit.DatabaseUnitRuntimeException: org.dbunit.dataset.NoSuchTableException: Did not find table 'CONDITION' in schema 'null'
	at org.openmrs.test.BaseContextSensitiveTest.deleteAllData(BaseContextSensitiveTest.java:841)
	at org.openmrs.test.BaseContextSensitiveTest.baseSetupWithStandardDataAndAuthentication(BaseContextSensitiveTest.java:883)
	at sun.reflect.GeneratedMethodAccessor43.invoke(Unknown Source)
	at sun.reflect.DelegatingMethodAccessorImpl.invoke(DelegatingMethodAccessorImpl.java:43)
	at java.lang.reflect.Method.invoke(Method.java:498)
	at org.junit.runners.model.FrameworkMethod$1.runReflectiveCall(FrameworkMethod.java:50)
	at org.junit.internal.runners.model.ReflectiveCallable.run(ReflectiveCallable.java:12)
(63 more lines...)
Collapse Failed AllergiesTest addAll7_shouldNotAllowDuplicateNonCodedAllergen History
< 1 sec
org.dbunit.DatabaseUnitRuntimeException: org.dbunit.dataset.NoSuchTableException: Did not find table 'CONDITION' in schema 'null'
	at org.openmrs.test.BaseContextSensitiveTest.deleteAllData(BaseContextSensitiveTest.java:841)
	at org.openmrs.test.BaseContextSensitiveTest.baseSetupWithStandardDataAndAuthentication(BaseContextSensitiveTest.java:883)
	at sun.reflect.GeneratedMethodAccessor43.invoke(Unknown Source)
	at sun.reflect.DelegatingMethodAccessorImpl.invoke(DelegatingMethodAccessorImpl.java:43)
	at java.lang.reflect.Method.invoke(Method.java:498)
	at org.junit.runners.model.FrameworkMethod$1.runReflectiveCall(FrameworkMethod.java:50)
	at org.junit.internal.runners.model.ReflectiveCallable.run(ReflectiveCallable.java:12)
(63 more lines...)
Collapse Failed AllergiesTest addAll_shouldAllowNonDuplicateCodedAllergen History
< 1 sec
org.dbunit.DatabaseUnitRuntimeException: org.dbunit.dataset.NoSuchTableException: Did not find table 'CONDITION' in schema 'null'
	at org.openmrs.test.BaseContextSensitiveTest.deleteAllData(BaseContextSensitiveTest.java:841)
	at org.openmrs.test.BaseContextSensitiveTest.baseSetupWithStandardDataAndAuthentication(BaseContextSensitiveTest.java:883)
	at sun.reflect.GeneratedMethodAccessor43.invoke(Unknown Source)
	at sun.reflect.DelegatingMethodAccessorImpl.invoke(DelegatingMethodAccessorImpl.java:43)
	at java.lang.reflect.Method.invoke(Method.java:498)
	at org.junit.runners.model.FrameworkMethod$1.runReflectiveCall(FrameworkMethod.java:50)
	at org.junit.internal.runners.model.ReflectiveCallable.run(ReflectiveCallable.java:12)
(63 more lines...)
Collapse Failed AllergiesTest addAll_shouldAllowNonDuplicateNonCodedAllergen History
< 1 sec
org.dbunit.DatabaseUnitRuntimeException: org.dbunit.dataset.NoSuchTableException: Did not find table 'CONDITION' in schema 'null'
	at org.openmrs.test.BaseContextSensitiveTest.deleteAllData(BaseContextSensitiveTest.java:841)
	at org.openmrs.test.BaseContextSensitiveTest.baseSetupWithStandardDataAndAuthentication(BaseContextSensitiveTest.java:883)
	at sun.reflect.GeneratedMethodAccessor43.invoke(Unknown Source)
	at sun.reflect.DelegatingMethodAccessorImpl.invoke(DelegatingMethodAccessorImpl.java:43)
	at java.lang.reflect.Method.invoke(Method.java:498)
	at org.junit.runners.model.FrameworkMethod$1.runReflectiveCall(FrameworkMethod.java:50)
	at org.junit.internal.runners.model.ReflectiveCallable.run(ReflectiveCallable.java:12)
(63 more lines...)
Collapse Failed AllergiesTest addAll_shouldNotAllowDuplicateCodedAllergen History
< 1 sec
org.dbunit.DatabaseUnitRuntimeException: org.dbunit.dataset.NoSuchTableException: Did not find table 'CONDITION' in schema 'null'
	at org.openmrs.test.BaseContextSensitiveTest.deleteAllData(BaseContextSensitiveTest.java:841)
	at org.openmrs.test.BaseContextSensitiveTest.baseSetupWithStandardDataAndAuthentication(BaseContextSensitiveTest.java:883)
	at sun.reflect.GeneratedMethodAccessor43.invoke(Unknown Source)
	at sun.reflect.DelegatingMethodAccessorImpl.invoke(DelegatingMethodAccessorImpl.java:43)
	at java.lang.reflect.Method.invoke(Method.java:498)
	at org.junit.runners.model.FrameworkMethod$1.runReflectiveCall(FrameworkMethod.java:50)
	at org.junit.internal.runners.model.ReflectiveCallable.run(ReflectiveCallable.java:12)
(63 more lines...)
Collapse Failed AllergiesTest addAll_shouldNotAllowDuplicateNonCodedAllergen History
< 1 sec
org.dbunit.DatabaseUnitRuntimeException: org.dbunit.dataset.NoSuchTableException: Did not find table 'CONDITION' in schema 'null'
	at org.openmrs.test.BaseContextSensitiveTest.deleteAllData(BaseContextSensitiveTest.java:841)
	at org.openmrs.test.BaseContextSensitiveTest.baseSetupWithStandardDataAndAuthentication(BaseContextSensitiveTest.java:883)
	at sun.reflect.GeneratedMethodAccessor43.invoke(Unknown Source)
	at sun.reflect.DelegatingMethodAccessorImpl.invoke(DelegatingMethodAccessorImpl.java:43)
	at java.lang.reflect.Method.invoke(Method.java:498)
	at org.junit.runners.model.FrameworkMethod$1.runReflectiveCall(FrameworkMethod.java:50)
	at org.junit.internal.runners.model.ReflectiveCallable.run(ReflectiveCallable.java:12)
(63 more lines...)
Collapse Failed AllergiesTest add_shouldAllowNonDuplicateCodedAllergen History
< 1 sec
org.dbunit.DatabaseUnitRuntimeException: org.dbunit.dataset.NoSuchTableException: Did not find table 'CONDITION' in schema 'null'
	at org.openmrs.test.BaseContextSensitiveTest.deleteAllData(BaseContextSensitiveTest.java:841)
	at org.openmrs.test.BaseContextSensitiveTest.baseSetupWithStandardDataAndAuthentication(BaseContextSensitiveTest.java:883)
	at sun.reflect.GeneratedMethodAccessor43.invoke(Unknown Source)
	at sun.reflect.DelegatingMethodAccessorImpl.invoke(DelegatingMethodAccessorImpl.java:43)
	at java.lang.reflect.Method.invoke(Method.java:498)
	at org.junit.runners.model.FrameworkMethod$1.runReflectiveCall(FrameworkMethod.java:50)
	at org.junit.internal.runners.model.ReflectiveCallable.run(ReflectiveCallable.java:12)
(63 more lines...)
Collapse Failed AllergiesTest add_shouldAllowNonDuplicateNonCodedAllergen History
< 1 sec
org.dbunit.DatabaseUnitRuntimeException: org.dbunit.dataset.NoSuchTableException: Did not find table 'CONDITION' in schema 'null'
	at org.openmrs.test.BaseContextSensitiveTest.deleteAllData(BaseContextSensitiveTest.java:841)
	at org.openmrs.test.BaseContextSensitiveTest.baseSetupWithStandardDataAndAuthentication(BaseContextSensitiveTest.java:883)
	at sun.reflect.GeneratedMethodAccessor43.invoke(Unknown Source)
	at sun.reflect.DelegatingMethodAccessorImpl.invoke(DelegatingMethodAccessorImpl.java:43)
	at java.lang.reflect.Method.invoke(Method.java:498)
	at org.junit.runners.model.FrameworkMethod$1.runReflectiveCall(FrameworkMethod.java:50)
	at org.junit.internal.runners.model.ReflectiveCallable.run(ReflectiveCallable.java:12)
(63 more lines...)
Collapse Failed AllergiesTest add_shouldNotAllowDuplicateCodedAllergen History
< 1 sec
org.dbunit.DatabaseUnitRuntimeException: org.dbunit.dataset.NoSuchTableException: Did not find table 'CONDITION' in schema 'null'
	at org.openmrs.test.BaseContextSensitiveTest.deleteAllData(BaseContextSensitiveTest.java:841)
	at org.openmrs.test.BaseContextSensitiveTest.baseSetupWithStandardDataAndAuthentication(BaseContextSensitiveTest.java:883)
	at sun.reflect.GeneratedMethodAccessor43.invoke(Unknown Source)
	at sun.reflect.DelegatingMethodAccessorImpl.invoke(DelegatingMethodAccessorImpl.java:43)
	at java.lang.reflect.Method.invoke(Method.java:498)
	at org.junit.runners.model.FrameworkMethod$1.runReflectiveCall(FrameworkMethod.java:50)
	at org.junit.internal.runners.model.ReflectiveCallable.run(ReflectiveCallable.java:12)
(63 more lines...)
Collapse Failed AllergiesTest add_shouldNotAllowDuplicateNonCodedAllergen History
< 1 sec
org.dbunit.DatabaseUnitRuntimeException: org.dbunit.dataset.NoSuchTableException: Did not find table 'CONDITION' in schema 'null'
	at org.openmrs.test.BaseContextSensitiveTest.deleteAllData(BaseContextSensitiveTest.java:841)
	at org.openmrs.test.BaseContextSensitiveTest.baseSetupWithStandardDataAndAuthentication(BaseContextSensitiveTest.java:883)
	at sun.reflect.GeneratedMethodAccessor43.invoke(Unknown Source)
	at sun.reflect.DelegatingMethodAccessorImpl.invoke(DelegatingMethodAccessorImpl.java:43)
	at java.lang.reflect.Method.invoke(Method.java:498)
	at org.junit.runners.model.FrameworkMethod$1.runReflectiveCall(FrameworkMethod.java:50)
	at org.junit.internal.runners.model.ReflectiveCallable.run(ReflectiveCallable.java:12)
(63 more lines...)
Collapse Failed AllergiesTest shouldAddAllergyAndSetCorrectStatus History
< 1 sec
org.dbunit.DatabaseUnitRuntimeException: org.dbunit.dataset.NoSuchTableException: Did not find table 'CONDITION' in schema 'null'
	at org.openmrs.test.BaseContextSensitiveTest.deleteAllData(BaseContextSensitiveTest.java:841)
	at org.openmrs.test.BaseContextSensitiveTest.baseSetupWithStandardDataAndAuthentication(BaseContextSensitiveTest.java:883)
	at sun.reflect.GeneratedMethodAccessor43.invoke(Unknown Source)
	at sun.reflect.DelegatingMethodAccessorImpl.invoke(DelegatingMethodAccessorImpl.java:43)
	at java.lang.reflect.Method.invoke(Method.java:498)
	at org.junit.runners.model.FrameworkMethod$1.runReflectiveCall(FrameworkMethod.java:50)
	at org.junit.internal.runners.model.ReflectiveCallable.run(ReflectiveCallable.java:12)
(63 more lines...)
Collapse Failed AllergiesTest shouldAddAllergyCollectionAndSetCorrectStatus History
< 1 sec
org.dbunit.DatabaseUnitRuntimeException: org.dbunit.dataset.NoSuchTableException: Did not find table 'CONDITION' in schema 'null'
	at org.openmrs.test.BaseContextSensitiveTest.deleteAllData(BaseContextSensitiveTest.java:841)
	at org.openmrs.test.BaseContextSensitiveTest.baseSetupWithStandardDataAndAuthentication(BaseContextSensitiveTest.java:883)
	at sun.reflect.GeneratedMethodAccessor43.invoke(Unknown Source)
	at sun.reflect.DelegatingMethodAccessorImpl.invoke(DelegatingMethodAccessorImpl.java:43)
	at java.lang.reflect.Method.invoke(Method.java:498)
	at org.junit.runners.model.FrameworkMethod$1.runReflectiveCall(FrameworkMethod.java:50)
	at org.junit.internal.runners.model.ReflectiveCallable.run(ReflectiveCallable.java:12)
(63 more lines...)
Collapse Failed AllergiesTest shouldClearAllergyAndSetCorrectStatus History
< 1 sec
org.dbunit.DatabaseUnitRuntimeException: org.dbunit.dataset.NoSuchTableException: Did not find table 'CONDITION' in schema 'null'
	at org.openmrs.test.BaseContextSensitiveTest.deleteAllData(BaseContextSensitiveTest.java:841)
	at org.openmrs.test.BaseContextSensitiveTest.baseSetupWithStandardDataAndAuthentication(BaseContextSensitiveTest.java:883)
	at sun.reflect.GeneratedMethodAccessor43.invoke(Unknown Source)
	at sun.reflect.DelegatingMethodAccessorImpl.invoke(DelegatingMethodAccessorImpl.java:43)
	at java.lang.reflect.Method.invoke(Method.java:498)
	at org.junit.runners.model.FrameworkMethod$1.runReflectiveCall(FrameworkMethod.java:50)
	at org.junit.internal.runners.model.ReflectiveCallable.run(ReflectiveCallable.java:12)
(63 more lines...)
Collapse Failed AllergiesTest shouldConfirmNoKnownAllergies History
< 1 sec
org.dbunit.DatabaseUnitRuntimeException: org.dbunit.dataset.NoSuchTableException: Did not find table 'CONDITION' in schema 'null'
	at org.openmrs.test.BaseContextSensitiveTest.deleteAllData(BaseContextSensitiveTest.java:841)
	at org.openmrs.test.BaseContextSensitiveTest.baseSetupWithStandardDataAndAuthentication(BaseContextSensitiveTest.java:883)
	at sun.reflect.GeneratedMethodAccessor43.invoke(Unknown Source)
	at sun.reflect.DelegatingMethodAccessorImpl.invoke(DelegatingMethodAccessorImpl.java:43)
	at java.lang.reflect.Method.invoke(Method.java:498)
	at org.junit.runners.model.FrameworkMethod$1.runReflectiveCall(FrameworkMethod.java:50)
	at org.junit.internal.runners.model.ReflectiveCallable.run(ReflectiveCallable.java:12)
(63 more lines...)
Collapse Failed AllergiesTest shouldRemoveAllergyAndSetCorrectStatus History
< 1 sec
org.dbunit.DatabaseUnitRuntimeException: org.dbunit.dataset.NoSuchTableException: Did not find table 'CONDITION' in schema 'null'
	at org.openmrs.test.BaseContextSensitiveTest.deleteAllData(BaseContextSensitiveTest.java:841)
	at org.openmrs.test.BaseContextSensitiveTest.baseSetupWithStandardDataAndAuthentication(BaseContextSensitiveTest.java:883)
	at sun.reflect.GeneratedMethodAccessor43.invoke(Unknown Source)
	at sun.reflect.DelegatingMethodAccessorImpl.invoke(DelegatingMethodAccessorImpl.java:43)
	at java.lang.reflect.Method.invoke(Method.java:498)
	at org.junit.runners.model.FrameworkMethod$1.runReflectiveCall(FrameworkMethod.java:50)
	at org.junit.internal.runners.model.ReflectiveCallable.run(ReflectiveCallable.java:12)
(63 more lines...)
Collapse Failed AllergiesTest shouldThrowAnErrorWhenTryingConfirmNoKnowAllergiesWhileAllergiesIsNotEmpty History
< 1 sec
org.dbunit.DatabaseUnitRuntimeException: org.dbunit.dataset.NoSuchTableException: Did not find table 'CONDITION' in schema 'null'
	at org.openmrs.test.BaseContextSensitiveTest.deleteAllData(BaseContextSensitiveTest.java:841)
	at org.openmrs.test.BaseContextSensitiveTest.baseSetupWithStandardDataAndAuthentication(BaseContextSensitiveTest.java:883)
	at sun.reflect.GeneratedMethodAccessor43.invoke(Unknown Source)
	at sun.reflect.DelegatingMethodAccessorImpl.invoke(DelegatingMethodAccessorImpl.java:43)
	at java.lang.reflect.Method.invoke(Method.java:498)
	at org.junit.runners.model.FrameworkMethod$1.runReflectiveCall(FrameworkMethod.java:50)
	at org.junit.internal.runners.model.ReflectiveCallable.run(ReflectiveCallable.java:12)
(63 more lines...)
Collapse Failed BaseCustomizableMetadataTest setAttribute_shouldVoidTheAttributeIfAnAttributeWithSameAttributeTypeAlreadyExistsAndTheMaxOccursIsSetTo1 History
< 1 sec
org.dbunit.DatabaseUnitRuntimeException: org.dbunit.dataset.NoSuchTableException: Did not find table 'CONDITION' in schema 'null'
	at org.openmrs.test.BaseContextSensitiveTest.deleteAllData(BaseContextSensitiveTest.java:841)
	at org.openmrs.test.BaseContextSensitiveTest.baseSetupWithStandardDataAndAuthentication(BaseContextSensitiveTest.java:883)
	at sun.reflect.GeneratedMethodAccessor43.invoke(Unknown Source)
	at sun.reflect.DelegatingMethodAccessorImpl.invoke(DelegatingMethodAccessorImpl.java:43)
	at java.lang.reflect.Method.invoke(Method.java:498)
	at org.junit.runners.model.FrameworkMethod$1.runReflectiveCall(FrameworkMethod.java:50)
	at org.junit.internal.runners.model.ReflectiveCallable.run(ReflectiveCallable.java:12)
(63 more lines...)
Collapse Failed BaseCustomizableMetadataTest setAttribute_shouldWorkForAttriubutesWithDatatypesWhoseValuesAreStoredInOtherTables History
< 1 sec
org.dbunit.DatabaseUnitRuntimeException: org.dbunit.dataset.NoSuchTableException: Did not find table 'CONDITION' in schema 'null'
	at org.openmrs.test.BaseContextSensitiveTest.deleteAllData(BaseContextSensitiveTest.java:841)
	at org.openmrs.test.BaseContextSensitiveTest.baseSetupWithStandardDataAndAuthentication(BaseContextSensitiveTest.java:883)
	at sun.reflect.GeneratedMethodAccessor43.invoke(Unknown Source)
	at sun.reflect.DelegatingMethodAccessorImpl.invoke(DelegatingMethodAccessorImpl.java:43)
	at java.lang.reflect.Method.invoke(Method.java:498)
	at org.junit.runners.model.FrameworkMethod$1.runReflectiveCall(FrameworkMethod.java:50)
	at org.junit.internal.runners.model.ReflectiveCallable.run(ReflectiveCallable.java:12)
(63 more lines...)
Collapse Failed BaseOpenmrsObjectTest equals_shouldReturnFalseIfGivenObjHasNullUuid History
< 1 sec
org.dbunit.DatabaseUnitRuntimeException: org.dbunit.dataset.NoSuchTableException: Did not find table 'CONDITION' in schema 'null'
	at org.openmrs.test.BaseContextSensitiveTest.deleteAllData(BaseContextSensitiveTest.java:841)
	at org.openmrs.test.BaseContextSensitiveTest.baseSetupWithStandardDataAndAuthentication(BaseContextSensitiveTest.java:883)
	at sun.reflect.GeneratedMethodAccessor43.invoke(Unknown Source)
	at sun.reflect.DelegatingMethodAccessorImpl.invoke(DelegatingMethodAccessorImpl.java:43)
	at java.lang.reflect.Method.invoke(Method.java:498)
	at org.junit.runners.model.FrameworkMethod$1.runReflectiveCall(FrameworkMethod.java:50)
	at org.junit.internal.runners.model.ReflectiveCallable.run(ReflectiveCallable.java:12)
(63 more lines...)
Collapse Failed BaseOpenmrsObjectTest equals_shouldReturnFalseIfGivenObjIsNotInstanceOfBaseOpenmrsObject History
< 1 sec
org.dbunit.DatabaseUnitRuntimeException: org.dbunit.dataset.NoSuchTableException: Did not find table 'CONDITION' in schema 'null'
	at org.openmrs.test.BaseContextSensitiveTest.deleteAllData(BaseContextSensitiveTest.java:841)
	at org.openmrs.test.BaseContextSensitiveTest.baseSetupWithStandardDataAndAuthentication(BaseContextSensitiveTest.java:883)
	at sun.reflect.GeneratedMethodAccessor43.invoke(Unknown Source)
	at sun.reflect.DelegatingMethodAccessorImpl.invoke(DelegatingMethodAccessorImpl.java:43)
	at java.lang.reflect.Method.invoke(Method.java:498)
	at org.junit.runners.model.FrameworkMethod$1.runReflectiveCall(FrameworkMethod.java:50)
	at org.junit.internal.runners.model.ReflectiveCallable.run(ReflectiveCallable.java:12)
(63 more lines...)
Collapse Failed BaseOpenmrsObjectTest equals_shouldReturnFalseIfGivenObjIsNotInstanceOfSuperOrExtendingClass History
< 1 sec
org.dbunit.DatabaseUnitRuntimeException: org.dbunit.dataset.NoSuchTableException: Did not find table 'CONDITION' in schema 'null'
	at org.openmrs.test.BaseContextSensitiveTest.deleteAllData(BaseContextSensitiveTest.java:841)
	at org.openmrs.test.BaseContextSensitiveTest.baseSetupWithStandardDataAndAuthentication(BaseContextSensitiveTest.java:883)
	at sun.reflect.GeneratedMethodAccessor43.invoke(Unknown Source)
	at sun.reflect.DelegatingMethodAccessorImpl.invoke(DelegatingMethodAccessorImpl.java:43)
	at java.lang.reflect.Method.invoke(Method.java:498)
	at org.junit.runners.model.FrameworkMethod$1.runReflectiveCall(FrameworkMethod.java:50)
	at org.junit.internal.runners.model.ReflectiveCallable.run(ReflectiveCallable.java:12)
(63 more lines...)
Collapse Failed BaseOpenmrsObjectTest equals_shouldReturnFalseIfGivenObjIsNull History
< 1 sec
org.dbunit.DatabaseUnitRuntimeException: org.dbunit.dataset.NoSuchTableException: Did not find table 'CONDITION' in schema 'null'
	at org.openmrs.test.BaseContextSensitiveTest.deleteAllData(BaseContextSensitiveTest.java:841)
	at org.openmrs.test.BaseContextSensitiveTest.baseSetupWithStandardDataAndAuthentication(BaseContextSensitiveTest.java:883)
	at sun.reflect.GeneratedMethodAccessor43.invoke(Unknown Source)
	at sun.reflect.DelegatingMethodAccessorImpl.invoke(DelegatingMethodAccessorImpl.java:43)
	at java.lang.reflect.Method.invoke(Method.java:498)
	at org.junit.runners.model.FrameworkMethod$1.runReflectiveCall(FrameworkMethod.java:50)
	at org.junit.internal.runners.model.ReflectiveCallable.run(ReflectiveCallable.java:12)
(63 more lines...)
Collapse Failed BaseOpenmrsObjectTest equals_shouldReturnFalseIfGivenObjectIsNotSubclassOfSuperOrExtendingClass History
< 1 sec
org.dbunit.DatabaseUnitRuntimeException: org.dbunit.dataset.NoSuchTableException: Did not find table 'CONDITION' in schema 'null'
	at org.openmrs.test.BaseContextSensitiveTest.deleteAllData(BaseContextSensitiveTest.java:841)
	at org.openmrs.test.BaseContextSensitiveTest.baseSetupWithStandardDataAndAuthentication(BaseContextSensitiveTest.java:883)
	at sun.reflect.GeneratedMethodAccessor43.invoke(Unknown Source)
	at sun.reflect.DelegatingMethodAccessorImpl.invoke(DelegatingMethodAccessorImpl.java:43)
	at java.lang.reflect.Method.invoke(Method.java:498)
	at org.junit.runners.model.FrameworkMethod$1.runReflectiveCall(FrameworkMethod.java:50)
	at org.junit.internal.runners.model.ReflectiveCallable.run(ReflectiveCallable.java:12)
(63 more lines...)
Collapse Failed BaseOpenmrsObjectTest equals_shouldReturnFalseIfHibernateProxyOfOneThingIsComparedtoNonHibernateProxyofSomething History
< 1 sec
org.dbunit.DatabaseUnitRuntimeException: org.dbunit.dataset.NoSuchTableException: Did not find table 'CONDITION' in schema 'null'
	at org.openmrs.test.BaseContextSensitiveTest.deleteAllData(BaseContextSensitiveTest.java:841)
	at org.openmrs.test.BaseContextSensitiveTest.baseSetupWithStandardDataAndAuthentication(BaseContextSensitiveTest.java:883)
	at sun.reflect.GeneratedMethodAccessor43.invoke(Unknown Source)
	at sun.reflect.DelegatingMethodAccessorImpl.invoke(DelegatingMethodAccessorImpl.java:43)
	at java.lang.reflect.Method.invoke(Method.java:498)
	at org.junit.runners.model.FrameworkMethod$1.runReflectiveCall(FrameworkMethod.java:50)
	at org.junit.internal.runners.model.ReflectiveCallable.run(ReflectiveCallable.java:12)
(63 more lines...)
Collapse Failed BaseOpenmrsObjectTest equals_shouldReturnFalseIfUuidIsNull History
< 1 sec
org.dbunit.DatabaseUnitRuntimeException: org.dbunit.dataset.NoSuchTableException: Did not find table 'CONDITION' in schema 'null'
	at org.openmrs.test.BaseContextSensitiveTest.deleteAllData(BaseContextSensitiveTest.java:841)
	at org.openmrs.test.BaseContextSensitiveTest.baseSetupWithStandardDataAndAuthentication(BaseContextSensitiveTest.java:883)
	at sun.reflect.GeneratedMethodAccessor43.invoke(Unknown Source)
	at sun.reflect.DelegatingMethodAccessorImpl.invoke(DelegatingMethodAccessorImpl.java:43)
	at java.lang.reflect.Method.invoke(Method.java:498)
	at org.junit.runners.model.FrameworkMethod$1.runReflectiveCall(FrameworkMethod.java:50)
	at org.junit.internal.runners.model.ReflectiveCallable.run(ReflectiveCallable.java:12)
(63 more lines...)
Collapse Failed BaseOpenmrsObjectTest equals_shouldReturnTrueIfGivenObjectIsInstanceOfSuperOrExtendingClass History
< 1 sec
org.dbunit.DatabaseUnitRuntimeException: org.dbunit.dataset.NoSuchTableException: Did not find table 'CONDITION' in schema 'null'
	at org.openmrs.test.BaseContextSensitiveTest.deleteAllData(BaseContextSensitiveTest.java:841)
	at org.openmrs.test.BaseContextSensitiveTest.baseSetupWithStandardDataAndAuthentication(BaseContextSensitiveTest.java:883)
	at sun.reflect.GeneratedMethodAccessor43.invoke(Unknown Source)
	at sun.reflect.DelegatingMethodAccessorImpl.invoke(DelegatingMethodAccessorImpl.java:43)
	at java.lang.reflect.Method.invoke(Method.java:498)
	at org.junit.runners.model.FrameworkMethod$1.runReflectiveCall(FrameworkMethod.java:50)
	at org.junit.internal.runners.model.ReflectiveCallable.run(ReflectiveCallable.java:12)
(63 more lines...)
Collapse Failed BaseOpenmrsObjectTest equals_shouldReturnTrueIfGivenObjectIsSubclassOfSuperOrExtendingClass History
< 1 sec
org.dbunit.DatabaseUnitRuntimeException: org.dbunit.dataset.NoSuchTableException: Did not find table 'CONDITION' in schema 'null'
	at org.openmrs.test.BaseContextSensitiveTest.deleteAllData(BaseContextSensitiveTest.java:841)
	at org.openmrs.test.BaseContextSensitiveTest.baseSetupWithStandardDataAndAuthentication(BaseContextSensitiveTest.java:883)
	at sun.reflect.GeneratedMethodAccessor43.invoke(Unknown Source)
	at sun.reflect.DelegatingMethodAccessorImpl.invoke(DelegatingMethodAccessorImpl.java:43)
	at java.lang.reflect.Method.invoke(Method.java:498)
	at org.junit.runners.model.FrameworkMethod$1.runReflectiveCall(FrameworkMethod.java:50)
	at org.junit.internal.runners.model.ReflectiveCallable.run(ReflectiveCallable.java:12)
(63 more lines...)
Collapse Failed BaseOpenmrsObjectTest equals_shouldReturnTrueIfHibernateProxyOfOneObjectComparedToNonHibernateProxyOfTheSameObject History
< 1 sec
org.dbunit.DatabaseUnitRuntimeException: org.dbunit.dataset.NoSuchTableException: Did not find table 'CONDITION' in schema 'null'
	at org.openmrs.test.BaseContextSensitiveTest.deleteAllData(BaseContextSensitiveTest.java:841)
	at org.openmrs.test.BaseContextSensitiveTest.baseSetupWithStandardDataAndAuthentication(BaseContextSensitiveTest.java:883)
	at sun.reflect.GeneratedMethodAccessor43.invoke(Unknown Source)
	at sun.reflect.DelegatingMethodAccessorImpl.invoke(DelegatingMethodAccessorImpl.java:43)
	at java.lang.reflect.Method.invoke(Method.java:498)
	at org.junit.runners.model.FrameworkMethod$1.runReflectiveCall(FrameworkMethod.java:50)
	at org.junit.internal.runners.model.ReflectiveCallable.run(ReflectiveCallable.java:12)
(63 more lines...)
Collapse Failed BaseOpenmrsObjectTest equals_shouldReturnTrueIfHibernateProxyOfSomeObjectComparedToAnotherHibernateProxyOfTheSameObject History
< 1 sec
org.dbunit.DatabaseUnitRuntimeException: org.dbunit.dataset.NoSuchTableException: Did not find table 'CONDITION' in schema 'null'
	at org.openmrs.test.BaseContextSensitiveTest.deleteAllData(BaseContextSensitiveTest.java:841)
	at org.openmrs.test.BaseContextSensitiveTest.baseSetupWithStandardDataAndAuthentication(BaseContextSensitiveTest.java:883)
	at sun.reflect.GeneratedMethodAccessor43.invoke(Unknown Source)
	at sun.reflect.DelegatingMethodAccessorImpl.invoke(DelegatingMethodAccessorImpl.java:43)
	at java.lang.reflect.Method.invoke(Method.java:498)
	at org.junit.runners.model.FrameworkMethod$1.runReflectiveCall(FrameworkMethod.java:50)
	at org.junit.internal.runners.model.ReflectiveCallable.run(ReflectiveCallable.java:12)
(63 more lines...)
Collapse Failed BaseOpenmrsObjectTest equals_shouldReturnTrueIfObjectsAreTheSame History
< 1 sec
org.dbunit.DatabaseUnitRuntimeException: org.dbunit.dataset.NoSuchTableException: Did not find table 'CONDITION' in schema 'null'
	at org.openmrs.test.BaseContextSensitiveTest.deleteAllData(BaseContextSensitiveTest.java:841)
	at org.openmrs.test.BaseContextSensitiveTest.baseSetupWithStandardDataAndAuthentication(BaseContextSensitiveTest.java:883)
	at sun.reflect.GeneratedMethodAccessor43.invoke(Unknown Source)
	at sun.reflect.DelegatingMethodAccessorImpl.invoke(DelegatingMethodAccessorImpl.java:43)
	at java.lang.reflect.Method.invoke(Method.java:498)
	at org.junit.runners.model.FrameworkMethod$1.runReflectiveCall(FrameworkMethod.java:50)
	at org.junit.internal.runners.model.ReflectiveCallable.run(ReflectiveCallable.java:12)
(63 more lines...)
Collapse Failed BaseOpenmrsObjectTest equals_shouldReturnTrueIfUuidsAreEqual History
< 1 sec
org.dbunit.DatabaseUnitRuntimeException: org.dbunit.dataset.NoSuchTableException: Did not find table 'CONDITION' in schema 'null'
	at org.openmrs.test.BaseContextSensitiveTest.deleteAllData(BaseContextSensitiveTest.java:841)
	at org.openmrs.test.BaseContextSensitiveTest.baseSetupWithStandardDataAndAuthentication(BaseContextSensitiveTest.java:883)
	at sun.reflect.GeneratedMethodAccessor43.invoke(Unknown Source)
	at sun.reflect.DelegatingMethodAccessorImpl.invoke(DelegatingMethodAccessorImpl.java:43)
	at java.lang.reflect.Method.invoke(Method.java:498)
	at org.junit.runners.model.FrameworkMethod$1.runReflectiveCall(FrameworkMethod.java:50)
	at org.junit.internal.runners.model.ReflectiveCallable.run(ReflectiveCallable.java:12)
(63 more lines...)
Collapse Failed BaseOpenmrsObjectTest equals_shouldReturnfalseIfHibernateProxyOfOneThingIsComparedtoHibernateProxyofSomething History
< 1 sec
org.dbunit.DatabaseUnitRuntimeException: org.dbunit.dataset.NoSuchTableException: Did not find table 'CONDITION' in schema 'null'
	at org.openmrs.test.BaseContextSensitiveTest.deleteAllData(BaseContextSensitiveTest.java:841)
	at org.openmrs.test.BaseContextSensitiveTest.baseSetupWithStandardDataAndAuthentication(BaseContextSensitiveTest.java:883)
	at sun.reflect.GeneratedMethodAccessor43.invoke(Unknown Source)
	at sun.reflect.DelegatingMethodAccessorImpl.invoke(DelegatingMethodAccessorImpl.java:43)
	at java.lang.reflect.Method.invoke(Method.java:498)
	at org.junit.runners.model.FrameworkMethod$1.runReflectiveCall(FrameworkMethod.java:50)
	at org.junit.internal.runners.model.ReflectiveCallable.run(ReflectiveCallable.java:12)
(63 more lines...)
Collapse Failed BaseOpenmrsObjectTest equals_shouldWorkOnNonHibernateManagedClasses History
< 1 sec
org.dbunit.DatabaseUnitRuntimeException: org.dbunit.dataset.NoSuchTableException: Did not find table 'CONDITION' in schema 'null'
	at org.openmrs.test.BaseContextSensitiveTest.deleteAllData(BaseContextSensitiveTest.java:841)
	at org.openmrs.test.BaseContextSensitiveTest.baseSetupWithStandardDataAndAuthentication(BaseContextSensitiveTest.java:883)
	at sun.reflect.GeneratedMethodAccessor43.invoke(Unknown Source)
	at sun.reflect.DelegatingMethodAccessorImpl.invoke(DelegatingMethodAccessorImpl.java:43)
	at java.lang.reflect.Method.invoke(Method.java:498)
	at org.junit.runners.model.FrameworkMethod$1.runReflectiveCall(FrameworkMethod.java:50)
	at org.junit.internal.runners.model.ReflectiveCallable.run(ReflectiveCallable.java:12)
(63 more lines...)
Collapse Failed BaseOpenmrsObjectTest hashCode_shouldNotFailIfUuidIsNull History
< 1 sec
org.dbunit.DatabaseUnitRuntimeException: org.dbunit.dataset.NoSuchTableException: Did not find table 'CONDITION' in schema 'null'
	at org.openmrs.test.BaseContextSensitiveTest.deleteAllData(BaseContextSensitiveTest.java:841)
	at org.openmrs.test.BaseContextSensitiveTest.baseSetupWithStandardDataAndAuthentication(BaseContextSensitiveTest.java:883)
	at sun.reflect.GeneratedMethodAccessor43.invoke(Unknown Source)
	at sun.reflect.DelegatingMethodAccessorImpl.invoke(DelegatingMethodAccessorImpl.java:43)
	at java.lang.reflect.Method.invoke(Method.java:498)
	at org.junit.runners.model.FrameworkMethod$1.runReflectiveCall(FrameworkMethod.java:50)
	at org.junit.internal.runners.model.ReflectiveCallable.run(ReflectiveCallable.java:12)
(63 more lines...)
Existing test failures 2
Status Test Failing since Duration
org.dbunit.DatabaseUnitRuntimeException: org.dbunit.dataset.NoSuchTableException: Did not find table 'CONDITION' in schema 'null'
	at org.openmrs.test.BaseContextSensitiveTest.deleteAllData(BaseContextSensitiveTest.java:841)
	at org.openmrs.test.BaseContextSensitiveTest.baseSetupWithStandardDataAndAuthentication(BaseContextSensitiveTest.java:883)
	at sun.reflect.GeneratedMethodAccessor43.invoke(Unknown Source)
	at sun.reflect.DelegatingMethodAccessorImpl.invoke(DelegatingMethodAccessorImpl.java:43)
	at java.lang.reflect.Method.invoke(Method.java:498)
	at org.junit.runners.model.FrameworkMethod$1.runReflectiveCall(FrameworkMethod.java:50)
	at org.junit.internal.runners.model.ReflectiveCallable.run(ReflectiveCallable.java:12)
(63 more lines...)
org.dbunit.DatabaseUnitRuntimeException: org.dbunit.dataset.NoSuchTableException: Did not find table 'CONDITION' in schema 'null'
	at org.openmrs.test.BaseContextSensitiveTest.deleteAllData(BaseContextSensitiveTest.java:841)
	at org.openmrs.test.BaseContextSensitiveTest.baseSetupWithStandardDataAndAuthentication(BaseContextSensitiveTest.java:883)
	at sun.reflect.GeneratedMethodAccessor43.invoke(Unknown Source)
	at sun.reflect.DelegatingMethodAccessorImpl.invoke(DelegatingMethodAccessorImpl.java:43)
	at java.lang.reflect.Method.invoke(Method.java:498)
	at org.junit.runners.model.FrameworkMethod$1.runReflectiveCall(FrameworkMethod.java:50)
	at org.junit.internal.runners.model.ReflectiveCallable.run(ReflectiveCallable.java:12)
(63 more lines...)

Error summary

The build generated some errors. See the full build log for more details.

[Fatal Error] :1:67: XML document structures must start and end within the same entity.
[Fatal Error] :-1:-1: Premature end of file.