Build: #494 failed

Job: Build and Test failed

Stages & jobs

  1. Build and Test

Job result summary

Completed
Duration
4 minutes
Revision
08e0bc1ddac0499972d491103d72c313aef77128 08e0bc1ddac0499972d491103d72c313aef77128
Total tests
2030
Failing since
#490 (Code changes detected – )
Fixed in
#495 (Manual run by Rafal Korytkowski)

Tests

  • 2,030 tests in total
  • 3 tests failed
  • 11 tests were fixed
  • 3 minutes taken in total.
Existing test failures 3
Status Test Failing since Duration
java.io.IOException: No space left on device
	at java.io.FileOutputStream.writeBytes(Native Method)
	at java.io.FileOutputStream.write(FileOutputStream.java:300)
	at org.apache.commons.io.IOUtils.copyLarge(IOUtils.java:1026)
	at org.apache.commons.io.IOUtils.copy(IOUtils.java:999)
	at org.openmrs.util.databasechange.DatabaseUpgradeTestUtil.<init>(DatabaseUpgradeTestUtil.java:94)
	at org.openmrs.util.databasechange.Database1_9_7UpgradeTest.before(Database1_9_7UpgradeTest.java:115)
	at sun.reflect.NativeMethodAccessorImpl.invoke0(Native Method)
(29 more lines...)
java.io.IOException: No space left on device
	at java.io.FileOutputStream.writeBytes(Native Method)
	at java.io.FileOutputStream.write(FileOutputStream.java:300)
	at org.apache.commons.io.IOUtils.copyLarge(IOUtils.java:1026)
	at org.apache.commons.io.IOUtils.copy(IOUtils.java:999)
	at org.openmrs.util.databasechange.DatabaseUpgradeTestUtil.<init>(DatabaseUpgradeTestUtil.java:94)
	at org.openmrs.util.databasechange.Database1_9_7UpgradeTest.before(Database1_9_7UpgradeTest.java:115)
	at sun.reflect.NativeMethodAccessorImpl.invoke0(Native Method)
(29 more lines...)
java.io.IOException: No space left on device
	at java.io.FileOutputStream.writeBytes(Native Method)
	at java.io.FileOutputStream.write(FileOutputStream.java:300)
	at org.apache.commons.io.IOUtils.copyLarge(IOUtils.java:1026)
	at org.apache.commons.io.IOUtils.copy(IOUtils.java:999)
	at org.openmrs.util.databasechange.DatabaseUpgradeTestUtil.<init>(DatabaseUpgradeTestUtil.java:94)
	at org.openmrs.util.databasechange.Database1_9_7UpgradeTest.before(Database1_9_7UpgradeTest.java:115)
	at sun.reflect.NativeMethodAccessorImpl.invoke0(Native Method)
(29 more lines...)
Fixed tests 11
Status Test Failing since Duration
Successful Database1_9_7UpgradeTest shouldConcatenateDoseStrengthAndUnits History
Failing since build #491 (Code changes detected) 7 secs
Successful Database1_9_7UpgradeTest shouldConvertOrderersToBeingProvidersInsteadOfUsers History
Failing since build #491 (Code changes detected) 11 secs
Successful Database1_9_7UpgradeTest shouldCreateDiscontinuationOrderForStoppedOrders History
Failing since build #491 (Code changes detected) 7 secs
Successful Database1_9_7UpgradeTest shouldFailIfThereAreDrugsWithDoseStrengthAndNoBlankUnits History
Failing since build #491 (Code changes detected) 4 secs
Successful Database1_9_7UpgradeTest shouldFailIfThereAreDrugsWithDoseStrengthAndNoNullUnits History
Failing since build #491 (Code changes detected) 10 secs
Successful Database1_9_7UpgradeTest shouldFailIfThereAreOrderersWithNoAssociatedProviderAccounts History
Failing since build #491 (Code changes detected) 4 secs
Successful Database1_9_7UpgradeTest shouldFailMigratingDrugOrdersIfUnitsToConceptsMappingsDoesNotPointToValidCodedDoseUnits History
Failing since build #491 (Code changes detected) 4 secs
Successful Database1_9_7UpgradeTest shouldFailMigratingDrugOrdersIfUnitsToConceptsMappingsIsNotSet History
Failing since build #491 (Code changes detected) 4 secs
Successful Database1_9_7UpgradeTest shouldMigrateDrugOrders History
Failing since build #491 (Code changes detected) 7 secs
Successful Database1_9_7UpgradeTest shouldSetValuesToNullIfUnitsOrFrequencyBlank History
Failing since build #491 (Code changes detected) 7 secs
Successful Database1_9_7UpgradeTest shouldUpgradeFromClean1_9To1_10 History
Failing since build #491 (Code changes detected) 10 secs