Plan for OpenMRS Core 1.11.x

Build: #1 failed

Job: Build and Test failed

Stages & jobs

  1. Default Stage

Job result summary

Completed
Duration
10 minutes
Revision
9b0c60aadb957bdebb34283d4a5f1902a6848101 9b0c60aadb957bdebb34283d4a5f1902a6848101
Total tests
2437
Fixed in
#2 (Code changes detected)

Tests

  • 2,437 tests in total
  • 5 tests failed
  • 5 failures are new
  • 9 minutes taken in total.
New test failures 5
Status Test Duration
Collapse Failed Database1_9_7UpgradeTest shouldFailIfThereAreAnyOrderTypesInTheDatabaseOtherThanDrugOrderTypeAndNoNewColumns History
2 secs
java.lang.AssertionError:  Expected: (an instance of java.io.IOException and exception with message a string containing "liquibase.exception.MigrationFailedException: Migration failed for change set liquibase-update-to-latest.xml::201404091109::wyclif")      but: exception with message a string containing "liquibase.exception.MigrationFailedException: Migration failed for change set liquibase-update-to-latest.xml::201404091109::wyclif" message was "liquibase.exception.MigrationFailedException: Migration failed for change set liquibase-update-to-latest.xml::201404091110::wyclif:      Reason:            liquibase-update-to-latest.xml : Cannot update order_type table, please see the 1.10 release notes for how to modify the order_type table before upgrading :           Caused By: Preconditions Failed" Stacktrace was: java.io.IOException: liquibase.exception.MigrationFailedException: Migration failed for change set liquibase-update-to-latest.xml::201404091110::wyclif:      Reason:            liquibase-update-to-latest.xml : Cannot update order_type table, please see the 1.10 release notes for how to modify the order_type table before upgrading :           Caused By: Preconditions Failed  at org.openmrs.util.databasechange.DatabaseUpgradeTestUtil.upgrade(DatabaseUpgradeTestUtil.java:226)  at org.openmrs.util.databasechange.Database1_9_7UpgradeTest.shouldFailIfThereAreAnyOrderTypesInTheDatabaseOtherThanDrugOrderTypeAndNoNewColumns(Database1_9_7UpgradeTest.java:354)  at sun.reflect.NativeMethodAccessorImpl.invoke0(Native Method)  at sun.reflect.NativeMethodAccessorImpl.invoke(NativeMethodAccessorImpl.java:57)  at sun.reflect.DelegatingMethodAccessorImpl.invoke(DelegatingMethodAccessorImpl.java:43)  at java.lang.reflect.Method.invoke(Method.java:622)  at org.junit.runners.model.FrameworkMethod$1.runReflectiveCall(FrameworkMethod.java:47)  at org.junit.internal.runners.model.ReflectiveCallable.run(ReflectiveCallable.java:12)  at org.junit.runners.model.FrameworkMethod.invokeExplosively(FrameworkMethod.java:44)  at org.junit.internal.runners.statements.InvokeMethod.evaluate(InvokeMethod.java:17)  at org.junit.internal.runners.statements.RunBefores.evaluate(RunBefores.java:26)  at org.junit.internal.runners.statements.RunAfters.evaluate(RunAfters.java:27)  at org.junit.rules.ExpectedException$ExpectedExceptionStatement.evaluate(ExpectedException.java:168)  at org.junit.rules.RunRules.evaluate(RunRules.java:20)  at org.junit.runners.ParentRunner.runLeaf(ParentRunner.java:271)  at org.junit.runners.BlockJUnit4ClassRunner.runChild(BlockJUnit4ClassRunner.java:70)  at org.junit.runners.BlockJUnit4ClassRunner.runChild(BlockJUnit4ClassRunner.java:50)  at org.junit.runners.ParentRunner$3.run(ParentRunner.java:238)  at org.junit.runners.ParentRunner$1.schedule(ParentRunner.java:63)  at org.junit.runners.ParentRunner.runChildren(ParentRunner.java:236)  at org.junit.runners.ParentRunner.access$000(ParentRunner.java:53)  at org.junit.runners.ParentRunner$2.evaluate(ParentRunner.java:229)  at org.junit.runners.ParentRunner.run(ParentRunner.java:309)  at org.apache.maven.surefire.junit4.JUnit4TestSet.execute(JUnit4TestSet.java:59)  at org.apache.maven.surefire.suite.AbstractDirectoryTestSuite.executeTestSet(AbstractDirectoryTestSuite.java:115)  at org.apache.maven.surefire.suite.AbstractDirectoryTestSuite.execute(AbstractDirectoryTestSuite.java:102)  at org.apache.maven.surefire.Surefire.run(Surefire.java:180)  at sun.reflect.NativeMethodAccessorImpl.invoke0(Native Method)  at sun.reflect.NativeMethodAccessorImpl.invoke(NativeMethodAccessorImpl.java:57)  at sun.reflect.DelegatingMethodAccessorImpl.invoke(DelegatingMethodAccessorImpl.java:43)  at java.lang.reflect.Method.invoke(Method.java:622)  at org.apache.maven.surefire.booter.SurefireBooter.runSuitesInProcess(SurefireBooter.java:350)  at org.apache.maven.surefire.booter.SurefireBooter.main(SurefireBooter.java:1021) Caused by: liquibase.exception.MigrationFailedException: Migration failed for change set liquibase-update-to-latest.xml::201404091110::wyclif:      Reason:            liquibase-update-to-latest.xml : Cannot update order_type table, please see the 1.10 release notes for how to modify the order_type table before upgrading :           Caused By: Preconditions Failed  at liquibase.changelog.ChangeSet.execute(ChangeSet.java:260)  at liquibase.changelog.visitor.UpdateVisitor.visit(UpdateVisitor.java:27)  at liquibase.changelog.ChangeLogIterator.run(ChangeLogIterator.java:58)  at liquibase.Liquibase.update(Liquibase.java:114)  at org.openmrs.util.databasechange.DatabaseUpgradeTestUtil.upgrade(DatabaseUpgradeTestUtil.java:221)  ... 32 more Caused by: liquibase.exception.PreconditionFailedException: Preconditions Failed  at liquibase.precondition.core.PreconditionContainer.check(PreconditionContainer.java:218)  at liquibase.changelog.ChangeSet.execute(ChangeSet.java:249)  ... 36 more 
java.lang.AssertionError: 
Expected: (an instance of java.io.IOException and exception with message a string containing "liquibase.exception.MigrationFailedException: Migration failed for change set liquibase-update-to-latest.xml::201404091109::wyclif")
     but: exception with message a string containing "liquibase.exception.MigrationFailedException: Migration failed for change set liquibase-update-to-latest.xml::201404091109::wyclif" message was "liquibase.exception.MigrationFailedException: Migration failed for change set liquibase-update-to-latest.xml::201404091110::wyclif:
     Reason: 
          liquibase-update-to-latest.xml : Cannot update order_type table, please see the 1.10 release notes for how to modify the order_type table before upgrading
:
          Caused By: Preconditions Failed"
(80 more lines...)
Collapse Failed Database1_9_7UpgradeTest shouldFailIfThereAreDrugsWithDoseStrengthAndNoBlankUnits History
2 secs
java.lang.AssertionError:  Expected: (an instance of java.io.IOException and exception with message a string containing "liquibase.exception.MigrationFailedException: Migration failed for change set liquibase-update-to-latest.xml::201403262140-TRUNK-4265::wyclif")      but: exception with message a string containing "liquibase.exception.MigrationFailedException: Migration failed for change set liquibase-update-to-latest.xml::201403262140-TRUNK-4265::wyclif" message was "liquibase.exception.MigrationFailedException: Migration failed for change set liquibase-update-to-latest.xml::201403262139-TRUNK-4265::wyclif:      Reason:            liquibase-update-to-latest.xml : Please make sure that all drugs with dose strength have the units specified :           Caused By: Preconditions Failed" Stacktrace was: java.io.IOException: liquibase.exception.MigrationFailedException: Migration failed for change set liquibase-update-to-latest.xml::201403262139-TRUNK-4265::wyclif:      Reason:            liquibase-update-to-latest.xml : Please make sure that all drugs with dose strength have the units specified :           Caused By: Preconditions Failed  at org.openmrs.util.databasechange.DatabaseUpgradeTestUtil.upgrade(DatabaseUpgradeTestUtil.java:226)  at org.openmrs.util.databasechange.Database1_9_7UpgradeTest.shouldFailIfThereAreDrugsWithDoseStrengthAndNoBlankUnits(Database1_9_7UpgradeTest.java:340)  at sun.reflect.NativeMethodAccessorImpl.invoke0(Native Method)  at sun.reflect.NativeMethodAccessorImpl.invoke(NativeMethodAccessorImpl.java:57)  at sun.reflect.DelegatingMethodAccessorImpl.invoke(DelegatingMethodAccessorImpl.java:43)  at java.lang.reflect.Method.invoke(Method.java:622)  at org.junit.runners.model.FrameworkMethod$1.runReflectiveCall(FrameworkMethod.java:47)  at org.junit.internal.runners.model.ReflectiveCallable.run(ReflectiveCallable.java:12)  at org.junit.runners.model.FrameworkMethod.invokeExplosively(FrameworkMethod.java:44)  at org.junit.internal.runners.statements.InvokeMethod.evaluate(InvokeMethod.java:17)  at org.junit.internal.runners.statements.RunBefores.evaluate(RunBefores.java:26)  at org.junit.internal.runners.statements.RunAfters.evaluate(RunAfters.java:27)  at org.junit.rules.ExpectedException$ExpectedExceptionStatement.evaluate(ExpectedException.java:168)  at org.junit.rules.RunRules.evaluate(RunRules.java:20)  at org.junit.runners.ParentRunner.runLeaf(ParentRunner.java:271)  at org.junit.runners.BlockJUnit4ClassRunner.runChild(BlockJUnit4ClassRunner.java:70)  at org.junit.runners.BlockJUnit4ClassRunner.runChild(BlockJUnit4ClassRunner.java:50)  at org.junit.runners.ParentRunner$3.run(ParentRunner.java:238)  at org.junit.runners.ParentRunner$1.schedule(ParentRunner.java:63)  at org.junit.runners.ParentRunner.runChildren(ParentRunner.java:236)  at org.junit.runners.ParentRunner.access$000(ParentRunner.java:53)  at org.junit.runners.ParentRunner$2.evaluate(ParentRunner.java:229)  at org.junit.runners.ParentRunner.run(ParentRunner.java:309)  at org.apache.maven.surefire.junit4.JUnit4TestSet.execute(JUnit4TestSet.java:59)  at org.apache.maven.surefire.suite.AbstractDirectoryTestSuite.executeTestSet(AbstractDirectoryTestSuite.java:115)  at org.apache.maven.surefire.suite.AbstractDirectoryTestSuite.execute(AbstractDirectoryTestSuite.java:102)  at org.apache.maven.surefire.Surefire.run(Surefire.java:180)  at sun.reflect.NativeMethodAccessorImpl.invoke0(Native Method)  at sun.reflect.NativeMethodAccessorImpl.invoke(NativeMethodAccessorImpl.java:57)  at sun.reflect.DelegatingMethodAccessorImpl.invoke(DelegatingMethodAccessorImpl.java:43)  at java.lang.reflect.Method.invoke(Method.java:622)  at org.apache.maven.surefire.booter.SurefireBooter.runSuitesInProcess(SurefireBooter.java:350)  at org.apache.maven.surefire.booter.SurefireBooter.main(SurefireBooter.java:1021) Caused by: liquibase.exception.MigrationFailedException: Migration failed for change set liquibase-update-to-latest.xml::201403262139-TRUNK-4265::wyclif:      Reason:            liquibase-update-to-latest.xml : Please make sure that all drugs with dose strength have the units specified :           Caused By: Preconditions Failed  at liquibase.changelog.ChangeSet.execute(ChangeSet.java:260)  at liquibase.changelog.visitor.UpdateVisitor.visit(UpdateVisitor.java:27)  at liquibase.changelog.ChangeLogIterator.run(ChangeLogIterator.java:58)  at liquibase.Liquibase.update(Liquibase.java:114)  at org.openmrs.util.databasechange.DatabaseUpgradeTestUtil.upgrade(DatabaseUpgradeTestUtil.java:221)  ... 32 more Caused by: liquibase.exception.PreconditionFailedException: Preconditions Failed  at liquibase.precondition.core.PreconditionContainer.check(PreconditionContainer.java:218)  at liquibase.changelog.ChangeSet.execute(ChangeSet.java:249)  ... 36 more 
java.lang.AssertionError: 
Expected: (an instance of java.io.IOException and exception with message a string containing "liquibase.exception.MigrationFailedException: Migration failed for change set liquibase-update-to-latest.xml::201403262140-TRUNK-4265::wyclif")
     but: exception with message a string containing "liquibase.exception.MigrationFailedException: Migration failed for change set liquibase-update-to-latest.xml::201403262140-TRUNK-4265::wyclif" message was "liquibase.exception.MigrationFailedException: Migration failed for change set liquibase-update-to-latest.xml::201403262139-TRUNK-4265::wyclif:
     Reason: 
          liquibase-update-to-latest.xml : Please make sure that all drugs with dose strength have the units specified
:
          Caused By: Preconditions Failed"
(80 more lines...)
Collapse Failed Database1_9_7UpgradeTest shouldFailIfThereAreDrugsWithDoseStrengthAndNoNullUnits History
7 secs
java.lang.AssertionError:  Expected: (an instance of java.io.IOException and exception with message a string containing "liquibase.exception.MigrationFailedException: Migration failed for change set liquibase-update-to-latest.xml::201403262140-TRUNK-4265::wyclif")      but: exception with message a string containing "liquibase.exception.MigrationFailedException: Migration failed for change set liquibase-update-to-latest.xml::201403262140-TRUNK-4265::wyclif" message was "liquibase.exception.MigrationFailedException: Migration failed for change set liquibase-update-to-latest.xml::201403262139-TRUNK-4265::wyclif:      Reason:            liquibase-update-to-latest.xml : Please make sure that all drugs with dose strength have the units specified :           Caused By: Preconditions Failed" Stacktrace was: java.io.IOException: liquibase.exception.MigrationFailedException: Migration failed for change set liquibase-update-to-latest.xml::201403262139-TRUNK-4265::wyclif:      Reason:            liquibase-update-to-latest.xml : Please make sure that all drugs with dose strength have the units specified :           Caused By: Preconditions Failed  at org.openmrs.util.databasechange.DatabaseUpgradeTestUtil.upgrade(DatabaseUpgradeTestUtil.java:226)  at org.openmrs.util.databasechange.Database1_9_7UpgradeTest.shouldFailIfThereAreDrugsWithDoseStrengthAndNoNullUnits(Database1_9_7UpgradeTest.java:327)  at sun.reflect.NativeMethodAccessorImpl.invoke0(Native Method)  at sun.reflect.NativeMethodAccessorImpl.invoke(NativeMethodAccessorImpl.java:57)  at sun.reflect.DelegatingMethodAccessorImpl.invoke(DelegatingMethodAccessorImpl.java:43)  at java.lang.reflect.Method.invoke(Method.java:622)  at org.junit.runners.model.FrameworkMethod$1.runReflectiveCall(FrameworkMethod.java:47)  at org.junit.internal.runners.model.ReflectiveCallable.run(ReflectiveCallable.java:12)  at org.junit.runners.model.FrameworkMethod.invokeExplosively(FrameworkMethod.java:44)  at org.junit.internal.runners.statements.InvokeMethod.evaluate(InvokeMethod.java:17)  at org.junit.internal.runners.statements.RunBefores.evaluate(RunBefores.java:26)  at org.junit.internal.runners.statements.RunAfters.evaluate(RunAfters.java:27)  at org.junit.rules.ExpectedException$ExpectedExceptionStatement.evaluate(ExpectedException.java:168)  at org.junit.rules.RunRules.evaluate(RunRules.java:20)  at org.junit.runners.ParentRunner.runLeaf(ParentRunner.java:271)  at org.junit.runners.BlockJUnit4ClassRunner.runChild(BlockJUnit4ClassRunner.java:70)  at org.junit.runners.BlockJUnit4ClassRunner.runChild(BlockJUnit4ClassRunner.java:50)  at org.junit.runners.ParentRunner$3.run(ParentRunner.java:238)  at org.junit.runners.ParentRunner$1.schedule(ParentRunner.java:63)  at org.junit.runners.ParentRunner.runChildren(ParentRunner.java:236)  at org.junit.runners.ParentRunner.access$000(ParentRunner.java:53)  at org.junit.runners.ParentRunner$2.evaluate(ParentRunner.java:229)  at org.junit.runners.ParentRunner.run(ParentRunner.java:309)  at org.apache.maven.surefire.junit4.JUnit4TestSet.execute(JUnit4TestSet.java:59)  at org.apache.maven.surefire.suite.AbstractDirectoryTestSuite.executeTestSet(AbstractDirectoryTestSuite.java:115)  at org.apache.maven.surefire.suite.AbstractDirectoryTestSuite.execute(AbstractDirectoryTestSuite.java:102)  at org.apache.maven.surefire.Surefire.run(Surefire.java:180)  at sun.reflect.NativeMethodAccessorImpl.invoke0(Native Method)  at sun.reflect.NativeMethodAccessorImpl.invoke(NativeMethodAccessorImpl.java:57)  at sun.reflect.DelegatingMethodAccessorImpl.invoke(DelegatingMethodAccessorImpl.java:43)  at java.lang.reflect.Method.invoke(Method.java:622)  at org.apache.maven.surefire.booter.SurefireBooter.runSuitesInProcess(SurefireBooter.java:350)  at org.apache.maven.surefire.booter.SurefireBooter.main(SurefireBooter.java:1021) Caused by: liquibase.exception.MigrationFailedException: Migration failed for change set liquibase-update-to-latest.xml::201403262139-TRUNK-4265::wyclif:      Reason:            liquibase-update-to-latest.xml : Please make sure that all drugs with dose strength have the units specified :           Caused By: Preconditions Failed  at liquibase.changelog.ChangeSet.execute(ChangeSet.java:260)  at liquibase.changelog.visitor.UpdateVisitor.visit(UpdateVisitor.java:27)  at liquibase.changelog.ChangeLogIterator.run(ChangeLogIterator.java:58)  at liquibase.Liquibase.update(Liquibase.java:114)  at org.openmrs.util.databasechange.DatabaseUpgradeTestUtil.upgrade(DatabaseUpgradeTestUtil.java:221)  ... 32 more Caused by: liquibase.exception.PreconditionFailedException: Preconditions Failed  at liquibase.precondition.core.PreconditionContainer.check(PreconditionContainer.java:218)  at liquibase.changelog.ChangeSet.execute(ChangeSet.java:249)  ... 36 more 
java.lang.AssertionError: 
Expected: (an instance of java.io.IOException and exception with message a string containing "liquibase.exception.MigrationFailedException: Migration failed for change set liquibase-update-to-latest.xml::201403262140-TRUNK-4265::wyclif")
     but: exception with message a string containing "liquibase.exception.MigrationFailedException: Migration failed for change set liquibase-update-to-latest.xml::201403262140-TRUNK-4265::wyclif" message was "liquibase.exception.MigrationFailedException: Migration failed for change set liquibase-update-to-latest.xml::201403262139-TRUNK-4265::wyclif:
     Reason: 
          liquibase-update-to-latest.xml : Please make sure that all drugs with dose strength have the units specified
:
          Caused By: Preconditions Failed"
(80 more lines...)
Collapse Failed Database1_9_7UpgradeTest shouldFailMigratingDrugOrdersIfUnitsToConceptsMappingsDoesNotPointToValidCodedDoseUnits History
2 secs
java.lang.AssertionError:  Expected: (an instance of java.io.IOException and exception with message a string containing "liquibase.exception.MigrationFailedException: Migration failed for change set liquibase-update-to-latest.xml::201401101647-TRUNK-4187::wyclif" and exception with message a string containing "For input string: \"invalid\"")      but: exception with message a string containing "liquibase.exception.MigrationFailedException: Migration failed for change set liquibase-update-to-latest.xml::201401101647-TRUNK-4187::wyclif" message was "liquibase.exception.MigrationFailedException: Migration failed for change set liquibase-update-to-latest.xml::201401101645-TRUNK-4187::wyclif:      Reason:            liquibase-update-to-latest.xml : For input string: "invalid" :           Caused By: Precondition Error" Stacktrace was: java.io.IOException: liquibase.exception.MigrationFailedException: Migration failed for change set liquibase-update-to-latest.xml::201401101645-TRUNK-4187::wyclif:      Reason:            liquibase-update-to-latest.xml : For input string: "invalid" :           Caused By: Precondition Error  at org.openmrs.util.databasechange.DatabaseUpgradeTestUtil.upgrade(DatabaseUpgradeTestUtil.java:226)  at org.openmrs.util.databasechange.Database1_9_7UpgradeTest.shouldFailMigratingDrugOrdersIfUnitsToConceptsMappingsDoesNotPointToValidCodedDoseUnits(Database1_9_7UpgradeTest.java:151)  at sun.reflect.NativeMethodAccessorImpl.invoke0(Native Method)  at sun.reflect.NativeMethodAccessorImpl.invoke(NativeMethodAccessorImpl.java:57)  at sun.reflect.DelegatingMethodAccessorImpl.invoke(DelegatingMethodAccessorImpl.java:43)  at java.lang.reflect.Method.invoke(Method.java:622)  at org.junit.runners.model.FrameworkMethod$1.runReflectiveCall(FrameworkMethod.java:47)  at org.junit.internal.runners.model.ReflectiveCallable.run(ReflectiveCallable.java:12)  at org.junit.runners.model.FrameworkMethod.invokeExplosively(FrameworkMethod.java:44)  at org.junit.internal.runners.statements.InvokeMethod.evaluate(InvokeMethod.java:17)  at org.junit.internal.runners.statements.RunBefores.evaluate(RunBefores.java:26)  at org.junit.internal.runners.statements.RunAfters.evaluate(RunAfters.java:27)  at org.junit.rules.ExpectedException$ExpectedExceptionStatement.evaluate(ExpectedException.java:168)  at org.junit.rules.RunRules.evaluate(RunRules.java:20)  at org.junit.runners.ParentRunner.runLeaf(ParentRunner.java:271)  at org.junit.runners.BlockJUnit4ClassRunner.runChild(BlockJUnit4ClassRunner.java:70)  at org.junit.runners.BlockJUnit4ClassRunner.runChild(BlockJUnit4ClassRunner.java:50)  at org.junit.runners.ParentRunner$3.run(ParentRunner.java:238)  at org.junit.runners.ParentRunner$1.schedule(ParentRunner.java:63)  at org.junit.runners.ParentRunner.runChildren(ParentRunner.java:236)  at org.junit.runners.ParentRunner.access$000(ParentRunner.java:53)  at org.junit.runners.ParentRunner$2.evaluate(ParentRunner.java:229)  at org.junit.runners.ParentRunner.run(ParentRunner.java:309)  at org.apache.maven.surefire.junit4.JUnit4TestSet.execute(JUnit4TestSet.java:59)  at org.apache.maven.surefire.suite.AbstractDirectoryTestSuite.executeTestSet(AbstractDirectoryTestSuite.java:115)  at org.apache.maven.surefire.suite.AbstractDirectoryTestSuite.execute(AbstractDirectoryTestSuite.java:102)  at org.apache.maven.surefire.Surefire.run(Surefire.java:180)  at sun.reflect.NativeMethodAccessorImpl.invoke0(Native Method)  at sun.reflect.NativeMethodAccessorImpl.invoke(NativeMethodAccessorImpl.java:57)  at sun.reflect.DelegatingMethodAccessorImpl.invoke(DelegatingMethodAccessorImpl.java:43)  at java.lang.reflect.Method.invoke(Method.java:622)  at org.apache.maven.surefire.booter.SurefireBooter.runSuitesInProcess(SurefireBooter.java:350)  at org.apache.maven.surefire.booter.SurefireBooter.main(SurefireBooter.java:1021) Caused by: liquibase.exception.MigrationFailedException: Migration failed for change set liquibase-update-to-latest.xml::201401101645-TRUNK-4187::wyclif:      Reason:            liquibase-update-to-latest.xml : For input string: "invalid" :           Caused By: Precondition Error  at liquibase.changelog.ChangeSet.execute(ChangeSet.java:285)  at liquibase.changelog.visitor.UpdateVisitor.visit(UpdateVisitor.java:27)  at liquibase.changelog.ChangeLogIterator.run(ChangeLogIterator.java:58)  at liquibase.Liquibase.update(Liquibase.java:114)  at org.openmrs.util.databasechange.DatabaseUpgradeTestUtil.upgrade(DatabaseUpgradeTestUtil.java:221)  ... 32 more Caused by: liquibase.exception.PreconditionErrorException: Precondition Error  at liquibase.precondition.CustomPreconditionWrapper.check(CustomPreconditionWrapper.java:79)  at liquibase.precondition.core.AndPrecondition.check(AndPrecondition.java:34)  at liquibase.precondition.core.PreconditionContainer.check(PreconditionContainer.java:199)  at liquibase.changelog.ChangeSet.execute(ChangeSet.java:249)  ... 36 more 
java.lang.AssertionError: 
Expected: (an instance of java.io.IOException and exception with message a string containing "liquibase.exception.MigrationFailedException: Migration failed for change set liquibase-update-to-latest.xml::201401101647-TRUNK-4187::wyclif" and exception with message a string containing "For input string: \"invalid\"")
     but: exception with message a string containing "liquibase.exception.MigrationFailedException: Migration failed for change set liquibase-update-to-latest.xml::201401101647-TRUNK-4187::wyclif" message was "liquibase.exception.MigrationFailedException: Migration failed for change set liquibase-update-to-latest.xml::201401101645-TRUNK-4187::wyclif:
     Reason: 
          liquibase-update-to-latest.xml : For input string: "invalid"
:
          Caused By: Precondition Error"
(82 more lines...)
Collapse Failed Database1_9_7UpgradeTest shouldFailMigratingDrugOrdersIfUnitsToConceptsMappingsIsNotSet History
2 secs
java.lang.AssertionError:  Expected: (an instance of java.io.IOException and exception with message a string containing "liquibase.exception.MigrationFailedException: Migration failed for change set liquibase-update-to-latest.xml::201401101647-TRUNK-4187::wyclif" and exception with message a string containing "Your order entry upgrade settings file does not have mapping for mg")      but: exception with message a string containing "liquibase.exception.MigrationFailedException: Migration failed for change set liquibase-update-to-latest.xml::201401101647-TRUNK-4187::wyclif" message was "liquibase.exception.MigrationFailedException: Migration failed for change set liquibase-update-to-latest.xml::201401101645-TRUNK-4187::wyclif:      Reason:            liquibase-update-to-latest.xml : Your order entry upgrade settings file does not have mapping for mg. Please refer to upgrade instructions for more details. :           Caused By: Precondition Error" Stacktrace was: java.io.IOException: liquibase.exception.MigrationFailedException: Migration failed for change set liquibase-update-to-latest.xml::201401101645-TRUNK-4187::wyclif:      Reason:            liquibase-update-to-latest.xml : Your order entry upgrade settings file does not have mapping for mg. Please refer to upgrade instructions for more details. :           Caused By: Precondition Error  at org.openmrs.util.databasechange.DatabaseUpgradeTestUtil.upgrade(DatabaseUpgradeTestUtil.java:226)  at org.openmrs.util.databasechange.Database1_9_7UpgradeTest.shouldFailMigratingDrugOrdersIfUnitsToConceptsMappingsIsNotSet(Database1_9_7UpgradeTest.java:136)  at sun.reflect.NativeMethodAccessorImpl.invoke0(Native Method)  at sun.reflect.NativeMethodAccessorImpl.invoke(NativeMethodAccessorImpl.java:57)  at sun.reflect.DelegatingMethodAccessorImpl.invoke(DelegatingMethodAccessorImpl.java:43)  at java.lang.reflect.Method.invoke(Method.java:622)  at org.junit.runners.model.FrameworkMethod$1.runReflectiveCall(FrameworkMethod.java:47)  at org.junit.internal.runners.model.ReflectiveCallable.run(ReflectiveCallable.java:12)  at org.junit.runners.model.FrameworkMethod.invokeExplosively(FrameworkMethod.java:44)  at org.junit.internal.runners.statements.InvokeMethod.evaluate(InvokeMethod.java:17)  at org.junit.internal.runners.statements.RunBefores.evaluate(RunBefores.java:26)  at org.junit.internal.runners.statements.RunAfters.evaluate(RunAfters.java:27)  at org.junit.rules.ExpectedException$ExpectedExceptionStatement.evaluate(ExpectedException.java:168)  at org.junit.rules.RunRules.evaluate(RunRules.java:20)  at org.junit.runners.ParentRunner.runLeaf(ParentRunner.java:271)  at org.junit.runners.BlockJUnit4ClassRunner.runChild(BlockJUnit4ClassRunner.java:70)  at org.junit.runners.BlockJUnit4ClassRunner.runChild(BlockJUnit4ClassRunner.java:50)  at org.junit.runners.ParentRunner$3.run(ParentRunner.java:238)  at org.junit.runners.ParentRunner$1.schedule(ParentRunner.java:63)  at org.junit.runners.ParentRunner.runChildren(ParentRunner.java:236)  at org.junit.runners.ParentRunner.access$000(ParentRunner.java:53)  at org.junit.runners.ParentRunner$2.evaluate(ParentRunner.java:229)  at org.junit.runners.ParentRunner.run(ParentRunner.java:309)  at org.apache.maven.surefire.junit4.JUnit4TestSet.execute(JUnit4TestSet.java:59)  at org.apache.maven.surefire.suite.AbstractDirectoryTestSuite.executeTestSet(AbstractDirectoryTestSuite.java:115)  at org.apache.maven.surefire.suite.AbstractDirectoryTestSuite.execute(AbstractDirectoryTestSuite.java:102)  at org.apache.maven.surefire.Surefire.run(Surefire.java:180)  at sun.reflect.NativeMethodAccessorImpl.invoke0(Native Method)  at sun.reflect.NativeMethodAccessorImpl.invoke(NativeMethodAccessorImpl.java:57)  at sun.reflect.DelegatingMethodAccessorImpl.invoke(DelegatingMethodAccessorImpl.java:43)  at java.lang.reflect.Method.invoke(Method.java:622)  at org.apache.maven.surefire.booter.SurefireBooter.runSuitesInProcess(SurefireBooter.java:350)  at org.apache.maven.surefire.booter.SurefireBooter.main(SurefireBooter.java:1021) Caused by: liquibase.exception.MigrationFailedException: Migration failed for change set liquibase-update-to-latest.xml::201401101645-TRUNK-4187::wyclif:      Reason:            liquibase-update-to-latest.xml : Your order entry upgrade settings file does not have mapping for mg. Please refer to upgrade instructions for more details. :           Caused By: Precondition Error  at liquibase.changelog.ChangeSet.execute(ChangeSet.java:285)  at liquibase.changelog.visitor.UpdateVisitor.visit(UpdateVisitor.java:27)  at liquibase.changelog.ChangeLogIterator.run(ChangeLogIterator.java:58)  at liquibase.Liquibase.update(Liquibase.java:114)  at org.openmrs.util.databasechange.DatabaseUpgradeTestUtil.upgrade(DatabaseUpgradeTestUtil.java:221)  ... 32 more Caused by: liquibase.exception.PreconditionErrorException: Precondition Error  at liquibase.precondition.CustomPreconditionWrapper.check(CustomPreconditionWrapper.java:79)  at liquibase.precondition.core.AndPrecondition.check(AndPrecondition.java:34)  at liquibase.precondition.core.PreconditionContainer.check(PreconditionContainer.java:199)  at liquibase.changelog.ChangeSet.execute(ChangeSet.java:249)  ... 36 more 
java.lang.AssertionError: 
Expected: (an instance of java.io.IOException and exception with message a string containing "liquibase.exception.MigrationFailedException: Migration failed for change set liquibase-update-to-latest.xml::201401101647-TRUNK-4187::wyclif" and exception with message a string containing "Your order entry upgrade settings file does not have mapping for mg")
     but: exception with message a string containing "liquibase.exception.MigrationFailedException: Migration failed for change set liquibase-update-to-latest.xml::201401101647-TRUNK-4187::wyclif" message was "liquibase.exception.MigrationFailedException: Migration failed for change set liquibase-update-to-latest.xml::201401101645-TRUNK-4187::wyclif:
     Reason: 
          liquibase-update-to-latest.xml : Your order entry upgrade settings file does not have mapping for mg. Please refer to upgrade instructions for more details.
:
          Caused By: Precondition Error"
(82 more lines...)

Error summary

The build generated some errors. See the full build log for more details.

[INFO] ------------------------------------------------------------------------
[ERROR] BUILD FAILURE
[INFO] ------------------------------------------------------------------------
[INFO] There are test failures.

Please refer to /opt/bamboo-agent/agent2-home/xml-data/build-dir/TRUNK-OC1-JOB1/api/target/surefire-reports for the individual test results.
[INFO] ------------------------------------------------------------------------
[INFO] For more information, run Maven with the -e switch