Plan for OpenMRS Core 2.0.x

Stages & jobs

  1. Build and Test

  2. Deploy

  3. Release

    Requires a user to start manually

Test results

  • 3,225 tests in total
  • 1 test failed
  • 37 tests were quarantined / skipped
  • 6 minutes taken in total.
Existing test failures 1
Status Test Failing since View job Duration
java.lang.AssertionError: 
Expected: (an instance of java.io.IOException and exception with message a string containing "liquibase.exception.MigrationFailedException: Migration failed for change set liquibase-update-to-latest.xml::201401101647-TRUNK-4187::wyclif" and exception with message a string containing "upgrade.settings.file.not.have.mapping")
     but: exception with message a string containing "upgrade.settings.file.not.have.mapping" message was "liquibase.exception.MigrationFailedException: Migration failed for change set liquibase-update-to-latest.xml::201401101647-TRUNK-4187::wyclif:
     Reason: 
          liquibase-update-to-latest.xml : Your order entry upgrade settings file does not have mapping for mg. Please refer to upgrade instructions for more details.
:
          Caused By: Precondition Error"
Stacktrace was: java.io.IOException: liquibase.exception.MigrationFailedException: Migration failed for change set liquibase-update-to-latest.xml::201401101647-TRUNK-4187::wyclif:
(157 more lines...)
Skipped tests 37
Status Test Failing since View job
Skipped OpenmrsProfileExcludeFilterTest shouldBeIgnoredIfOpenmrsVersionDoesNotMatch History
Build and Test
Skipped OpenmrsProfileExcludeFilterTest shouldBeIgnoredIfModuleDoesNotMatch History
Build and Test
Skipped AdministrationServiceTest setImplementationId_shouldOverwriteImplementationIdInDatabaseIfExists History
Build and Test
Skipped AdministrationServiceTest setImplementationId_shouldSetUuidOnImplementationIdGlobalProperty History
Build and Test
Skipped AdministrationServiceTest getPresentationLocales_shouldReturnAtLeastOneLocaleIfNoLocalesDefinedInDatabaseYet History
Build and Test
Skipped AdministrationServiceTest setImplementationId_shouldCreateImplementationIdInDatabase History
Build and Test
Skipped ConceptServiceTest saveConcept_shouldNotSetAuditInfoIfTheConceptIsNotEdited History
Build and Test
Skipped EncounterServiceTest getEncounters_shouldNotReturnVoidedEncountersIfIncludeVoidedIsSetToTrue History
Build and Test
Skipped EncounterServiceTest getEncounters_shouldGetAllTheUniqueEncountersThatMatchTheSpecifiedParameterValues History
Build and Test
Skipped EncounterServiceTest saveEncounter_shouldVoidAndCreateNewObsWhenSavingEncounter History
Build and Test
Skipped NoteServiceTest org.openmrs.api.NoteServiceTest History
Build and Test
Skipped OpenmrsServiceTest shouldCheckThatAMethodIsNotRolledBackInCaseOfAnErrorInAnotherInvokedInsideIt History
Build and Test
Skipped OrderServiceTest saveOrder_shouldFailForRevisionOrderIfAnActiveDrugOrderForTheSameConceptAndCareSettingsExists History
Build and Test
Skipped OrderServiceTest saveOrder_shouldSaveRevisionOrderScheduledOnDateNotOverlappingWithAnActiveOrderForTheSameConceptAndCareSetting History
Build and Test
Skipped OrderServiceTest saveOrder_shouldPassForRevisionOrderIfAnActiveTestOrderForTheSameConceptAndCareSettingsExists History
Build and Test
Skipped PatientServiceTest voidPatient_shouldReturnNullWhenPatientIsNull History
Build and Test
Skipped PatientServiceTest checkPatientIdentifiers_shouldThrowErrorWhenPatientHasIdenticalIdentifiers History
Build and Test
Skipped ProviderServiceTest getCountOfProviders_shouldExcludeRetiredProviders History
Build and Test
Skipped ProviderServiceTest getCountOfProviders_shouldIncludeRetiredProvidersIfIncludeRetiredIsSetToTrue History
Build and Test
Skipped UserServiceTest changeQuestionAnswer_shouldChangeTheSecretQuestionAndAnswerForGivenUser History
Build and Test
Skipped ConceptDAOTest getConcepts_shouldReturnCorrectResultsIfAConceptNameContainsSameWordMoreThanOnce History
Build and Test
Skipped ConceptDAOTest getConcepts_shouldReturnCorrectResultsForConceptWithNamesThatContainsWordsWithMoreWeight History
Build and Test
Skipped SerializedObjectDAOTest org.openmrs.api.db.SerializedObjectDAOTest History
Build and Test
Skipped ArdenServiceTest compileFile_shouldGetAndParseMlms History
Build and Test
Skipped HL7ServiceTest processHL7InQueue_shouldParseOruR01MessageUsingOverriddenParserProvidedByAModule History
Build and Test
Skipped HL7ServiceTest processHL7Message_shouldParseMessageTypeSuppliedByModule History
Build and Test
Skipped ModuleActivatorTest org.openmrs.module.ModuleActivatorTest History
Build and Test
Skipped ModuleUtilIT getURL_shouldReturnAnUpdateRdfPageForModuleUrls History
Integration Test
Skipped ModuleUtilIT getURL_shouldReturnAnUpdateRdfPageForOldHttpsModuleUrls History
Integration Test
Skipped ModuleUtilIT getURL_shouldReturnAnUpdateRdfPageForOldHttpsDevUrls History
Integration Test
Skipped SchedulerServiceTest org.openmrs.scheduler.SchedulerServiceTest History
Build and Test
Skipped ConceptReferenceTermValidatorTest validate_shouldFailIfTheNameIsAnEmptyString History
Build and Test
Skipped ConceptReferenceTermValidatorTest validate_shouldFailIfTheNameIsNull History
Build and Test
Skipped ConceptReferenceTermValidatorTest validate_shouldFailIfTheNameIsAWhiteSpaceCharacter History
Build and Test
Skipped VisitValidatorTest validate_shouldFailIfAnAttributeIsBad History
Build and Test
Skipped FilterUtilTest storeLocale_shouldStoreLocale History
Build and Test
Skipped FilterUtilTest storeLocale_shouldRestoreLocale History
Build and Test