Plan for OpenMRS Core 2.0.x

Build: #56 failed Manual run by Daniel Kayiwa

Stages & jobs

  1. Build and Test

  2. Deploy

  3. Release

    Requires a user to start manually

Build result summary

Details

Completed
Duration
10 minutes
Labels
None
Revisions
openmrs-core
e61d304865fa9b0bab7c281a0061095df2e93017 e61d304865fa9b0bab7c281a0061095df2e93017
openmrs-standalone
777fbe8dcab15eccf4785771e54ddff965027fbc 777fbe8dcab15eccf4785771e54ddff965027fbc
Release scripts
a9c6b4741f415820e397e9b150cf80baca7f9368 a9c6b4741f415820e397e9b150cf80baca7f9368
Total tests
3242
Fixed in
#57 (Manual run by Daniel Kayiwa)

Tests

Responsible

No one has taken responsibility for this failure

Tests

New test failures 5
Status Test View job Duration
Collapse Failed ObsTest setFormField_shouldMarkTheObsAsDirtyWhenTheValueHasBeenChanged History
Build and Test < 1 sec
java.lang.IllegalAccessException: Can not set static final [Z field org.openmrs.Obs.$jacocoData to null value
	at sun.reflect.UnsafeFieldAccessorImpl.throwFinalFieldIllegalAccessException(UnsafeFieldAccessorImpl.java:76)
	at sun.reflect.UnsafeFieldAccessorImpl.throwFinalFieldIllegalAccessException(UnsafeFieldAccessorImpl.java:80)
	at sun.reflect.UnsafeQualifiedStaticObjectFieldAccessorImpl.set(UnsafeQualifiedStaticObjectFieldAccessorImpl.java:77)
	at java.lang.reflect.Field.set(Field.java:764)
	at org.openmrs.ObsTest.setFieldValue(ObsTest.java:97)
	at org.openmrs.ObsTest.createObs(ObsTest.java:77)
	at org.openmrs.ObsTest.setFormField_shouldMarkTheObsAsDirtyWhenTheValueHasBeenChanged(ObsTest.java:765)
Collapse Failed ObsTest setFormField_shouldNotMarkTheObsAsDirtyWhenTheValueHasNotBeenChanged History
Build and Test < 1 sec
java.lang.IllegalAccessException: Can not set static final [Z field org.openmrs.Obs.$jacocoData to null value
	at sun.reflect.UnsafeFieldAccessorImpl.throwFinalFieldIllegalAccessException(UnsafeFieldAccessorImpl.java:76)
	at sun.reflect.UnsafeFieldAccessorImpl.throwFinalFieldIllegalAccessException(UnsafeFieldAccessorImpl.java:80)
	at sun.reflect.UnsafeQualifiedStaticObjectFieldAccessorImpl.set(UnsafeQualifiedStaticObjectFieldAccessorImpl.java:77)
	at java.lang.reflect.Field.set(Field.java:764)
	at org.openmrs.ObsTest.setFieldValue(ObsTest.java:97)
	at org.openmrs.ObsTest.createObs(ObsTest.java:77)
	at org.openmrs.ObsTest.setFormField_shouldNotMarkTheObsAsDirtyWhenTheValueHasNotBeenChanged(ObsTest.java:754)
Collapse Failed ObsTest isDirty_shouldReturnTrueWhenAnImmutableFieldIsChangedFromANonNullToANullValue History
Build and Test < 1 sec
java.lang.IllegalAccessException: Can not set static final [Z field org.openmrs.Obs.$jacocoData to null value
	at sun.reflect.UnsafeFieldAccessorImpl.throwFinalFieldIllegalAccessException(UnsafeFieldAccessorImpl.java:76)
	at sun.reflect.UnsafeFieldAccessorImpl.throwFinalFieldIllegalAccessException(UnsafeFieldAccessorImpl.java:80)
	at sun.reflect.UnsafeQualifiedStaticObjectFieldAccessorImpl.set(UnsafeQualifiedStaticObjectFieldAccessorImpl.java:77)
	at java.lang.reflect.Field.set(Field.java:764)
	at org.openmrs.ObsTest.setFieldValue(ObsTest.java:97)
	at org.openmrs.ObsTest.createObs(ObsTest.java:77)
	at org.openmrs.ObsTest.isDirty_shouldReturnTrueWhenAnImmutableFieldIsChangedFromANonNullToANullValue(ObsTest.java:730)
Collapse Failed ObsTest isDirty_shouldReturnTrueWhenAnyImmutableFieldHasBeenChanged History
Build and Test < 1 sec
java.lang.IllegalAccessException: Can not set static final [Z field org.openmrs.Obs.$jacocoData to null value
	at sun.reflect.UnsafeFieldAccessorImpl.throwFinalFieldIllegalAccessException(UnsafeFieldAccessorImpl.java:76)
	at sun.reflect.UnsafeFieldAccessorImpl.throwFinalFieldIllegalAccessException(UnsafeFieldAccessorImpl.java:80)
	at sun.reflect.UnsafeQualifiedStaticObjectFieldAccessorImpl.set(UnsafeQualifiedStaticObjectFieldAccessorImpl.java:77)
	at java.lang.reflect.Field.set(Field.java:764)
	at org.openmrs.ObsTest.setFieldValue(ObsTest.java:97)
	at org.openmrs.ObsTest.createObs(ObsTest.java:77)
	at org.openmrs.ObsTest.isDirty_shouldReturnTrueWhenAnyImmutableFieldHasBeenChanged(ObsTest.java:679)
Collapse Failed ObsTest isDirty_shouldReturnFalseWhenNoChangeHasBeenMade History
Build and Test < 1 sec
java.lang.IllegalAccessException: Can not set static final [Z field org.openmrs.Obs.$jacocoData to null value
	at sun.reflect.UnsafeFieldAccessorImpl.throwFinalFieldIllegalAccessException(UnsafeFieldAccessorImpl.java:76)
	at sun.reflect.UnsafeFieldAccessorImpl.throwFinalFieldIllegalAccessException(UnsafeFieldAccessorImpl.java:80)
	at sun.reflect.UnsafeQualifiedStaticObjectFieldAccessorImpl.set(UnsafeQualifiedStaticObjectFieldAccessorImpl.java:77)
	at java.lang.reflect.Field.set(Field.java:764)
	at org.openmrs.ObsTest.setFieldValue(ObsTest.java:97)
	at org.openmrs.ObsTest.createObs(ObsTest.java:77)
	at org.openmrs.ObsTest.isDirty_shouldReturnFalseWhenNoChangeHasBeenMade(ObsTest.java:663)