Plan for OpenMRS Core 2.0.x

Build: #241 was successful

Job: Build and Test was successful

Stages & jobs

  1. Build and Test

  2. Deploy

  3. Release

    Requires a user to start manually

Build log

The build generated 1,406 lines of output.The output is too long and has been truncated to the last 1,000 lines. Download or view full build log

29-Oct-2020 15:07:47 Running org.openmrs.patient.impl.VerhoeffIdentifierValidatorTest
29-Oct-2020 15:07:47 Tests run: 2, Failures: 0, Errors: 0, Skipped: 0, Time elapsed: 0 sec - in org.openmrs.patient.impl.VerhoeffIdentifierValidatorTest
29-Oct-2020 15:07:47 Running org.openmrs.FormTest
29-Oct-2020 15:07:47 Tests run: 1, Failures: 0, Errors: 0, Skipped: 0, Time elapsed: 0 sec - in org.openmrs.FormTest
29-Oct-2020 15:07:47 Running org.openmrs.PersonTest
29-Oct-2020 15:07:48 Tests run: 27, Failures: 0, Errors: 0, Skipped: 0, Time elapsed: 0.49 sec - in org.openmrs.PersonTest
29-Oct-2020 15:07:48 Running org.openmrs.ConceptComponentTest
29-Oct-2020 15:07:48 Tests run: 1, Failures: 0, Errors: 0, Skipped: 0, Time elapsed: 0.038 sec - in org.openmrs.ConceptComponentTest
29-Oct-2020 15:07:48 Running org.openmrs.OrderTest
29-Oct-2020 15:07:48 Tests run: 56, Failures: 0, Errors: 0, Skipped: 0, Time elapsed: 0.621 sec - in org.openmrs.OrderTest
29-Oct-2020 15:07:48 Running org.openmrs.annotation.OpenmrsProfileExcludeFilterWithModulesTest
29-Oct-2020 15:07:49 Tests run: 1, Failures: 0, Errors: 0, Skipped: 0, Time elapsed: 0.638 sec - in org.openmrs.annotation.OpenmrsProfileExcludeFilterWithModulesTest
29-Oct-2020 15:07:49 Running org.openmrs.annotation.OpenmrsProfileIncludeFilterTest
29-Oct-2020 15:07:50 Tests run: 2, Failures: 0, Errors: 0, Skipped: 0, Time elapsed: 0.479 sec - in org.openmrs.annotation.OpenmrsProfileIncludeFilterTest
29-Oct-2020 15:07:50 Running org.openmrs.annotation.OpenmrsProfileExcludeFilterTest
29-Oct-2020 15:07:50 Tests run: 8, Failures: 0, Errors: 0, Skipped: 2, Time elapsed: 0.479 sec - in org.openmrs.annotation.OpenmrsProfileExcludeFilterTest
29-Oct-2020 15:07:50 Running org.openmrs.annotation.StartModuleAnnotationReuseTest
29-Oct-2020 15:07:51 Tests run: 1, Failures: 0, Errors: 0, Skipped: 0, Time elapsed: 0.687 sec - in org.openmrs.annotation.StartModuleAnnotationReuseTest
29-Oct-2020 15:07:51 Running org.openmrs.OrderTypeTest
29-Oct-2020 15:07:51 Tests run: 3, Failures: 0, Errors: 0, Skipped: 0, Time elapsed: 0 sec - in org.openmrs.OrderTypeTest
29-Oct-2020 15:07:51 Running org.openmrs.TestOrderTest
29-Oct-2020 15:07:51 Tests run: 4, Failures: 0, Errors: 0, Skipped: 0, Time elapsed: 0 sec - in org.openmrs.TestOrderTest
29-Oct-2020 15:07:51 Running org.openmrs.PersonAddressTest
29-Oct-2020 15:07:51 Tests run: 15, Failures: 0, Errors: 0, Skipped: 0, Time elapsed: 0.001 sec - in org.openmrs.PersonAddressTest
29-Oct-2020 15:07:51 Running org.openmrs.validator.PatientProgramValidatorTest
29-Oct-2020 15:07:51 Tests run: 22, Failures: 0, Errors: 0, Skipped: 0, Time elapsed: 0.663 sec - in org.openmrs.validator.PatientProgramValidatorTest
29-Oct-2020 15:07:51 Running org.openmrs.validator.PatientIdentifierTypeValidatorTest
29-Oct-2020 15:07:52 Tests run: 9, Failures: 0, Errors: 0, Skipped: 0, Time elapsed: 0.698 sec - in org.openmrs.validator.PatientIdentifierTypeValidatorTest
29-Oct-2020 15:07:52 Running org.openmrs.validator.ImplementationIdValidatorTest
29-Oct-2020 15:07:52 Tests run: 8, Failures: 0, Errors: 0, Skipped: 0, Time elapsed: 0.401 sec - in org.openmrs.validator.ImplementationIdValidatorTest
29-Oct-2020 15:07:52 Running org.openmrs.validator.UserValidatorTest
29-Oct-2020 15:07:53 Tests run: 21, Failures: 0, Errors: 0, Skipped: 0, Time elapsed: 0.649 sec - in org.openmrs.validator.UserValidatorTest
29-Oct-2020 15:07:53 Running org.openmrs.validator.ObsValidatorTest
29-Oct-2020 15:07:54 Tests run: 21, Failures: 0, Errors: 0, Skipped: 0, Time elapsed: 0.621 sec - in org.openmrs.validator.ObsValidatorTest
29-Oct-2020 15:07:54 Running org.openmrs.validator.DrugOrderValidatorTest
29-Oct-2020 15:07:55 Tests run: 36, Failures: 0, Errors: 0, Skipped: 0, Time elapsed: 1.347 sec - in org.openmrs.validator.DrugOrderValidatorTest
29-Oct-2020 15:07:55 Running org.openmrs.validator.PersonValidatorTest
29-Oct-2020 15:07:56 Tests run: 8, Failures: 0, Errors: 0, Skipped: 0, Time elapsed: 0.576 sec - in org.openmrs.validator.PersonValidatorTest
29-Oct-2020 15:07:56 Running org.openmrs.validator.ConceptDrugValidatorTest
29-Oct-2020 15:07:56 Tests run: 3, Failures: 0, Errors: 0, Skipped: 0, Time elapsed: 0.002 sec - in org.openmrs.validator.ConceptDrugValidatorTest
29-Oct-2020 15:07:56 Running org.openmrs.validator.VisitTypeValidatorTest
29-Oct-2020 15:07:56 Tests run: 2, Failures: 0, Errors: 0, Skipped: 0, Time elapsed: 0.316 sec - in org.openmrs.validator.VisitTypeValidatorTest
29-Oct-2020 15:07:56 Running org.openmrs.validator.AlertValidatorTest
29-Oct-2020 15:07:56 Tests run: 4, Failures: 0, Errors: 0, Skipped: 0, Time elapsed: 0.331 sec - in org.openmrs.validator.AlertValidatorTest
29-Oct-2020 15:07:56 Running org.openmrs.validator.PersonAttributeTypeValidatorTest
29-Oct-2020 15:07:57 Tests run: 7, Failures: 0, Errors: 0, Skipped: 0, Time elapsed: 0.344 sec - in org.openmrs.validator.PersonAttributeTypeValidatorTest
29-Oct-2020 15:07:57 Running org.openmrs.validator.PersonAddressValidatorTest
29-Oct-2020 15:07:57 Tests run: 10, Failures: 0, Errors: 0, Skipped: 0, Time elapsed: 0.45 sec - in org.openmrs.validator.PersonAddressValidatorTest
29-Oct-2020 15:07:57 Running org.openmrs.validator.ConceptAttributeTypeValidatorTest
29-Oct-2020 15:07:58 Tests run: 6, Failures: 0, Errors: 0, Skipped: 0, Time elapsed: 0.436 sec - in org.openmrs.validator.ConceptAttributeTypeValidatorTest
29-Oct-2020 15:07:58 Running org.openmrs.validator.DrugValidatorTest
29-Oct-2020 15:07:58 Tests run: 9, Failures: 0, Errors: 0, Skipped: 0, Time elapsed: 0.562 sec - in org.openmrs.validator.DrugValidatorTest
29-Oct-2020 15:07:58 Running org.openmrs.validator.SchedulerFormValidatorTest
29-Oct-2020 15:07:58 Tests run: 10, Failures: 0, Errors: 0, Skipped: 0, Time elapsed: 0.343 sec - in org.openmrs.validator.SchedulerFormValidatorTest
29-Oct-2020 15:07:58 Running org.openmrs.validator.TestOrderValidatorTest
29-Oct-2020 15:07:59 Tests run: 2, Failures: 0, Errors: 0, Skipped: 0, Time elapsed: 0.291 sec - in org.openmrs.validator.TestOrderValidatorTest
29-Oct-2020 15:07:59 Running org.openmrs.validator.PersonMergeLogValidatorTest
29-Oct-2020 15:07:59 Tests run: 6, Failures: 0, Errors: 0, Skipped: 0, Time elapsed: 0.314 sec - in org.openmrs.validator.PersonMergeLogValidatorTest
29-Oct-2020 15:07:59 Running org.openmrs.validator.RelationshipValidatorTest
29-Oct-2020 15:07:59 Tests run: 7, Failures: 0, Errors: 0, Skipped: 0, Time elapsed: 0.303 sec - in org.openmrs.validator.RelationshipValidatorTest
29-Oct-2020 15:07:59 Running org.openmrs.validator.LocationValidatorTest
29-Oct-2020 15:08:00 Tests run: 9, Failures: 0, Errors: 0, Skipped: 0, Time elapsed: 0.625 sec - in org.openmrs.validator.LocationValidatorTest
29-Oct-2020 15:08:00 Running org.openmrs.validator.PatientIdentifierValidatorTest
29-Oct-2020 15:08:01 Tests run: 20, Failures: 0, Errors: 0, Skipped: 0, Time elapsed: 0.741 sec - in org.openmrs.validator.PatientIdentifierValidatorTest
29-Oct-2020 15:08:01 Running org.openmrs.validator.PrivilegeValidatorTest
29-Oct-2020 15:08:01 Tests run: 5, Failures: 0, Errors: 0, Skipped: 0, Time elapsed: 0.464 sec - in org.openmrs.validator.PrivilegeValidatorTest
29-Oct-2020 15:08:01 Running org.openmrs.validator.PatientValidatorTest
29-Oct-2020 15:08:02 Tests run: 12, Failures: 0, Errors: 0, Skipped: 0, Time elapsed: 0.384 sec - in org.openmrs.validator.PatientValidatorTest
29-Oct-2020 15:08:02 Running org.openmrs.validator.AllergyValidatorTest
29-Oct-2020 15:08:02 Tests run: 9, Failures: 0, Errors: 0, Skipped: 0, Time elapsed: 0.596 sec - in org.openmrs.validator.AllergyValidatorTest
29-Oct-2020 15:08:02 Running org.openmrs.validator.PersonNameValidatorTest
29-Oct-2020 15:08:03 Tests run: 50, Failures: 0, Errors: 0, Skipped: 0, Time elapsed: 0.647 sec - in org.openmrs.validator.PersonNameValidatorTest
29-Oct-2020 15:08:03 Running org.openmrs.validator.OrderTypeValidatorTest
29-Oct-2020 15:08:03 Tests run: 14, Failures: 0, Errors: 0, Skipped: 0, Time elapsed: 0.476 sec - in org.openmrs.validator.OrderTypeValidatorTest
29-Oct-2020 15:08:03 Running org.openmrs.validator.VisitValidatorTest
29-Oct-2020 15:08:04 Tests run: 20, Failures: 0, Errors: 0, Skipped: 1, Time elapsed: 0.718 sec - in org.openmrs.validator.VisitValidatorTest
29-Oct-2020 15:08:04 Running org.openmrs.validator.FormValidatorTest
29-Oct-2020 15:08:05 Tests run: 8, Failures: 0, Errors: 0, Skipped: 0, Time elapsed: 0.524 sec - in org.openmrs.validator.FormValidatorTest
29-Oct-2020 15:08:05 Running org.openmrs.validator.LocationTagValidatorTest
29-Oct-2020 15:08:05 Tests run: 2, Failures: 0, Errors: 0, Skipped: 0, Time elapsed: 0.339 sec - in org.openmrs.validator.LocationTagValidatorTest
29-Oct-2020 15:08:05 Running org.openmrs.validator.EncounterValidatorTest
29-Oct-2020 15:08:05 Tests run: 10, Failures: 0, Errors: 0, Skipped: 0, Time elapsed: 0.403 sec - in org.openmrs.validator.EncounterValidatorTest
29-Oct-2020 15:08:05 Running org.openmrs.validator.FieldValidatorTest
29-Oct-2020 15:08:06 Tests run: 8, Failures: 0, Errors: 0, Skipped: 0, Time elapsed: 0.578 sec - in org.openmrs.validator.FieldValidatorTest
29-Oct-2020 15:08:06 Running org.openmrs.validator.ConceptDatatypeValidatorTest
29-Oct-2020 15:08:06 Tests run: 5, Failures: 0, Errors: 0, Skipped: 0, Time elapsed: 0.418 sec - in org.openmrs.validator.ConceptDatatypeValidatorTest
29-Oct-2020 15:08:06 Running org.openmrs.validator.ConceptMapTypeValidatorTest
29-Oct-2020 15:08:07 Tests run: 8, Failures: 0, Errors: 0, Skipped: 0, Time elapsed: 0.416 sec - in org.openmrs.validator.ConceptMapTypeValidatorTest
29-Oct-2020 15:08:07 Running org.openmrs.validator.ProviderValidatorTest
29-Oct-2020 15:08:07 Tests run: 13, Failures: 0, Errors: 0, Skipped: 0, Time elapsed: 0.338 sec - in org.openmrs.validator.ProviderValidatorTest
29-Oct-2020 15:08:07 Running org.openmrs.validator.StateConversionValidatorTest
29-Oct-2020 15:08:07 Tests run: 4, Failures: 0, Errors: 0, Skipped: 0, Time elapsed: 0.365 sec - in org.openmrs.validator.StateConversionValidatorTest
29-Oct-2020 15:08:07 Running org.openmrs.validator.ProgramValidatorTest
29-Oct-2020 15:08:08 Tests run: 8, Failures: 0, Errors: 0, Skipped: 0, Time elapsed: 0.354 sec - in org.openmrs.validator.ProgramValidatorTest
29-Oct-2020 15:08:08 Running org.openmrs.validator.BaseAttributeTypeValidatorTest
29-Oct-2020 15:08:10 Tests run: 9, Failures: 0, Errors: 0, Skipped: 0, Time elapsed: 2.246 sec - in org.openmrs.validator.BaseAttributeTypeValidatorTest
29-Oct-2020 15:08:10 Running org.openmrs.validator.OrderFrequencyValidatorTest
29-Oct-2020 15:08:10 Tests run: 9, Failures: 0, Errors: 0, Skipped: 0, Time elapsed: 0.342 sec - in org.openmrs.validator.OrderFrequencyValidatorTest
29-Oct-2020 15:08:10 Running org.openmrs.validator.EncounterTypeValidatorTest
29-Oct-2020 15:08:11 Tests run: 7, Failures: 0, Errors: 0, Skipped: 0, Time elapsed: 0.301 sec - in org.openmrs.validator.EncounterTypeValidatorTest
29-Oct-2020 15:08:11 Running org.openmrs.validator.ConceptValidatorTest
29-Oct-2020 15:08:11 Tests run: 30, Failures: 0, Errors: 0, Skipped: 0, Time elapsed: 0.659 sec - in org.openmrs.validator.ConceptValidatorTest
29-Oct-2020 15:08:11 Running org.openmrs.validator.ValidateUtilTest
29-Oct-2020 15:08:12 Tests run: 8, Failures: 0, Errors: 0, Skipped: 0, Time elapsed: 0.302 sec - in org.openmrs.validator.ValidateUtilTest
29-Oct-2020 15:08:12 Running org.openmrs.validator.ConceptNameTagValidatorTest
29-Oct-2020 15:08:12 Tests run: 7, Failures: 0, Errors: 0, Skipped: 0, Time elapsed: 0.436 sec - in org.openmrs.validator.ConceptNameTagValidatorTest
29-Oct-2020 15:08:12 Running org.openmrs.validator.FieldTypeValidatorTest
29-Oct-2020 15:08:12 Tests run: 5, Failures: 0, Errors: 0, Skipped: 0, Time elapsed: 0.323 sec - in org.openmrs.validator.FieldTypeValidatorTest
29-Oct-2020 15:08:12 Running org.openmrs.validator.RoleValidatorTest
29-Oct-2020 15:08:13 Tests run: 6, Failures: 0, Errors: 0, Skipped: 0, Time elapsed: 0.239 sec - in org.openmrs.validator.RoleValidatorTest
29-Oct-2020 15:08:13 Running org.openmrs.validator.VisitAttributeTypeValidatorTest
29-Oct-2020 15:08:13 Tests run: 2, Failures: 0, Errors: 0, Skipped: 0, Time elapsed: 0.237 sec - in org.openmrs.validator.VisitAttributeTypeValidatorTest
29-Oct-2020 15:08:13 Running org.openmrs.validator.LocationAttributeTypeValidatorTest
29-Oct-2020 15:08:13 Tests run: 6, Failures: 0, Errors: 0, Skipped: 0, Time elapsed: 0.36 sec - in org.openmrs.validator.LocationAttributeTypeValidatorTest
29-Oct-2020 15:08:13 Running org.openmrs.validator.RelationshipTypeValidatorTest
29-Oct-2020 15:08:14 Tests run: 7, Failures: 0, Errors: 0, Skipped: 0, Time elapsed: 0.283 sec - in org.openmrs.validator.RelationshipTypeValidatorTest
29-Oct-2020 15:08:14 Running org.openmrs.validator.ProviderAttributeTypeValidatorTest
29-Oct-2020 15:08:14 Tests run: 2, Failures: 0, Errors: 0, Skipped: 0, Time elapsed: 0.351 sec - in org.openmrs.validator.ProviderAttributeTypeValidatorTest
29-Oct-2020 15:08:14 Running org.openmrs.validator.OrderValidatorTest
29-Oct-2020 15:08:14 Tests run: 22, Failures: 0, Errors: 0, Skipped: 0, Time elapsed: 0.513 sec - in org.openmrs.validator.OrderValidatorTest
29-Oct-2020 15:08:14 Running org.openmrs.validator.ConceptSourceValidatorTest
29-Oct-2020 15:08:15 Tests run: 6, Failures: 0, Errors: 0, Skipped: 0, Time elapsed: 0.296 sec - in org.openmrs.validator.ConceptSourceValidatorTest
29-Oct-2020 15:08:15 Running org.openmrs.validator.EncounterRoleValidatorTest
29-Oct-2020 15:08:15 Tests run: 5, Failures: 0, Errors: 0, Skipped: 0, Time elapsed: 0.328 sec - in org.openmrs.validator.EncounterRoleValidatorTest
29-Oct-2020 15:08:15 Running org.openmrs.validator.RequireNameValidatorTest
29-Oct-2020 15:08:15 Tests run: 2, Failures: 0, Errors: 0, Skipped: 0, Time elapsed: 0 sec - in org.openmrs.validator.RequireNameValidatorTest
29-Oct-2020 15:08:15 Running org.openmrs.validator.ConceptReferenceTermValidatorTest
29-Oct-2020 15:08:15 [Field error in object 'term' on field 'conceptReferenceTermMaps[1].termB': rejected value [weight term(WGT234)]; codes [ConceptReferenceTerm.termToTerm.alreadyMapped.term.conceptReferenceTermMaps[1].termB,ConceptReferenceTerm.termToTerm.alreadyMapped.term.conceptReferenceTermMaps.termB,ConceptReferenceTerm.termToTerm.alreadyMapped.conceptReferenceTermMaps[1].termB,ConceptReferenceTerm.termToTerm.alreadyMapped.conceptReferenceTermMaps.termB,ConceptReferenceTerm.termToTerm.alreadyMapped.termB,ConceptReferenceTerm.termToTerm.alreadyMapped.org.openmrs.ConceptReferenceTerm,ConceptReferenceTerm.termToTerm.alreadyMapped]; arguments []; default message [Cannot map a reference term multiple times to the same concept reference term]]
29-Oct-2020 15:08:16 Tests run: 18, Failures: 0, Errors: 0, Skipped: 3, Time elapsed: 0.579 sec - in org.openmrs.validator.ConceptReferenceTermValidatorTest
29-Oct-2020 15:08:16 Running org.openmrs.validator.HL7SourceValidatorTest
29-Oct-2020 15:08:16 Tests run: 2, Failures: 0, Errors: 0, Skipped: 0, Time elapsed: 0.355 sec - in org.openmrs.validator.HL7SourceValidatorTest
29-Oct-2020 15:08:16 Running org.openmrs.validator.ConceptClassValidatorTest
29-Oct-2020 15:08:16 Tests run: 6, Failures: 0, Errors: 0, Skipped: 0, Time elapsed: 0.234 sec - in org.openmrs.validator.ConceptClassValidatorTest
29-Oct-2020 15:08:16 Running org.openmrs.BaseOpenmrsObjectTest
29-Oct-2020 15:08:17 Tests run: 20, Failures: 0, Errors: 0, Skipped: 0, Time elapsed: 0.306 sec - in org.openmrs.BaseOpenmrsObjectTest
29-Oct-2020 15:08:17 Running org.openmrs.EncounterTypeTest
29-Oct-2020 15:08:17 Tests run: 1, Failures: 0, Errors: 0, Skipped: 0, Time elapsed: 0 sec - in org.openmrs.EncounterTypeTest
29-Oct-2020 15:08:17 Running org.openmrs.DurationTest
29-Oct-2020 15:08:17 Tests run: 11, Failures: 0, Errors: 0, Skipped: 0, Time elapsed: 0.341 sec - in org.openmrs.DurationTest
29-Oct-2020 15:08:17 Running org.openmrs.LocationTest
29-Oct-2020 15:08:17 Tests run: 3, Failures: 0, Errors: 0, Skipped: 0, Time elapsed: 0.007 sec - in org.openmrs.LocationTest
29-Oct-2020 15:08:17 Running org.openmrs.comparator.PatientIdentifierTypeDefaultComparatorTest
29-Oct-2020 15:08:17 Tests run: 1, Failures: 0, Errors: 0, Skipped: 0, Time elapsed: 0 sec - in org.openmrs.comparator.PatientIdentifierTypeDefaultComparatorTest
29-Oct-2020 15:08:17 Running org.openmrs.ObsBehaviorTest
29-Oct-2020 15:08:17 Tests run: 3, Failures: 0, Errors: 0, Skipped: 1, Time elapsed: 0.238 sec - in org.openmrs.ObsBehaviorTest
29-Oct-2020 15:08:17 Running org.openmrs.ConceptReferenceTermTest
29-Oct-2020 15:08:17 Tests run: 3, Failures: 0, Errors: 0, Skipped: 0, Time elapsed: 0.001 sec - in org.openmrs.ConceptReferenceTermTest
29-Oct-2020 15:08:17 Running org.openmrs.aop.AuthorizationAdviceTest
29-Oct-2020 15:08:17 Tests run: 1, Failures: 0, Errors: 0, Skipped: 0, Time elapsed: 0.301 sec - in org.openmrs.aop.AuthorizationAdviceTest
29-Oct-2020 15:08:17 Running org.openmrs.aop.RequiredDataAdviceTest
29-Oct-2020 15:08:18 Tests run: 26, Failures: 0, Errors: 0, Skipped: 0, Time elapsed: 0.45 sec - in org.openmrs.aop.RequiredDataAdviceTest
29-Oct-2020 15:08:18 Running org.openmrs.PersonAttributeTest
29-Oct-2020 15:08:18 Tests run: 6, Failures: 0, Errors: 0, Skipped: 0, Time elapsed: 0.321 sec - in org.openmrs.PersonAttributeTest
29-Oct-2020 15:08:18 Running org.openmrs.RoleTest
29-Oct-2020 15:08:18 Tests run: 7, Failures: 0, Errors: 0, Skipped: 0, Time elapsed: 0 sec - in org.openmrs.RoleTest
29-Oct-2020 15:08:18 Running org.openmrs.messagesource.impl.DefaultMessageSourceServiceImplTest
29-Oct-2020 15:08:18 Tests run: 1, Failures: 0, Errors: 0, Skipped: 0, Time elapsed: 0 sec - in org.openmrs.messagesource.impl.DefaultMessageSourceServiceImplTest
29-Oct-2020 15:08:18 Running org.openmrs.messagesource.impl.CachedMessageSourceTest
29-Oct-2020 15:08:18 Tests run: 2, Failures: 0, Errors: 0, Skipped: 0, Time elapsed: 0.096 sec - in org.openmrs.messagesource.impl.CachedMessageSourceTest
29-Oct-2020 15:08:18 Running org.openmrs.messagesource.MessageSourceServiceTest
29-Oct-2020 15:08:19 Tests run: 1, Failures: 0, Errors: 0, Skipped: 0, Time elapsed: 0.333 sec - in org.openmrs.messagesource.MessageSourceServiceTest
29-Oct-2020 15:08:19 Running org.openmrs.messagesource.PresentationMessageMapTest
29-Oct-2020 15:08:19 Tests run: 2, Failures: 0, Errors: 0, Skipped: 0, Time elapsed: 0.002 sec - in org.openmrs.messagesource.PresentationMessageMapTest
29-Oct-2020 15:08:19 Running org.openmrs.util.DatabaseUpdaterTest
29-Oct-2020 15:08:19 INFO 10/29/20 3:08 PM:liquibase: Creating database history table with name: LIQUIBASECHANGELOG
29-Oct-2020 15:08:19 INFO 10/29/20 3:08 PM:liquibase: Reading from LIQUIBASECHANGELOG
29-Oct-2020 15:08:20 Tests run: 1, Failures: 0, Errors: 0, Skipped: 0, Time elapsed: 1.284 sec - in org.openmrs.util.DatabaseUpdaterTest
29-Oct-2020 15:08:20 Running org.openmrs.util.HttpClientTest
29-Oct-2020 15:08:20 Tests run: 1, Failures: 0, Errors: 0, Skipped: 0, Time elapsed: 0.015 sec - in org.openmrs.util.HttpClientTest
29-Oct-2020 15:08:20 Running org.openmrs.util.LocaleUtilityTest
29-Oct-2020 15:08:20 Tests run: 21, Failures: 0, Errors: 0, Skipped: 0, Time elapsed: 0.483 sec - in org.openmrs.util.LocaleUtilityTest
29-Oct-2020 15:08:20 Running org.openmrs.util.OpenmrsSecurityManagerTest
29-Oct-2020 15:08:20 Tests run: 2, Failures: 0, Errors: 0, Skipped: 0, Time elapsed: 0 sec - in org.openmrs.util.OpenmrsSecurityManagerTest
29-Oct-2020 15:08:20 Running org.openmrs.util.LocationUtilityTest
29-Oct-2020 15:08:21 Tests run: 2, Failures: 0, Errors: 0, Skipped: 0, Time elapsed: 0.328 sec - in org.openmrs.util.LocationUtilityTest
29-Oct-2020 15:08:21 Running org.openmrs.util.ProviderByPersonNameComparatorTest
29-Oct-2020 15:08:21 Tests run: 6, Failures: 0, Errors: 0, Skipped: 0, Time elapsed: 0.004 sec - in org.openmrs.util.ProviderByPersonNameComparatorTest
29-Oct-2020 15:08:21 Running org.openmrs.util.DoubleRangeTest
29-Oct-2020 15:08:21 Tests run: 28, Failures: 0, Errors: 0, Skipped: 0, Time elapsed: 0.012 sec - in org.openmrs.util.DoubleRangeTest
29-Oct-2020 15:08:21 Running org.openmrs.util.HttpUrlTest
29-Oct-2020 15:08:21 Tests run: 4, Failures: 0, Errors: 0, Skipped: 0, Time elapsed: 0.002 sec - in org.openmrs.util.HttpUrlTest
29-Oct-2020 15:08:21 Running org.openmrs.util.JavaVersionTest
29-Oct-2020 15:08:21 SLF4J: Class path contains multiple SLF4J bindings.
29-Oct-2020 15:08:21 SLF4J: Found binding in [jar:file:/home/bamboo-agent/.m2/repository/org/slf4j/slf4j-log4j12/1.6.0/slf4j-log4j12-1.6.0.jar!/org/slf4j/impl/StaticLoggerBinder.class]
29-Oct-2020 15:08:21 SLF4J: Found binding in [jar:file:/home/bamboo-agent/.m2/repository/org/slf4j/slf4j-log4j12/1.6.0/slf4j-log4j12-1.6.0.jar!/org/slf4j/impl/StaticLoggerBinder.class]
29-Oct-2020 15:08:21 SLF4J: See http://www.slf4j.org/codes.html#multiple_bindings for an explanation.
29-Oct-2020 15:08:22 Tests run: 2, Failures: 0, Errors: 0, Skipped: 0, Time elapsed: 0.855 sec - in org.openmrs.util.JavaVersionTest
29-Oct-2020 15:08:22 Running org.openmrs.util.ReflectTest
29-Oct-2020 15:08:22 Tests run: 18, Failures: 0, Errors: 0, Skipped: 0, Time elapsed: 0.002 sec - in org.openmrs.util.ReflectTest
29-Oct-2020 15:08:22 Running org.openmrs.util.UpgradeUtilTest
29-Oct-2020 15:08:22 Tests run: 2, Failures: 0, Errors: 0, Skipped: 0, Time elapsed: 0.293 sec - in org.openmrs.util.UpgradeUtilTest
29-Oct-2020 15:08:22 Running org.openmrs.util.DateUtilTest
29-Oct-2020 15:08:22 Tests run: 1, Failures: 0, Errors: 0, Skipped: 0, Time elapsed: 0 sec - in org.openmrs.util.DateUtilTest
29-Oct-2020 15:08:22 Running org.openmrs.util.ExceptionUtilTest
29-Oct-2020 15:08:22 Tests run: 1, Failures: 0, Errors: 0, Skipped: 0, Time elapsed: 0.005 sec - in org.openmrs.util.ExceptionUtilTest
29-Oct-2020 15:08:22 Running org.openmrs.util.PersonByNameComparatorTest
29-Oct-2020 15:08:22 Tests run: 4, Failures: 0, Errors: 0, Skipped: 0, Time elapsed: 0 sec - in org.openmrs.util.PersonByNameComparatorTest
29-Oct-2020 15:08:22 Running org.openmrs.util.UserByNameComparatorTest
29-Oct-2020 15:08:22 Tests run: 1, Failures: 0, Errors: 0, Skipped: 0, Time elapsed: 0 sec - in org.openmrs.util.UserByNameComparatorTest
29-Oct-2020 15:08:22 Running org.openmrs.util.DrugsByNameComparatorTest
29-Oct-2020 15:08:22 Tests run: 4, Failures: 0, Errors: 0, Skipped: 0, Time elapsed: 0.007 sec - in org.openmrs.util.DrugsByNameComparatorTest
29-Oct-2020 15:08:22 Running org.openmrs.util.OpenmrsUtilTest
29-Oct-2020 15:08:23 Tests run: 44, Failures: 0, Errors: 0, Skipped: 0, Time elapsed: 1.544 sec - in org.openmrs.util.OpenmrsUtilTest
29-Oct-2020 15:08:23 Running org.openmrs.util.GraphTest
29-Oct-2020 15:08:23 Tests run: 2, Failures: 0, Errors: 0, Skipped: 0, Time elapsed: 0.001 sec - in org.openmrs.util.GraphTest
29-Oct-2020 15:08:24 Running org.openmrs.util.HandlerUtilTest
29-Oct-2020 15:08:24 Tests run: 6, Failures: 0, Errors: 0, Skipped: 0, Time elapsed: 0.252 sec - in org.openmrs.util.HandlerUtilTest
29-Oct-2020 15:08:24 Running org.openmrs.util.SecurityTest
29-Oct-2020 15:08:24 Tests run: 7, Failures: 0, Errors: 0, Skipped: 0, Time elapsed: 0.047 sec - in org.openmrs.util.SecurityTest
29-Oct-2020 15:08:24 Running org.openmrs.DrugTest
29-Oct-2020 15:08:24 Tests run: 2, Failures: 0, Errors: 0, Skipped: 0, Time elapsed: 0.221 sec - in org.openmrs.DrugTest
29-Oct-2020 15:08:24 Running org.openmrs.ConceptNumericTest
29-Oct-2020 15:08:24 Tests run: 8, Failures: 0, Errors: 0, Skipped: 0, Time elapsed: 0.27 sec - in org.openmrs.ConceptNumericTest
29-Oct-2020 15:08:24 Running org.openmrs.OrderEntryIntegrationTest
29-Oct-2020 15:08:25 Tests run: 15, Failures: 0, Errors: 0, Skipped: 0, Time elapsed: 1.112 sec - in org.openmrs.OrderEntryIntegrationTest
29-Oct-2020 15:08:25 Running org.openmrs.api.LocationServiceTest
29-Oct-2020 15:08:26 Tests run: 70, Failures: 0, Errors: 0, Skipped: 0, Time elapsed: 1.02 sec - in org.openmrs.api.LocationServiceTest
29-Oct-2020 15:08:26 Running org.openmrs.api.AdministrationServiceTest
29-Oct-2020 15:08:27 Tests run: 53, Failures: 0, Errors: 0, Skipped: 4, Time elapsed: 0.733 sec - in org.openmrs.api.AdministrationServiceTest
29-Oct-2020 15:08:27 Running org.openmrs.api.FormServiceTest
29-Oct-2020 15:08:28 Tests run: 40, Failures: 0, Errors: 0, Skipped: 0, Time elapsed: 0.69 sec - in org.openmrs.api.FormServiceTest
29-Oct-2020 15:08:28 Running org.openmrs.api.ProviderServiceTest
29-Oct-2020 15:08:29 Tests run: 40, Failures: 0, Errors: 0, Skipped: 0, Time elapsed: 0.976 sec - in org.openmrs.api.ProviderServiceTest
29-Oct-2020 15:08:29 Running org.openmrs.api.OrderSetServiceTest
29-Oct-2020 15:08:29 Tests run: 12, Failures: 0, Errors: 0, Skipped: 0, Time elapsed: 0.452 sec - in org.openmrs.api.OrderSetServiceTest
29-Oct-2020 15:08:29 Running org.openmrs.api.PersonServiceTest
29-Oct-2020 15:08:32 Tests run: 119, Failures: 0, Errors: 0, Skipped: 0, Time elapsed: 2.334 sec - in org.openmrs.api.PersonServiceTest
29-Oct-2020 15:08:32 Running org.openmrs.api.EncounterServiceTest
29-Oct-2020 15:08:32 ERROR - ImageHandler.getObs(79) |2020-10-29 15:08:32,917| Trying to read file: /home/bamboo-agent/bamboo-agent/.agent_tmp/TRUNK-OC2-JOB1/appdir-for-unit-tests-7327699441434999823/complex_obs/file1.jpg
29-Oct-2020 15:08:32 javax.imageio.IIOException: Can't read input file!
29-Oct-2020 15:08:32         at javax.imageio.ImageIO.read(ImageIO.java:1302)
29-Oct-2020 15:08:32         at org.openmrs.obs.handler.ImageHandler.getObs(ImageHandler.java:76)
29-Oct-2020 15:08:32         at org.openmrs.api.impl.ObsServiceImpl.getObs(ObsServiceImpl.java:254)
29-Oct-2020 15:08:32         at sun.reflect.GeneratedMethodAccessor774.invoke(Unknown Source)
29-Oct-2020 15:08:32         at sun.reflect.DelegatingMethodAccessorImpl.invoke(DelegatingMethodAccessorImpl.java:43)
29-Oct-2020 15:08:32         at java.lang.reflect.Method.invoke(Method.java:498)
29-Oct-2020 15:08:32         at org.springframework.aop.support.AopUtils.invokeJoinpointUsingReflection(AopUtils.java:317)
29-Oct-2020 15:08:32         at org.springframework.aop.framework.ReflectiveMethodInvocation.invokeJoinpoint(ReflectiveMethodInvocation.java:190)
29-Oct-2020 15:08:32         at org.springframework.aop.framework.ReflectiveMethodInvocation.proceed(ReflectiveMethodInvocation.java:157)
29-Oct-2020 15:08:32         at org.springframework.transaction.interceptor.TransactionInterceptor$1.proceedWithInvocation(TransactionInterceptor.java:99)
29-Oct-2020 15:08:32         at org.springframework.transaction.interceptor.TransactionAspectSupport.invokeWithinTransaction(TransactionAspectSupport.java:281)
29-Oct-2020 15:08:32         at org.springframework.transaction.interceptor.TransactionInterceptor.invoke(TransactionInterceptor.java:96)
29-Oct-2020 15:08:32         at org.springframework.aop.framework.ReflectiveMethodInvocation.proceed(ReflectiveMethodInvocation.java:179)
29-Oct-2020 15:08:32         at org.springframework.aop.framework.JdkDynamicAopProxy.invoke(JdkDynamicAopProxy.java:207)
29-Oct-2020 15:08:32         at com.sun.proxy.$Proxy73.getObs(Unknown Source)
29-Oct-2020 15:08:32         at sun.reflect.GeneratedMethodAccessor774.invoke(Unknown Source)
29-Oct-2020 15:08:32         at sun.reflect.DelegatingMethodAccessorImpl.invoke(DelegatingMethodAccessorImpl.java:43)
29-Oct-2020 15:08:32         at java.lang.reflect.Method.invoke(Method.java:498)
29-Oct-2020 15:08:32         at org.springframework.aop.support.AopUtils.invokeJoinpointUsingReflection(AopUtils.java:317)
29-Oct-2020 15:08:32         at org.springframework.aop.framework.ReflectiveMethodInvocation.invokeJoinpoint(ReflectiveMethodInvocation.java:190)
29-Oct-2020 15:08:32         at org.springframework.aop.framework.ReflectiveMethodInvocation.proceed(ReflectiveMethodInvocation.java:157)
29-Oct-2020 15:08:32         at org.openmrs.aop.LoggingAdvice.invoke(LoggingAdvice.java:121)
29-Oct-2020 15:08:32         at org.springframework.aop.framework.ReflectiveMethodInvocation.proceed(ReflectiveMethodInvocation.java:179)
29-Oct-2020 15:08:32         at org.springframework.aop.framework.adapter.MethodBeforeAdviceInterceptor.invoke(MethodBeforeAdviceInterceptor.java:52)
29-Oct-2020 15:08:32         at org.springframework.aop.framework.ReflectiveMethodInvocation.proceed(ReflectiveMethodInvocation.java:179)
29-Oct-2020 15:08:32         at org.springframework.aop.framework.adapter.MethodBeforeAdviceInterceptor.invoke(MethodBeforeAdviceInterceptor.java:52)
29-Oct-2020 15:08:32         at org.springframework.aop.framework.ReflectiveMethodInvocation.proceed(ReflectiveMethodInvocation.java:179)
29-Oct-2020 15:08:32         at org.springframework.aop.framework.JdkDynamicAopProxy.invoke(JdkDynamicAopProxy.java:207)
29-Oct-2020 15:08:32         at com.sun.proxy.$Proxy74.getObs(Unknown Source)
29-Oct-2020 15:08:32         at org.openmrs.api.impl.EncounterServiceImpl.saveEncounter(EncounterServiceImpl.java:214)
29-Oct-2020 15:08:32         at sun.reflect.GeneratedMethodAccessor1144.invoke(Unknown Source)
29-Oct-2020 15:08:32         at sun.reflect.DelegatingMethodAccessorImpl.invoke(DelegatingMethodAccessorImpl.java:43)
29-Oct-2020 15:08:32         at java.lang.reflect.Method.invoke(Method.java:498)
29-Oct-2020 15:08:32         at org.springframework.aop.support.AopUtils.invokeJoinpointUsingReflection(AopUtils.java:317)
29-Oct-2020 15:08:32         at org.springframework.aop.framework.ReflectiveMethodInvocation.invokeJoinpoint(ReflectiveMethodInvocation.java:190)
29-Oct-2020 15:08:32         at org.springframework.aop.framework.ReflectiveMethodInvocation.proceed(ReflectiveMethodInvocation.java:157)
29-Oct-2020 15:08:32         at org.springframework.transaction.interceptor.TransactionInterceptor$1.proceedWithInvocation(TransactionInterceptor.java:99)
29-Oct-2020 15:08:32         at org.springframework.transaction.interceptor.TransactionAspectSupport.invokeWithinTransaction(TransactionAspectSupport.java:281)
29-Oct-2020 15:08:32         at org.springframework.transaction.interceptor.TransactionInterceptor.invoke(TransactionInterceptor.java:96)
29-Oct-2020 15:08:32         at org.springframework.aop.framework.ReflectiveMethodInvocation.proceed(ReflectiveMethodInvocation.java:179)
29-Oct-2020 15:08:32         at org.springframework.aop.framework.JdkDynamicAopProxy.invoke(JdkDynamicAopProxy.java:207)
29-Oct-2020 15:08:32         at com.sun.proxy.$Proxy75.saveEncounter(Unknown Source)
29-Oct-2020 15:08:32         at sun.reflect.GeneratedMethodAccessor1144.invoke(Unknown Source)
29-Oct-2020 15:08:32         at sun.reflect.DelegatingMethodAccessorImpl.invoke(DelegatingMethodAccessorImpl.java:43)
29-Oct-2020 15:08:32         at java.lang.reflect.Method.invoke(Method.java:498)
29-Oct-2020 15:08:32         at org.springframework.aop.support.AopUtils.invokeJoinpointUsingReflection(AopUtils.java:317)
29-Oct-2020 15:08:32         at org.springframework.aop.framework.ReflectiveMethodInvocation.invokeJoinpoint(ReflectiveMethodInvocation.java:190)
29-Oct-2020 15:08:32         at org.springframework.aop.framework.ReflectiveMethodInvocation.proceed(ReflectiveMethodInvocation.java:157)
29-Oct-2020 15:08:32         at org.openmrs.aop.LoggingAdvice.invoke(LoggingAdvice.java:121)
29-Oct-2020 15:08:32         at org.springframework.aop.framework.ReflectiveMethodInvocation.proceed(ReflectiveMethodInvocation.java:179)
29-Oct-2020 15:08:32         at org.springframework.aop.framework.adapter.MethodBeforeAdviceInterceptor.invoke(MethodBeforeAdviceInterceptor.java:52)
29-Oct-2020 15:08:32         at org.springframework.aop.framework.ReflectiveMethodInvocation.proceed(ReflectiveMethodInvocation.java:179)
29-Oct-2020 15:08:32         at org.springframework.aop.framework.adapter.MethodBeforeAdviceInterceptor.invoke(MethodBeforeAdviceInterceptor.java:52)
29-Oct-2020 15:08:32         at org.springframework.aop.framework.ReflectiveMethodInvocation.proceed(ReflectiveMethodInvocation.java:179)
29-Oct-2020 15:08:32         at org.springframework.aop.framework.JdkDynamicAopProxy.invoke(JdkDynamicAopProxy.java:207)
29-Oct-2020 15:08:32         at com.sun.proxy.$Proxy76.saveEncounter(Unknown Source)
29-Oct-2020 15:08:32         at org.openmrs.api.EncounterServiceTest.saveEncounter_shouldSaveEncounterWithComplexObs(EncounterServiceTest.java:385)
29-Oct-2020 15:08:32         at sun.reflect.NativeMethodAccessorImpl.invoke0(Native Method)
29-Oct-2020 15:08:32         at sun.reflect.NativeMethodAccessorImpl.invoke(NativeMethodAccessorImpl.java:62)
29-Oct-2020 15:08:32         at sun.reflect.DelegatingMethodAccessorImpl.invoke(DelegatingMethodAccessorImpl.java:43)
29-Oct-2020 15:08:32         at java.lang.reflect.Method.invoke(Method.java:498)
29-Oct-2020 15:08:32         at org.junit.runners.model.FrameworkMethod$1.runReflectiveCall(FrameworkMethod.java:47)
29-Oct-2020 15:08:32         at org.junit.internal.runners.model.ReflectiveCallable.run(ReflectiveCallable.java:12)
29-Oct-2020 15:08:32         at org.junit.runners.model.FrameworkMethod.invokeExplosively(FrameworkMethod.java:44)
29-Oct-2020 15:08:32         at org.junit.internal.runners.statements.InvokeMethod.evaluate(InvokeMethod.java:17)
29-Oct-2020 15:08:32         at org.junit.internal.runners.statements.RunBefores.evaluate(RunBefores.java:26)
29-Oct-2020 15:08:32         at org.springframework.test.context.junit4.statements.RunBeforeTestMethodCallbacks.evaluate(RunBeforeTestMethodCallbacks.java:73)
29-Oct-2020 15:08:32         at org.junit.internal.runners.statements.RunAfters.evaluate(RunAfters.java:27)
29-Oct-2020 15:08:32         at org.springframework.test.context.junit4.statements.RunAfterTestMethodCallbacks.evaluate(RunAfterTestMethodCallbacks.java:82)
29-Oct-2020 15:08:32         at org.springframework.test.context.junit4.statements.SpringRepeat.evaluate(SpringRepeat.java:73)
29-Oct-2020 15:08:32         at org.junit.runners.ParentRunner.runLeaf(ParentRunner.java:271)
29-Oct-2020 15:08:32         at org.springframework.test.context.junit4.SpringJUnit4ClassRunner.runChild(SpringJUnit4ClassRunner.java:217)
29-Oct-2020 15:08:32         at org.springframework.test.context.junit4.SpringJUnit4ClassRunner.runChild(SpringJUnit4ClassRunner.java:83)
29-Oct-2020 15:08:32         at org.junit.runners.ParentRunner$3.run(ParentRunner.java:238)
29-Oct-2020 15:08:32         at org.junit.runners.ParentRunner$1.schedule(ParentRunner.java:63)
29-Oct-2020 15:08:32         at org.junit.runners.ParentRunner.runChildren(ParentRunner.java:236)
29-Oct-2020 15:08:32         at org.junit.runners.ParentRunner.access$000(ParentRunner.java:53)
29-Oct-2020 15:08:32         at org.junit.runners.ParentRunner$2.evaluate(ParentRunner.java:229)
29-Oct-2020 15:08:32         at org.springframework.test.context.junit4.statements.RunBeforeTestClassCallbacks.evaluate(RunBeforeTestClassCallbacks.java:61)
29-Oct-2020 15:08:32         at org.junit.internal.runners.statements.RunAfters.evaluate(RunAfters.java:27)
29-Oct-2020 15:08:32         at org.springframework.test.context.junit4.statements.RunAfterTestClassCallbacks.evaluate(RunAfterTestClassCallbacks.java:68)
29-Oct-2020 15:08:32         at org.junit.runners.ParentRunner.run(ParentRunner.java:309)
29-Oct-2020 15:08:32         at org.springframework.test.context.junit4.SpringJUnit4ClassRunner.run(SpringJUnit4ClassRunner.java:163)
29-Oct-2020 15:08:32         at org.apache.maven.surefire.junit4.JUnit4Provider.execute(JUnit4Provider.java:283)
29-Oct-2020 15:08:32         at org.apache.maven.surefire.junit4.JUnit4Provider.executeWithRerun(JUnit4Provider.java:173)
29-Oct-2020 15:08:32         at org.apache.maven.surefire.junit4.JUnit4Provider.executeTestSet(JUnit4Provider.java:153)
29-Oct-2020 15:08:32         at org.apache.maven.surefire.junit4.JUnit4Provider.invoke(JUnit4Provider.java:128)
29-Oct-2020 15:08:32         at org.apache.maven.surefire.booter.ForkedBooter.invokeProviderInSameClassLoader(ForkedBooter.java:203)
29-Oct-2020 15:08:32         at org.apache.maven.surefire.booter.ForkedBooter.runSuitesInProcess(ForkedBooter.java:155)
29-Oct-2020 15:08:32         at org.apache.maven.surefire.booter.ForkedBooter.main(ForkedBooter.java:103)
29-Oct-2020 15:08:32 ERROR - ImageHandler.getObs(96) |2020-10-29 15:08:32,929| Image /home/bamboo-agent/bamboo-agent/.agent_tmp/TRUNK-OC2-JOB1/appdir-for-unit-tests-7327699441434999823/complex_obs/file1.jpg was not found
29-Oct-2020 15:08:32 java.io.FileNotFoundException: /home/bamboo-agent/bamboo-agent/.agent_tmp/TRUNK-OC2-JOB1/appdir-for-unit-tests-7327699441434999823/complex_obs/file1.jpg (No such file or directory)
29-Oct-2020 15:08:32         at java.io.RandomAccessFile.open0(Native Method)
29-Oct-2020 15:08:32         at java.io.RandomAccessFile.open(RandomAccessFile.java:316)
29-Oct-2020 15:08:32         at java.io.RandomAccessFile.<init>(RandomAccessFile.java:243)
29-Oct-2020 15:08:32         at javax.imageio.stream.FileImageInputStream.<init>(FileImageInputStream.java:73)
29-Oct-2020 15:08:32         at org.openmrs.obs.handler.ImageHandler.getObs(ImageHandler.java:86)
29-Oct-2020 15:08:32         at org.openmrs.api.impl.ObsServiceImpl.getObs(ObsServiceImpl.java:254)
29-Oct-2020 15:08:32         at sun.reflect.GeneratedMethodAccessor774.invoke(Unknown Source)
29-Oct-2020 15:08:32         at sun.reflect.DelegatingMethodAccessorImpl.invoke(DelegatingMethodAccessorImpl.java:43)
29-Oct-2020 15:08:32         at java.lang.reflect.Method.invoke(Method.java:498)
29-Oct-2020 15:08:32         at org.springframework.aop.support.AopUtils.invokeJoinpointUsingReflection(AopUtils.java:317)
29-Oct-2020 15:08:32         at org.springframework.aop.framework.ReflectiveMethodInvocation.invokeJoinpoint(ReflectiveMethodInvocation.java:190)
29-Oct-2020 15:08:32         at org.springframework.aop.framework.ReflectiveMethodInvocation.proceed(ReflectiveMethodInvocation.java:157)
29-Oct-2020 15:08:32         at org.springframework.transaction.interceptor.TransactionInterceptor$1.proceedWithInvocation(TransactionInterceptor.java:99)
29-Oct-2020 15:08:32         at org.springframework.transaction.interceptor.TransactionAspectSupport.invokeWithinTransaction(TransactionAspectSupport.java:281)
29-Oct-2020 15:08:32         at org.springframework.transaction.interceptor.TransactionInterceptor.invoke(TransactionInterceptor.java:96)
29-Oct-2020 15:08:32         at org.springframework.aop.framework.ReflectiveMethodInvocation.proceed(ReflectiveMethodInvocation.java:179)
29-Oct-2020 15:08:32         at org.springframework.aop.framework.JdkDynamicAopProxy.invoke(JdkDynamicAopProxy.java:207)
29-Oct-2020 15:08:32         at com.sun.proxy.$Proxy73.getObs(Unknown Source)
29-Oct-2020 15:08:32         at sun.reflect.GeneratedMethodAccessor774.invoke(Unknown Source)
29-Oct-2020 15:08:32         at sun.reflect.DelegatingMethodAccessorImpl.invoke(DelegatingMethodAccessorImpl.java:43)
29-Oct-2020 15:08:32         at java.lang.reflect.Method.invoke(Method.java:498)
29-Oct-2020 15:08:32         at org.springframework.aop.support.AopUtils.invokeJoinpointUsingReflection(AopUtils.java:317)
29-Oct-2020 15:08:32         at org.springframework.aop.framework.ReflectiveMethodInvocation.invokeJoinpoint(ReflectiveMethodInvocation.java:190)
29-Oct-2020 15:08:32         at org.springframework.aop.framework.ReflectiveMethodInvocation.proceed(ReflectiveMethodInvocation.java:157)
29-Oct-2020 15:08:32         at org.openmrs.aop.LoggingAdvice.invoke(LoggingAdvice.java:121)
29-Oct-2020 15:08:32         at org.springframework.aop.framework.ReflectiveMethodInvocation.proceed(ReflectiveMethodInvocation.java:179)
29-Oct-2020 15:08:32         at org.springframework.aop.framework.adapter.MethodBeforeAdviceInterceptor.invoke(MethodBeforeAdviceInterceptor.java:52)
29-Oct-2020 15:08:32         at org.springframework.aop.framework.ReflectiveMethodInvocation.proceed(ReflectiveMethodInvocation.java:179)
29-Oct-2020 15:08:32         at org.springframework.aop.framework.adapter.MethodBeforeAdviceInterceptor.invoke(MethodBeforeAdviceInterceptor.java:52)
29-Oct-2020 15:08:32         at org.springframework.aop.framework.ReflectiveMethodInvocation.proceed(ReflectiveMethodInvocation.java:179)
29-Oct-2020 15:08:32         at org.springframework.aop.framework.JdkDynamicAopProxy.invoke(JdkDynamicAopProxy.java:207)
29-Oct-2020 15:08:32         at com.sun.proxy.$Proxy74.getObs(Unknown Source)
29-Oct-2020 15:08:32         at org.openmrs.api.impl.EncounterServiceImpl.saveEncounter(EncounterServiceImpl.java:214)
29-Oct-2020 15:08:32         at sun.reflect.GeneratedMethodAccessor1144.invoke(Unknown Source)
29-Oct-2020 15:08:32         at sun.reflect.DelegatingMethodAccessorImpl.invoke(DelegatingMethodAccessorImpl.java:43)
29-Oct-2020 15:08:32         at java.lang.reflect.Method.invoke(Method.java:498)
29-Oct-2020 15:08:32         at org.springframework.aop.support.AopUtils.invokeJoinpointUsingReflection(AopUtils.java:317)
29-Oct-2020 15:08:32         at org.springframework.aop.framework.ReflectiveMethodInvocation.invokeJoinpoint(ReflectiveMethodInvocation.java:190)
29-Oct-2020 15:08:32         at org.springframework.aop.framework.ReflectiveMethodInvocation.proceed(ReflectiveMethodInvocation.java:157)
29-Oct-2020 15:08:32         at org.springframework.transaction.interceptor.TransactionInterceptor$1.proceedWithInvocation(TransactionInterceptor.java:99)
29-Oct-2020 15:08:32         at org.springframework.transaction.interceptor.TransactionAspectSupport.invokeWithinTransaction(TransactionAspectSupport.java:281)
29-Oct-2020 15:08:32         at org.springframework.transaction.interceptor.TransactionInterceptor.invoke(TransactionInterceptor.java:96)
29-Oct-2020 15:08:32         at org.springframework.aop.framework.ReflectiveMethodInvocation.proceed(ReflectiveMethodInvocation.java:179)
29-Oct-2020 15:08:32         at org.springframework.aop.framework.JdkDynamicAopProxy.invoke(JdkDynamicAopProxy.java:207)
29-Oct-2020 15:08:32         at com.sun.proxy.$Proxy75.saveEncounter(Unknown Source)
29-Oct-2020 15:08:32         at sun.reflect.GeneratedMethodAccessor1144.invoke(Unknown Source)
29-Oct-2020 15:08:32         at sun.reflect.DelegatingMethodAccessorImpl.invoke(DelegatingMethodAccessorImpl.java:43)
29-Oct-2020 15:08:32         at java.lang.reflect.Method.invoke(Method.java:498)
29-Oct-2020 15:08:32         at org.springframework.aop.support.AopUtils.invokeJoinpointUsingReflection(AopUtils.java:317)
29-Oct-2020 15:08:32         at org.springframework.aop.framework.ReflectiveMethodInvocation.invokeJoinpoint(ReflectiveMethodInvocation.java:190)
29-Oct-2020 15:08:32         at org.springframework.aop.framework.ReflectiveMethodInvocation.proceed(ReflectiveMethodInvocation.java:157)
29-Oct-2020 15:08:32         at org.openmrs.aop.LoggingAdvice.invoke(LoggingAdvice.java:121)
29-Oct-2020 15:08:32         at org.springframework.aop.framework.ReflectiveMethodInvocation.proceed(ReflectiveMethodInvocation.java:179)
29-Oct-2020 15:08:32         at org.springframework.aop.framework.adapter.MethodBeforeAdviceInterceptor.invoke(MethodBeforeAdviceInterceptor.java:52)
29-Oct-2020 15:08:32         at org.springframework.aop.framework.ReflectiveMethodInvocation.proceed(ReflectiveMethodInvocation.java:179)
29-Oct-2020 15:08:32         at org.springframework.aop.framework.adapter.MethodBeforeAdviceInterceptor.invoke(MethodBeforeAdviceInterceptor.java:52)
29-Oct-2020 15:08:32         at org.springframework.aop.framework.ReflectiveMethodInvocation.proceed(ReflectiveMethodInvocation.java:179)
29-Oct-2020 15:08:32         at org.springframework.aop.framework.JdkDynamicAopProxy.invoke(JdkDynamicAopProxy.java:207)
29-Oct-2020 15:08:32         at com.sun.proxy.$Proxy76.saveEncounter(Unknown Source)
29-Oct-2020 15:08:32         at org.openmrs.api.EncounterServiceTest.saveEncounter_shouldSaveEncounterWithComplexObs(EncounterServiceTest.java:385)
29-Oct-2020 15:08:32         at sun.reflect.NativeMethodAccessorImpl.invoke0(Native Method)
29-Oct-2020 15:08:32         at sun.reflect.NativeMethodAccessorImpl.invoke(NativeMethodAccessorImpl.java:62)
29-Oct-2020 15:08:32         at sun.reflect.DelegatingMethodAccessorImpl.invoke(DelegatingMethodAccessorImpl.java:43)
29-Oct-2020 15:08:32         at java.lang.reflect.Method.invoke(Method.java:498)
29-Oct-2020 15:08:32         at org.junit.runners.model.FrameworkMethod$1.runReflectiveCall(FrameworkMethod.java:47)
29-Oct-2020 15:08:32         at org.junit.internal.runners.model.ReflectiveCallable.run(ReflectiveCallable.java:12)
29-Oct-2020 15:08:32         at org.junit.runners.model.FrameworkMethod.invokeExplosively(FrameworkMethod.java:44)
29-Oct-2020 15:08:32         at org.junit.internal.runners.statements.InvokeMethod.evaluate(InvokeMethod.java:17)
29-Oct-2020 15:08:32         at org.junit.internal.runners.statements.RunBefores.evaluate(RunBefores.java:26)
29-Oct-2020 15:08:32         at org.springframework.test.context.junit4.statements.RunBeforeTestMethodCallbacks.evaluate(RunBeforeTestMethodCallbacks.java:73)
29-Oct-2020 15:08:32         at org.junit.internal.runners.statements.RunAfters.evaluate(RunAfters.java:27)
29-Oct-2020 15:08:32         at org.springframework.test.context.junit4.statements.RunAfterTestMethodCallbacks.evaluate(RunAfterTestMethodCallbacks.java:82)
29-Oct-2020 15:08:32         at org.springframework.test.context.junit4.statements.SpringRepeat.evaluate(SpringRepeat.java:73)
29-Oct-2020 15:08:32         at org.junit.runners.ParentRunner.runLeaf(ParentRunner.java:271)
29-Oct-2020 15:08:32         at org.springframework.test.context.junit4.SpringJUnit4ClassRunner.runChild(SpringJUnit4ClassRunner.java:217)
29-Oct-2020 15:08:32         at org.springframework.test.context.junit4.SpringJUnit4ClassRunner.runChild(SpringJUnit4ClassRunner.java:83)
29-Oct-2020 15:08:32         at org.junit.runners.ParentRunner$3.run(ParentRunner.java:238)
29-Oct-2020 15:08:32         at org.junit.runners.ParentRunner$1.schedule(ParentRunner.java:63)
29-Oct-2020 15:08:32         at org.junit.runners.ParentRunner.runChildren(ParentRunner.java:236)
29-Oct-2020 15:08:32         at org.junit.runners.ParentRunner.access$000(ParentRunner.java:53)
29-Oct-2020 15:08:32         at org.junit.runners.ParentRunner$2.evaluate(ParentRunner.java:229)
29-Oct-2020 15:08:32         at org.springframework.test.context.junit4.statements.RunBeforeTestClassCallbacks.evaluate(RunBeforeTestClassCallbacks.java:61)
29-Oct-2020 15:08:32         at org.junit.internal.runners.statements.RunAfters.evaluate(RunAfters.java:27)
29-Oct-2020 15:08:32         at org.springframework.test.context.junit4.statements.RunAfterTestClassCallbacks.evaluate(RunAfterTestClassCallbacks.java:68)
29-Oct-2020 15:08:32         at org.junit.runners.ParentRunner.run(ParentRunner.java:309)
29-Oct-2020 15:08:32         at org.springframework.test.context.junit4.SpringJUnit4ClassRunner.run(SpringJUnit4ClassRunner.java:163)
29-Oct-2020 15:08:32         at org.apache.maven.surefire.junit4.JUnit4Provider.execute(JUnit4Provider.java:283)
29-Oct-2020 15:08:32         at org.apache.maven.surefire.junit4.JUnit4Provider.executeWithRerun(JUnit4Provider.java:173)
29-Oct-2020 15:08:32         at org.apache.maven.surefire.junit4.JUnit4Provider.executeTestSet(JUnit4Provider.java:153)
29-Oct-2020 15:08:32         at org.apache.maven.surefire.junit4.JUnit4Provider.invoke(JUnit4Provider.java:128)
29-Oct-2020 15:08:32         at org.apache.maven.surefire.booter.ForkedBooter.invokeProviderInSameClassLoader(ForkedBooter.java:203)
29-Oct-2020 15:08:32         at org.apache.maven.surefire.booter.ForkedBooter.runSuitesInProcess(ForkedBooter.java:155)
29-Oct-2020 15:08:32         at org.apache.maven.surefire.booter.ForkedBooter.main(ForkedBooter.java:103)
29-Oct-2020 15:08:37 Tests run: 141, Failures: 0, Errors: 0, Skipped: 2, Time elapsed: 5.058 sec - in org.openmrs.api.EncounterServiceTest
29-Oct-2020 15:08:37 Running org.openmrs.api.NoteServiceTest
29-Oct-2020 15:08:37 Tests run: 1, Failures: 0, Errors: 0, Skipped: 1, Time elapsed: 0 sec - in org.openmrs.api.NoteServiceTest
29-Oct-2020 15:08:37 Running org.openmrs.api.impl.SerializationServiceImplTest
29-Oct-2020 15:08:37 Tests run: 1, Failures: 0, Errors: 0, Skipped: 0, Time elapsed: 0.001 sec - in org.openmrs.api.impl.SerializationServiceImplTest
29-Oct-2020 15:08:37 Running org.openmrs.api.impl.ConceptServiceImplTest
29-Oct-2020 15:08:37 Tests run: 8, Failures: 0, Errors: 0, Skipped: 0, Time elapsed: 0.333 sec - in org.openmrs.api.impl.ConceptServiceImplTest
29-Oct-2020 15:08:37 Running org.openmrs.api.ProgramWorkflowServiceTest
29-Oct-2020 15:08:38 Tests run: 25, Failures: 0, Errors: 0, Skipped: 0, Time elapsed: 0.78 sec - in org.openmrs.api.ProgramWorkflowServiceTest
29-Oct-2020 15:08:38 Running org.openmrs.api.CohortServiceTest
29-Oct-2020 15:08:38 Tests run: 24, Failures: 0, Errors: 0, Skipped: 0, Time elapsed: 0.5 sec - in org.openmrs.api.CohortServiceTest
29-Oct-2020 15:08:38 Running org.openmrs.api.db.VisitDAOTest
29-Oct-2020 15:08:39 Tests run: 3, Failures: 0, Errors: 0, Skipped: 0, Time elapsed: 0.302 sec - in org.openmrs.api.db.VisitDAOTest
29-Oct-2020 15:08:39 Running org.openmrs.api.db.hibernate.ImmutableEntityInterceptorTest
29-Oct-2020 15:08:39 Tests run: 4, Failures: 0, Errors: 0, Skipped: 0, Time elapsed: 0.227 sec - in org.openmrs.api.db.hibernate.ImmutableEntityInterceptorTest
29-Oct-2020 15:08:39 Running org.openmrs.api.db.hibernate.HibernatePersonDAOTest
29-Oct-2020 15:08:40 Tests run: 41, Failures: 0, Errors: 0, Skipped: 0, Time elapsed: 0.803 sec - in org.openmrs.api.db.hibernate.HibernatePersonDAOTest
29-Oct-2020 15:08:40 Running org.openmrs.api.db.hibernate.DropMillisecondsHibernateInterceptorTest
29-Oct-2020 15:08:40 Tests run: 4, Failures: 0, Errors: 0, Skipped: 0, Time elapsed: 0.296 sec - in org.openmrs.api.db.hibernate.DropMillisecondsHibernateInterceptorTest
29-Oct-2020 15:08:40 Running org.openmrs.api.db.hibernate.ProviderDAOTest
29-Oct-2020 15:08:40 Tests run: 3, Failures: 0, Errors: 0, Skipped: 0, Time elapsed: 0.312 sec - in org.openmrs.api.db.hibernate.ProviderDAOTest
29-Oct-2020 15:08:40 Running org.openmrs.api.db.hibernate.HibernateConceptDAOTest
29-Oct-2020 15:08:42 Tests run: 11, Failures: 0, Errors: 0, Skipped: 0, Time elapsed: 1.4 sec - in org.openmrs.api.db.hibernate.HibernateConceptDAOTest
29-Oct-2020 15:08:42 Running org.openmrs.api.db.hibernate.HibernateLocationDAOTest
29-Oct-2020 15:08:42 Tests run: 3, Failures: 0, Errors: 0, Skipped: 0, Time elapsed: 0.372 sec - in org.openmrs.api.db.hibernate.HibernateLocationDAOTest
29-Oct-2020 15:08:42 Running org.openmrs.api.db.hibernate.HibernateProviderDAOTest
29-Oct-2020 15:08:42 Tests run: 3, Failures: 0, Errors: 0, Skipped: 0, Time elapsed: 0.368 sec - in org.openmrs.api.db.hibernate.HibernateProviderDAOTest
29-Oct-2020 15:08:42 Running org.openmrs.api.db.hibernate.PersonAttributeHelperTest
29-Oct-2020 15:08:43 Tests run: 5, Failures: 0, Errors: 0, Skipped: 0, Time elapsed: 0.46 sec - in org.openmrs.api.db.hibernate.PersonAttributeHelperTest
29-Oct-2020 15:08:43 Running org.openmrs.api.db.hibernate.HibernateOrderDAOTest
29-Oct-2020 15:08:43 Tests run: 1, Failures: 0, Errors: 0, Skipped: 0, Time elapsed: 0.317 sec - in org.openmrs.api.db.hibernate.HibernateOrderDAOTest
29-Oct-2020 15:08:43 Running org.openmrs.api.db.hibernate.PatientSearchCriteriaTest
29-Oct-2020 15:08:44 Tests run: 18, Failures: 0, Errors: 0, Skipped: 0, Time elapsed: 0.334 sec - in org.openmrs.api.db.hibernate.PatientSearchCriteriaTest
29-Oct-2020 15:08:44 Running org.openmrs.api.db.hibernate.HibernateObsDAOTest
29-Oct-2020 15:08:44 Tests run: 1, Failures: 0, Errors: 0, Skipped: 0, Time elapsed: 0.222 sec - in org.openmrs.api.db.hibernate.HibernateObsDAOTest
29-Oct-2020 15:08:44 Running org.openmrs.api.db.hibernate.AuditableInterceptorTest
29-Oct-2020 15:08:44 Tests run: 15, Failures: 0, Errors: 0, Skipped: 0, Time elapsed: 0.338 sec - in org.openmrs.api.db.hibernate.AuditableInterceptorTest
29-Oct-2020 15:08:44 Running org.openmrs.api.db.EncounterDAOTest
29-Oct-2020 15:08:44 Tests run: 4, Failures: 0, Errors: 0, Skipped: 0, Time elapsed: 0.396 sec - in org.openmrs.api.db.EncounterDAOTest
29-Oct-2020 15:08:44 Running org.openmrs.api.db.PatientDAOTest
29-Oct-2020 15:08:47 WARN - HibernatePatientDAO.getDuplicatePatientsSQLString(556) |2020-10-29 15:08:47,691| Unidentified attribute: abcDef
29-Oct-2020 15:08:51 WARN - HibernatePatientDAO.getDuplicatePatientsSQLString(556) |2020-10-29 15:08:51,443| Unidentified attribute: abcDef
29-Oct-2020 15:08:51 Tests run: 141, Failures: 0, Errors: 0, Skipped: 0, Time elapsed: 6.815 sec - in org.openmrs.api.db.PatientDAOTest
29-Oct-2020 15:08:51 Running org.openmrs.api.db.SerializedObjectDAOTest
29-Oct-2020 15:08:51 Tests run: 1, Failures: 0, Errors: 0, Skipped: 1, Time elapsed: 0 sec - in org.openmrs.api.db.SerializedObjectDAOTest
29-Oct-2020 15:08:51 Running org.openmrs.api.db.ProgramWorkflowDAOTest
29-Oct-2020 15:08:52 Tests run: 4, Failures: 0, Errors: 0, Skipped: 0, Time elapsed: 0.331 sec - in org.openmrs.api.db.ProgramWorkflowDAOTest
29-Oct-2020 15:08:52 Running org.openmrs.api.db.ConceptDAOTest
29-Oct-2020 15:08:52 Tests run: 13, Failures: 0, Errors: 0, Skipped: 2, Time elapsed: 0.444 sec - in org.openmrs.api.db.ConceptDAOTest
29-Oct-2020 15:08:52 Running org.openmrs.api.db.ContextDAOTest
29-Oct-2020 15:08:52 ERROR - HibernateContextDAO.authenticate(184) |2020-10-29 15:08:52,802| Unable to convert the global property security.allowedFailedLoginsBeforeLockoutto a valid integer. Using default value of 7
29-Oct-2020 15:08:52 ERROR - HibernateContextDAO.authenticate(184) |2020-10-29 15:08:52,820| Unable to convert the global property security.allowedFailedLoginsBeforeLockoutto a valid integer. Using default value of 7
29-Oct-2020 15:08:52 ERROR - HibernateContextDAO.authenticate(184) |2020-10-29 15:08:52,823| Unable to convert the global property security.allowedFailedLoginsBeforeLockoutto a valid integer. Using default value of 7
29-Oct-2020 15:08:52 ERROR - HibernateContextDAO.authenticate(184) |2020-10-29 15:08:52,824| Unable to convert the global property security.allowedFailedLoginsBeforeLockoutto a valid integer. Using default value of 7
29-Oct-2020 15:08:52 ERROR - HibernateContextDAO.authenticate(184) |2020-10-29 15:08:52,826| Unable to convert the global property security.allowedFailedLoginsBeforeLockoutto a valid integer. Using default value of 7
29-Oct-2020 15:08:52 ERROR - HibernateContextDAO.authenticate(184) |2020-10-29 15:08:52,828| Unable to convert the global property security.allowedFailedLoginsBeforeLockoutto a valid integer. Using default value of 7
29-Oct-2020 15:08:52 ERROR - HibernateContextDAO.authenticate(184) |2020-10-29 15:08:52,830| Unable to convert the global property security.allowedFailedLoginsBeforeLockoutto a valid integer. Using default value of 7
29-Oct-2020 15:08:52 ERROR - HibernateContextDAO.authenticate(184) |2020-10-29 15:08:52,832| Unable to convert the global property security.allowedFailedLoginsBeforeLockoutto a valid integer. Using default value of 7
29-Oct-2020 15:08:52 ERROR - HibernateContextDAO.authenticate(184) |2020-10-29 15:08:52,834| Unable to convert the global property security.allowedFailedLoginsBeforeLockoutto a valid integer. Using default value of 7
29-Oct-2020 15:08:52 ERROR - HibernateContextDAO.authenticate(184) |2020-10-29 15:08:52,836| Unable to convert the global property security.allowedFailedLoginsBeforeLockoutto a valid integer. Using default value of 7
29-Oct-2020 15:08:52 ERROR - HibernateContextDAO.authenticate(184) |2020-10-29 15:08:52,849| Unable to convert the global property security.allowedFailedLoginsBeforeLockoutto a valid integer. Using default value of 7
29-Oct-2020 15:08:52 ERROR - HibernateContextDAO.authenticate(184) |2020-10-29 15:08:52,862| Unable to convert the global property security.allowedFailedLoginsBeforeLockoutto a valid integer. Using default value of 7
29-Oct-2020 15:08:52 ERROR - HibernateContextDAO.authenticate(184) |2020-10-29 15:08:52,909| Unable to convert the global property security.allowedFailedLoginsBeforeLockoutto a valid integer. Using default value of 7
29-Oct-2020 15:08:52 ERROR - HibernateContextDAO.authenticate(184) |2020-10-29 15:08:52,911| Unable to convert the global property security.allowedFailedLoginsBeforeLockoutto a valid integer. Using default value of 7
29-Oct-2020 15:08:52 ERROR - HibernateContextDAO.authenticate(184) |2020-10-29 15:08:52,913| Unable to convert the global property security.allowedFailedLoginsBeforeLockoutto a valid integer. Using default value of 7
29-Oct-2020 15:08:52 ERROR - HibernateContextDAO.authenticate(184) |2020-10-29 15:08:52,914| Unable to convert the global property security.allowedFailedLoginsBeforeLockoutto a valid integer. Using default value of 7
29-Oct-2020 15:08:52 ERROR - HibernateContextDAO.authenticate(184) |2020-10-29 15:08:52,915| Unable to convert the global property security.allowedFailedLoginsBeforeLockoutto a valid integer. Using default value of 7
29-Oct-2020 15:08:52 ERROR - HibernateContextDAO.authenticate(184) |2020-10-29 15:08:52,916| Unable to convert the global property security.allowedFailedLoginsBeforeLockoutto a valid integer. Using default value of 7
29-Oct-2020 15:08:52 ERROR - HibernateContextDAO.authenticate(184) |2020-10-29 15:08:52,918| Unable to convert the global property security.allowedFailedLoginsBeforeLockoutto a valid integer. Using default value of 7
29-Oct-2020 15:08:52 ERROR - HibernateContextDAO.authenticate(184) |2020-10-29 15:08:52,926| Unable to convert the global property security.allowedFailedLoginsBeforeLockoutto a valid integer. Using default value of 7
29-Oct-2020 15:08:52 ERROR - HibernateContextDAO.authenticate(184) |2020-10-29 15:08:52,934| Unable to convert the global property security.allowedFailedLoginsBeforeLockoutto a valid integer. Using default value of 7
29-Oct-2020 15:08:53 Tests run: 21, Failures: 0, Errors: 0, Skipped: 0, Time elapsed: 0.509 sec - in org.openmrs.api.db.ContextDAOTest
29-Oct-2020 15:08:53 Running org.openmrs.api.db.PersonDAOTest
29-Oct-2020 15:08:53 Tests run: 3, Failures: 0, Errors: 0, Skipped: 0, Time elapsed: 0.292 sec - in org.openmrs.api.db.PersonDAOTest
29-Oct-2020 15:08:53 Running org.openmrs.api.db.UserDAOTest
29-Oct-2020 15:08:53 Tests run: 8, Failures: 0, Errors: 0, Skipped: 0, Time elapsed: 0.377 sec - in org.openmrs.api.db.UserDAOTest
29-Oct-2020 15:08:53 Running org.openmrs.api.OrderServiceTest
29-Oct-2020 15:08:56 Tests run: 169, Failures: 0, Errors: 0, Skipped: 3, Time elapsed: 2.269 sec - in org.openmrs.api.OrderServiceTest
29-Oct-2020 15:08:56 Running org.openmrs.api.PatientServiceTest
29-Oct-2020 15:09:02 Tests run: 163, Failures: 0, Errors: 0, Skipped: 2, Time elapsed: 6.225 sec - in org.openmrs.api.PatientServiceTest
29-Oct-2020 15:09:02 Running org.openmrs.api.OpenmrsServiceTest
29-Oct-2020 15:09:02 Tests run: 1, Failures: 0, Errors: 0, Skipped: 1, Time elapsed: 0.001 sec - in org.openmrs.api.OpenmrsServiceTest
29-Oct-2020 15:09:02 Running org.openmrs.api.handler.RequiredReasonVoidSaveHandlerTest
29-Oct-2020 15:09:02 Tests run: 5, Failures: 0, Errors: 0, Skipped: 0, Time elapsed: 0.419 sec - in org.openmrs.api.handler.RequiredReasonVoidSaveHandlerTest
29-Oct-2020 15:09:02 Running org.openmrs.api.handler.PersonVoidHandlerTest
29-Oct-2020 15:09:03 Tests run: 8, Failures: 0, Errors: 0, Skipped: 0, Time elapsed: 0.332 sec - in org.openmrs.api.handler.PersonVoidHandlerTest
29-Oct-2020 15:09:03 Running org.openmrs.api.handler.OpenmrsMetadataSaveHandlerTest
29-Oct-2020 15:09:03 Tests run: 2, Failures: 0, Errors: 0, Skipped: 0, Time elapsed: 0 sec - in org.openmrs.api.handler.OpenmrsMetadataSaveHandlerTest
29-Oct-2020 15:09:03 Running org.openmrs.api.handler.BaseUnretireHandlerTest
29-Oct-2020 15:09:03 Tests run: 6, Failures: 0, Errors: 0, Skipped: 0, Time elapsed: 0 sec - in org.openmrs.api.handler.BaseUnretireHandlerTest
29-Oct-2020 15:09:03 Running org.openmrs.api.handler.ExistingVisitAssignmentHandlerTest
29-Oct-2020 15:09:03 Tests run: 3, Failures: 0, Errors: 0, Skipped: 0, Time elapsed: 0.321 sec - in org.openmrs.api.handler.ExistingVisitAssignmentHandlerTest
29-Oct-2020 15:09:03 Running org.openmrs.api.handler.RequireVoidReasonVoidHandlerTest
29-Oct-2020 15:09:03 Tests run: 5, Failures: 0, Errors: 0, Skipped: 0, Time elapsed: 0.233 sec - in org.openmrs.api.handler.RequireVoidReasonVoidHandlerTest
29-Oct-2020 15:09:03 Running org.openmrs.api.handler.OpenmrsObjectSaveHandlerTest
29-Oct-2020 15:09:03 Tests run: 5, Failures: 0, Errors: 0, Skipped: 0, Time elapsed: 0.004 sec - in org.openmrs.api.handler.OpenmrsObjectSaveHandlerTest
29-Oct-2020 15:09:03 Running org.openmrs.api.handler.ConceptNameSaveHandlerTest
29-Oct-2020 15:09:03 Tests run: 4, Failures: 0, Errors: 0, Skipped: 0, Time elapsed: 0.269 sec - in org.openmrs.api.handler.ConceptNameSaveHandlerTest
29-Oct-2020 15:09:03 Running org.openmrs.api.handler.PatientDataVoidHandlerTest
29-Oct-2020 15:09:04 Tests run: 1, Failures: 0, Errors: 0, Skipped: 0, Time elapsed: 0.326 sec - in org.openmrs.api.handler.PatientDataVoidHandlerTest
29-Oct-2020 15:09:04 Running org.openmrs.api.handler.BaseVoidHandlerTest
29-Oct-2020 15:09:04 Tests run: 8, Failures: 0, Errors: 0, Skipped: 0, Time elapsed: 0 sec - in org.openmrs.api.handler.BaseVoidHandlerTest
29-Oct-2020 15:09:04 Running org.openmrs.api.handler.BaseRetireHandlerTest
29-Oct-2020 15:09:04 Tests run: 8, Failures: 0, Errors: 0, Skipped: 0, Time elapsed: 0.002 sec - in org.openmrs.api.handler.BaseRetireHandlerTest
29-Oct-2020 15:09:04 Running org.openmrs.api.handler.ExistingOrNewVisitAssignmentHandlerTest
29-Oct-2020 15:09:04 Tests run: 5, Failures: 0, Errors: 0, Skipped: 0, Time elapsed: 0.479 sec - in org.openmrs.api.handler.ExistingOrNewVisitAssignmentHandlerTest
29-Oct-2020 15:09:04 Running org.openmrs.api.handler.PatientDataUnvoidHandlerTest
29-Oct-2020 15:09:06 Tests run: 2, Failures: 0, Errors: 0, Skipped: 0, Time elapsed: 1.674 sec - in org.openmrs.api.handler.PatientDataUnvoidHandlerTest
29-Oct-2020 15:09:06 Running org.openmrs.api.handler.BaseUnvoidHandlerTest
29-Oct-2020 15:09:06 Tests run: 6, Failures: 0, Errors: 0, Skipped: 0, Time elapsed: 0.007 sec - in org.openmrs.api.handler.BaseUnvoidHandlerTest
29-Oct-2020 15:09:06 Running org.openmrs.api.handler.PersonUnvoidHandlerTest
29-Oct-2020 15:09:06 Tests run: 6, Failures: 0, Errors: 0, Skipped: 0, Time elapsed: 0 sec - in org.openmrs.api.handler.PersonUnvoidHandlerTest
29-Oct-2020 15:09:06 Running org.openmrs.api.UserServiceTest
29-Oct-2020 15:09:09 Tests run: 85, Failures: 0, Errors: 0, Skipped: 1, Time elapsed: 3.045 sec - in org.openmrs.api.UserServiceTest
29-Oct-2020 15:09:09 Running org.openmrs.api.context.ContextTest
29-Oct-2020 15:09:09 Tests run: 16, Failures: 0, Errors: 0, Skipped: 0, Time elapsed: 0.391 sec - in org.openmrs.api.context.ContextTest
29-Oct-2020 15:09:09 Running org.openmrs.api.context.ContextWithModuleTest
29-Oct-2020 15:09:10 Tests run: 1, Failures: 0, Errors: 0, Skipped: 0, Time elapsed: 0.392 sec - in org.openmrs.api.context.ContextWithModuleTest
29-Oct-2020 15:09:10 Running org.openmrs.api.context.DaemonTest
29-Oct-2020 15:09:10 Tests run: 7, Failures: 0, Errors: 0, Skipped: 0, Time elapsed: 0.348 sec - in org.openmrs.api.context.DaemonTest
29-Oct-2020 15:09:10 Running org.openmrs.api.ObsServiceTest
29-Oct-2020 15:09:11 ERROR - ImageHandler.getObs(79) |2020-10-29 15:09:11,545| Trying to read file: /home/bamboo-agent/bamboo-agent/.agent_tmp/TRUNK-OC2-JOB1/appdir-for-unit-tests-994241581432931744/complex_obs/openmrs_logo_small.gif
29-Oct-2020 15:09:11 javax.imageio.IIOException: Can't read input file!
29-Oct-2020 15:09:11         at javax.imageio.ImageIO.read(ImageIO.java:1302)
29-Oct-2020 15:09:11         at org.openmrs.obs.handler.ImageHandler.getObs(ImageHandler.java:76)
29-Oct-2020 15:09:11         at org.openmrs.api.impl.ObsServiceImpl.getComplexObs(ObsServiceImpl.java:480)
29-Oct-2020 15:09:11         at sun.reflect.NativeMethodAccessorImpl.invoke0(Native Method)
29-Oct-2020 15:09:11         at sun.reflect.NativeMethodAccessorImpl.invoke(NativeMethodAccessorImpl.java:62)
29-Oct-2020 15:09:11         at sun.reflect.DelegatingMethodAccessorImpl.invoke(DelegatingMethodAccessorImpl.java:43)
29-Oct-2020 15:09:11         at java.lang.reflect.Method.invoke(Method.java:498)
29-Oct-2020 15:09:11         at org.springframework.aop.support.AopUtils.invokeJoinpointUsingReflection(AopUtils.java:317)
29-Oct-2020 15:09:11         at org.springframework.aop.framework.ReflectiveMethodInvocation.invokeJoinpoint(ReflectiveMethodInvocation.java:190)
29-Oct-2020 15:09:11         at org.springframework.aop.framework.ReflectiveMethodInvocation.proceed(ReflectiveMethodInvocation.java:157)
29-Oct-2020 15:09:11         at org.springframework.transaction.interceptor.TransactionInterceptor$1.proceedWithInvocation(TransactionInterceptor.java:99)
29-Oct-2020 15:09:11         at org.springframework.transaction.interceptor.TransactionAspectSupport.invokeWithinTransaction(TransactionAspectSupport.java:281)
29-Oct-2020 15:09:11         at org.springframework.transaction.interceptor.TransactionInterceptor.invoke(TransactionInterceptor.java:96)
29-Oct-2020 15:09:11         at org.springframework.aop.framework.ReflectiveMethodInvocation.proceed(ReflectiveMethodInvocation.java:179)
29-Oct-2020 15:09:11         at org.springframework.aop.framework.JdkDynamicAopProxy.invoke(JdkDynamicAopProxy.java:207)
29-Oct-2020 15:09:11         at com.sun.proxy.$Proxy73.getComplexObs(Unknown Source)
29-Oct-2020 15:09:11         at sun.reflect.NativeMethodAccessorImpl.invoke0(Native Method)
29-Oct-2020 15:09:11         at sun.reflect.NativeMethodAccessorImpl.invoke(NativeMethodAccessorImpl.java:62)
29-Oct-2020 15:09:11         at sun.reflect.DelegatingMethodAccessorImpl.invoke(DelegatingMethodAccessorImpl.java:43)
29-Oct-2020 15:09:11         at java.lang.reflect.Method.invoke(Method.java:498)
29-Oct-2020 15:09:11         at org.springframework.aop.support.AopUtils.invokeJoinpointUsingReflection(AopUtils.java:317)
29-Oct-2020 15:09:11         at org.springframework.aop.framework.ReflectiveMethodInvocation.invokeJoinpoint(ReflectiveMethodInvocation.java:190)
29-Oct-2020 15:09:11         at org.springframework.aop.framework.ReflectiveMethodInvocation.proceed(ReflectiveMethodInvocation.java:157)
29-Oct-2020 15:09:11         at org.openmrs.aop.LoggingAdvice.invoke(LoggingAdvice.java:121)
29-Oct-2020 15:09:11         at org.springframework.aop.framework.ReflectiveMethodInvocation.proceed(ReflectiveMethodInvocation.java:179)
29-Oct-2020 15:09:11         at org.springframework.aop.framework.adapter.MethodBeforeAdviceInterceptor.invoke(MethodBeforeAdviceInterceptor.java:52)
29-Oct-2020 15:09:11         at org.springframework.aop.framework.ReflectiveMethodInvocation.proceed(ReflectiveMethodInvocation.java:179)
29-Oct-2020 15:09:11         at org.springframework.aop.framework.adapter.MethodBeforeAdviceInterceptor.invoke(MethodBeforeAdviceInterceptor.java:52)
29-Oct-2020 15:09:11         at org.springframework.aop.framework.ReflectiveMethodInvocation.proceed(ReflectiveMethodInvocation.java:179)
29-Oct-2020 15:09:11         at org.springframework.aop.framework.JdkDynamicAopProxy.invoke(JdkDynamicAopProxy.java:207)
29-Oct-2020 15:09:11         at com.sun.proxy.$Proxy74.getComplexObs(Unknown Source)
29-Oct-2020 15:09:11         at org.openmrs.api.ObsServiceTest.purgeObs_shouldDeleteTheGivenObsFromTheDatabase(ObsServiceTest.java:1353)
29-Oct-2020 15:09:11         at sun.reflect.NativeMethodAccessorImpl.invoke0(Native Method)
29-Oct-2020 15:09:11         at sun.reflect.NativeMethodAccessorImpl.invoke(NativeMethodAccessorImpl.java:62)
29-Oct-2020 15:09:11         at sun.reflect.DelegatingMethodAccessorImpl.invoke(DelegatingMethodAccessorImpl.java:43)
29-Oct-2020 15:09:11         at java.lang.reflect.Method.invoke(Method.java:498)
29-Oct-2020 15:09:11         at org.junit.runners.model.FrameworkMethod$1.runReflectiveCall(FrameworkMethod.java:47)
29-Oct-2020 15:09:11         at org.junit.internal.runners.model.ReflectiveCallable.run(ReflectiveCallable.java:12)
29-Oct-2020 15:09:11         at org.junit.runners.model.FrameworkMethod.invokeExplosively(FrameworkMethod.java:44)
29-Oct-2020 15:09:11         at org.junit.internal.runners.statements.InvokeMethod.evaluate(InvokeMethod.java:17)
29-Oct-2020 15:09:11         at org.junit.internal.runners.statements.RunBefores.evaluate(RunBefores.java:26)
29-Oct-2020 15:09:11         at org.springframework.test.context.junit4.statements.RunBeforeTestMethodCallbacks.evaluate(RunBeforeTestMethodCallbacks.java:73)
29-Oct-2020 15:09:11         at org.junit.internal.runners.statements.RunAfters.evaluate(RunAfters.java:27)
29-Oct-2020 15:09:11         at org.springframework.test.context.junit4.statements.RunAfterTestMethodCallbacks.evaluate(RunAfterTestMethodCallbacks.java:82)
29-Oct-2020 15:09:11         at org.junit.rules.ExpectedException$ExpectedExceptionStatement.evaluate(ExpectedException.java:168)
29-Oct-2020 15:09:11         at org.junit.rules.RunRules.evaluate(RunRules.java:20)
29-Oct-2020 15:09:11         at org.springframework.test.context.junit4.statements.SpringRepeat.evaluate(SpringRepeat.java:73)
29-Oct-2020 15:09:11         at org.junit.runners.ParentRunner.runLeaf(ParentRunner.java:271)
29-Oct-2020 15:09:11         at org.springframework.test.context.junit4.SpringJUnit4ClassRunner.runChild(SpringJUnit4ClassRunner.java:217)
29-Oct-2020 15:09:11         at org.springframework.test.context.junit4.SpringJUnit4ClassRunner.runChild(SpringJUnit4ClassRunner.java:83)
29-Oct-2020 15:09:11         at org.junit.runners.ParentRunner$3.run(ParentRunner.java:238)
29-Oct-2020 15:09:11         at org.junit.runners.ParentRunner$1.schedule(ParentRunner.java:63)
29-Oct-2020 15:09:11         at org.junit.runners.ParentRunner.runChildren(ParentRunner.java:236)
29-Oct-2020 15:09:11         at org.junit.runners.ParentRunner.access$000(ParentRunner.java:53)
29-Oct-2020 15:09:11         at org.junit.runners.ParentRunner$2.evaluate(ParentRunner.java:229)
29-Oct-2020 15:09:11         at org.springframework.test.context.junit4.statements.RunBeforeTestClassCallbacks.evaluate(RunBeforeTestClassCallbacks.java:61)
29-Oct-2020 15:09:11         at org.junit.internal.runners.statements.RunAfters.evaluate(RunAfters.java:27)
29-Oct-2020 15:09:11         at org.springframework.test.context.junit4.statements.RunAfterTestClassCallbacks.evaluate(RunAfterTestClassCallbacks.java:68)
29-Oct-2020 15:09:11         at org.junit.runners.ParentRunner.run(ParentRunner.java:309)
29-Oct-2020 15:09:11         at org.springframework.test.context.junit4.SpringJUnit4ClassRunner.run(SpringJUnit4ClassRunner.java:163)
29-Oct-2020 15:09:11         at org.apache.maven.surefire.junit4.JUnit4Provider.execute(JUnit4Provider.java:283)
29-Oct-2020 15:09:11         at org.apache.maven.surefire.junit4.JUnit4Provider.executeWithRerun(JUnit4Provider.java:173)
29-Oct-2020 15:09:11         at org.apache.maven.surefire.junit4.JUnit4Provider.executeTestSet(JUnit4Provider.java:153)
29-Oct-2020 15:09:11         at org.apache.maven.surefire.junit4.JUnit4Provider.invoke(JUnit4Provider.java:128)
29-Oct-2020 15:09:11         at org.apache.maven.surefire.booter.ForkedBooter.invokeProviderInSameClassLoader(ForkedBooter.java:203)
29-Oct-2020 15:09:11         at org.apache.maven.surefire.booter.ForkedBooter.runSuitesInProcess(ForkedBooter.java:155)
29-Oct-2020 15:09:11         at org.apache.maven.surefire.booter.ForkedBooter.main(ForkedBooter.java:103)
29-Oct-2020 15:09:11 ERROR - ImageHandler.getObs(96) |2020-10-29 15:09:11,548| Image /home/bamboo-agent/bamboo-agent/.agent_tmp/TRUNK-OC2-JOB1/appdir-for-unit-tests-994241581432931744/complex_obs/openmrs_logo_small.gif was not found
29-Oct-2020 15:09:11 java.io.FileNotFoundException: /home/bamboo-agent/bamboo-agent/.agent_tmp/TRUNK-OC2-JOB1/appdir-for-unit-tests-994241581432931744/complex_obs/openmrs_logo_small.gif (No such file or directory)
29-Oct-2020 15:09:11         at java.io.RandomAccessFile.open0(Native Method)
29-Oct-2020 15:09:11         at java.io.RandomAccessFile.open(RandomAccessFile.java:316)
29-Oct-2020 15:09:11         at java.io.RandomAccessFile.<init>(RandomAccessFile.java:243)
29-Oct-2020 15:09:11         at javax.imageio.stream.FileImageInputStream.<init>(FileImageInputStream.java:73)
29-Oct-2020 15:09:11         at org.openmrs.obs.handler.ImageHandler.getObs(ImageHandler.java:86)
29-Oct-2020 15:09:11         at org.openmrs.api.impl.ObsServiceImpl.getComplexObs(ObsServiceImpl.java:480)
29-Oct-2020 15:09:11         at sun.reflect.NativeMethodAccessorImpl.invoke0(Native Method)
29-Oct-2020 15:09:11         at sun.reflect.NativeMethodAccessorImpl.invoke(NativeMethodAccessorImpl.java:62)
29-Oct-2020 15:09:11         at sun.reflect.DelegatingMethodAccessorImpl.invoke(DelegatingMethodAccessorImpl.java:43)
29-Oct-2020 15:09:11         at java.lang.reflect.Method.invoke(Method.java:498)
29-Oct-2020 15:09:11         at org.springframework.aop.support.AopUtils.invokeJoinpointUsingReflection(AopUtils.java:317)
29-Oct-2020 15:09:11         at org.springframework.aop.framework.ReflectiveMethodInvocation.invokeJoinpoint(ReflectiveMethodInvocation.java:190)
29-Oct-2020 15:09:11         at org.springframework.aop.framework.ReflectiveMethodInvocation.proceed(ReflectiveMethodInvocation.java:157)
29-Oct-2020 15:09:11         at org.springframework.transaction.interceptor.TransactionInterceptor$1.proceedWithInvocation(TransactionInterceptor.java:99)
29-Oct-2020 15:09:11         at org.springframework.transaction.interceptor.TransactionAspectSupport.invokeWithinTransaction(TransactionAspectSupport.java:281)
29-Oct-2020 15:09:11         at org.springframework.transaction.interceptor.TransactionInterceptor.invoke(TransactionInterceptor.java:96)
29-Oct-2020 15:09:11         at org.springframework.aop.framework.ReflectiveMethodInvocation.proceed(ReflectiveMethodInvocation.java:179)
29-Oct-2020 15:09:11         at org.springframework.aop.framework.JdkDynamicAopProxy.invoke(JdkDynamicAopProxy.java:207)
29-Oct-2020 15:09:11         at com.sun.proxy.$Proxy73.getComplexObs(Unknown Source)
29-Oct-2020 15:09:11         at sun.reflect.NativeMethodAccessorImpl.invoke0(Native Method)
29-Oct-2020 15:09:11         at sun.reflect.NativeMethodAccessorImpl.invoke(NativeMethodAccessorImpl.java:62)
29-Oct-2020 15:09:11         at sun.reflect.DelegatingMethodAccessorImpl.invoke(DelegatingMethodAccessorImpl.java:43)
29-Oct-2020 15:09:11         at java.lang.reflect.Method.invoke(Method.java:498)
29-Oct-2020 15:09:11         at org.springframework.aop.support.AopUtils.invokeJoinpointUsingReflection(AopUtils.java:317)
29-Oct-2020 15:09:11         at org.springframework.aop.framework.ReflectiveMethodInvocation.invokeJoinpoint(ReflectiveMethodInvocation.java:190)
29-Oct-2020 15:09:11         at org.springframework.aop.framework.ReflectiveMethodInvocation.proceed(ReflectiveMethodInvocation.java:157)
29-Oct-2020 15:09:11         at org.openmrs.aop.LoggingAdvice.invoke(LoggingAdvice.java:121)
29-Oct-2020 15:09:11         at org.springframework.aop.framework.ReflectiveMethodInvocation.proceed(ReflectiveMethodInvocation.java:179)
29-Oct-2020 15:09:11         at org.springframework.aop.framework.adapter.MethodBeforeAdviceInterceptor.invoke(MethodBeforeAdviceInterceptor.java:52)
29-Oct-2020 15:09:11         at org.springframework.aop.framework.ReflectiveMethodInvocation.proceed(ReflectiveMethodInvocation.java:179)
29-Oct-2020 15:09:11         at org.springframework.aop.framework.adapter.MethodBeforeAdviceInterceptor.invoke(MethodBeforeAdviceInterceptor.java:52)
29-Oct-2020 15:09:11         at org.springframework.aop.framework.ReflectiveMethodInvocation.proceed(ReflectiveMethodInvocation.java:179)
29-Oct-2020 15:09:11         at org.springframework.aop.framework.JdkDynamicAopProxy.invoke(JdkDynamicAopProxy.java:207)
29-Oct-2020 15:09:11         at com.sun.proxy.$Proxy74.getComplexObs(Unknown Source)
29-Oct-2020 15:09:11         at org.openmrs.api.ObsServiceTest.purgeObs_shouldDeleteTheGivenObsFromTheDatabase(ObsServiceTest.java:1353)
29-Oct-2020 15:09:11         at sun.reflect.NativeMethodAccessorImpl.invoke0(Native Method)
29-Oct-2020 15:09:11         at sun.reflect.NativeMethodAccessorImpl.invoke(NativeMethodAccessorImpl.java:62)
29-Oct-2020 15:09:11         at sun.reflect.DelegatingMethodAccessorImpl.invoke(DelegatingMethodAccessorImpl.java:43)
29-Oct-2020 15:09:11         at java.lang.reflect.Method.invoke(Method.java:498)
29-Oct-2020 15:09:11         at org.junit.runners.model.FrameworkMethod$1.runReflectiveCall(FrameworkMethod.java:47)
29-Oct-2020 15:09:11         at org.junit.internal.runners.model.ReflectiveCallable.run(ReflectiveCallable.java:12)
29-Oct-2020 15:09:11         at org.junit.runners.model.FrameworkMethod.invokeExplosively(FrameworkMethod.java:44)
29-Oct-2020 15:09:11         at org.junit.internal.runners.statements.InvokeMethod.evaluate(InvokeMethod.java:17)
29-Oct-2020 15:09:11         at org.junit.internal.runners.statements.RunBefores.evaluate(RunBefores.java:26)
29-Oct-2020 15:09:11         at org.springframework.test.context.junit4.statements.RunBeforeTestMethodCallbacks.evaluate(RunBeforeTestMethodCallbacks.java:73)
29-Oct-2020 15:09:11         at org.junit.internal.runners.statements.RunAfters.evaluate(RunAfters.java:27)
29-Oct-2020 15:09:11         at org.springframework.test.context.junit4.statements.RunAfterTestMethodCallbacks.evaluate(RunAfterTestMethodCallbacks.java:82)
29-Oct-2020 15:09:11         at org.junit.rules.ExpectedException$ExpectedExceptionStatement.evaluate(ExpectedException.java:168)
29-Oct-2020 15:09:11         at org.junit.rules.RunRules.evaluate(RunRules.java:20)
29-Oct-2020 15:09:11         at org.springframework.test.context.junit4.statements.SpringRepeat.evaluate(SpringRepeat.java:73)
29-Oct-2020 15:09:11         at org.junit.runners.ParentRunner.runLeaf(ParentRunner.java:271)
29-Oct-2020 15:09:11         at org.springframework.test.context.junit4.SpringJUnit4ClassRunner.runChild(SpringJUnit4ClassRunner.java:217)
29-Oct-2020 15:09:11         at org.springframework.test.context.junit4.SpringJUnit4ClassRunner.runChild(SpringJUnit4ClassRunner.java:83)
29-Oct-2020 15:09:11         at org.junit.runners.ParentRunner$3.run(ParentRunner.java:238)
29-Oct-2020 15:09:11         at org.junit.runners.ParentRunner$1.schedule(ParentRunner.java:63)
29-Oct-2020 15:09:11         at org.junit.runners.ParentRunner.runChildren(ParentRunner.java:236)
29-Oct-2020 15:09:11         at org.junit.runners.ParentRunner.access$000(ParentRunner.java:53)
29-Oct-2020 15:09:11         at org.junit.runners.ParentRunner$2.evaluate(ParentRunner.java:229)
29-Oct-2020 15:09:11         at org.springframework.test.context.junit4.statements.RunBeforeTestClassCallbacks.evaluate(RunBeforeTestClassCallbacks.java:61)
29-Oct-2020 15:09:11         at org.junit.internal.runners.statements.RunAfters.evaluate(RunAfters.java:27)
29-Oct-2020 15:09:11         at org.springframework.test.context.junit4.statements.RunAfterTestClassCallbacks.evaluate(RunAfterTestClassCallbacks.java:68)
29-Oct-2020 15:09:11         at org.junit.runners.ParentRunner.run(ParentRunner.java:309)
29-Oct-2020 15:09:11         at org.springframework.test.context.junit4.SpringJUnit4ClassRunner.run(SpringJUnit4ClassRunner.java:163)
29-Oct-2020 15:09:11         at org.apache.maven.surefire.junit4.JUnit4Provider.execute(JUnit4Provider.java:283)
29-Oct-2020 15:09:11         at org.apache.maven.surefire.junit4.JUnit4Provider.executeWithRerun(JUnit4Provider.java:173)
29-Oct-2020 15:09:11         at org.apache.maven.surefire.junit4.JUnit4Provider.executeTestSet(JUnit4Provider.java:153)
29-Oct-2020 15:09:11         at org.apache.maven.surefire.junit4.JUnit4Provider.invoke(JUnit4Provider.java:128)
29-Oct-2020 15:09:11         at org.apache.maven.surefire.booter.ForkedBooter.invokeProviderInSameClassLoader(ForkedBooter.java:203)
29-Oct-2020 15:09:11         at org.apache.maven.surefire.booter.ForkedBooter.runSuitesInProcess(ForkedBooter.java:155)
29-Oct-2020 15:09:11         at org.apache.maven.surefire.booter.ForkedBooter.main(ForkedBooter.java:103)
29-Oct-2020 15:09:11 Tests run: 75, Failures: 0, Errors: 0, Skipped: 0, Time elapsed: 1.257 sec - in org.openmrs.api.ObsServiceTest
29-Oct-2020 15:09:11 Running org.openmrs.api.ConceptServiceTest
29-Oct-2020 15:09:40 Tests run: 236, Failures: 0, Errors: 0, Skipped: 1, Time elapsed: 28.235 sec - in org.openmrs.api.ConceptServiceTest
29-Oct-2020 15:09:40 Running org.openmrs.api.PatientServiceAllergyTest
29-Oct-2020 15:09:40 Tests run: 16, Failures: 0, Errors: 0, Skipped: 0, Time elapsed: 0.641 sec - in org.openmrs.api.PatientServiceAllergyTest
29-Oct-2020 15:09:40 Running org.openmrs.api.DatatypeServiceTest
29-Oct-2020 15:09:41 Tests run: 2, Failures: 0, Errors: 0, Skipped: 0, Time elapsed: 0.379 sec - in org.openmrs.api.DatatypeServiceTest
29-Oct-2020 15:09:41 Running org.openmrs.api.ProgramWorkflowServiceUnitTest
29-Oct-2020 15:09:41 Tests run: 3, Failures: 0, Errors: 0, Skipped: 0, Time elapsed: 0.018 sec - in org.openmrs.api.ProgramWorkflowServiceUnitTest
29-Oct-2020 15:09:41 Running org.openmrs.api.VisitServiceTest
29-Oct-2020 15:09:41 ERROR - AbstractBatchImpl.clearBatch(183) |2020-10-29 15:09:41,689| HHH000352: Unable to release batch statement...
29-Oct-2020 15:09:41 Tests run: 60, Failures: 0, Errors: 0, Skipped: 0, Time elapsed: 0.717 sec - in org.openmrs.api.VisitServiceTest
29-Oct-2020 15:09:41 Running org.openmrs.order.OrderUtilTest
29-Oct-2020 15:09:41 Tests run: 15, Failures: 0, Errors: 0, Skipped: 0, Time elapsed: 0.004 sec - in org.openmrs.order.OrderUtilTest
29-Oct-2020 15:09:41 Running org.openmrs.PatientProgramTest
29-Oct-2020 15:09:41 Tests run: 2, Failures: 0, Errors: 0, Skipped: 0, Time elapsed: 0.001 sec - in org.openmrs.PatientProgramTest
29-Oct-2020 15:09:41 Running org.openmrs.PatientStateTest
29-Oct-2020 15:09:41 Tests run: 13, Failures: 0, Errors: 0, Skipped: 0, Time elapsed: 0.003 sec - in org.openmrs.PatientStateTest
29-Oct-2020 15:09:41 Running org.openmrs.attribute.AttributeIntegrationTest
29-Oct-2020 15:09:42 Tests run: 1, Failures: 0, Errors: 0, Skipped: 0, Time elapsed: 0.269 sec - in org.openmrs.attribute.AttributeIntegrationTest
29-Oct-2020 15:09:42 Running org.openmrs.EncounterRoleTest
29-Oct-2020 15:09:42 Tests run: 1, Failures: 0, Errors: 0, Skipped: 0, Time elapsed: 0.001 sec - in org.openmrs.EncounterRoleTest
29-Oct-2020 15:09:42 Running org.openmrs.ProviderTest
29-Oct-2020 15:09:42 Tests run: 2, Failures: 0, Errors: 0, Skipped: 0, Time elapsed: 0 sec - in org.openmrs.ProviderTest
29-Oct-2020 15:09:42 Running org.openmrs.serialization.SimpleXStreamSerializerTest
29-Oct-2020 15:09:42 Tests run: 5, Failures: 0, Errors: 0, Skipped: 0, Time elapsed: 0.013 sec - in org.openmrs.serialization.SimpleXStreamSerializerTest
29-Oct-2020 15:09:42 Running org.openmrs.serialization.JavaSerializationTest
29-Oct-2020 15:09:42 Tests run: 2, Failures: 0, Errors: 0, Skipped: 0, Time elapsed: 0.014 sec - in org.openmrs.serialization.JavaSerializationTest
29-Oct-2020 15:09:42 Running org.openmrs.BaseCustomizableMetadataTest
29-Oct-2020 15:09:42 Tests run: 2, Failures: 0, Errors: 0, Skipped: 0, Time elapsed: 0.428 sec - in org.openmrs.BaseCustomizableMetadataTest
29-Oct-2020 15:09:42 Running org.openmrs.UserTest
29-Oct-2020 15:09:42 Tests run: 9, Failures: 0, Errors: 0, Skipped: 0, Time elapsed: 0.002 sec - in org.openmrs.UserTest
29-Oct-2020 15:09:42 Running org.openmrs.logic.result.EmptyResultTest
29-Oct-2020 15:09:42 Tests run: 2, Failures: 0, Errors: 0, Skipped: 0, Time elapsed: 0.004 sec - in org.openmrs.logic.result.EmptyResultTest
29-Oct-2020 15:09:42 Running org.openmrs.logic.result.ResultTest
29-Oct-2020 15:09:42 Tests run: 17, Failures: 0, Errors: 0, Skipped: 0, Time elapsed: 0.008 sec - in org.openmrs.logic.result.ResultTest
29-Oct-2020 15:09:42 Running org.openmrs.PatientTest
29-Oct-2020 15:09:42 Tests run: 8, Failures: 0, Errors: 0, Skipped: 0, Time elapsed: 0.001 sec - in org.openmrs.PatientTest
29-Oct-2020 15:09:42 Running org.openmrs.notification.db.hibernate.HibernateAlertDAOTest
29-Oct-2020 15:09:42 Tests run: 1, Failures: 0, Errors: 0, Skipped: 0, Time elapsed: 0.34 sec - in org.openmrs.notification.db.hibernate.HibernateAlertDAOTest
29-Oct-2020 15:09:42 Running org.openmrs.notification.AlertServiceTest
29-Oct-2020 15:09:43 Tests run: 3, Failures: 0, Errors: 0, Skipped: 0, Time elapsed: 0.412 sec - in org.openmrs.notification.AlertServiceTest
29-Oct-2020 15:09:43 Running org.openmrs.notification.MessageTest
29-Oct-2020 15:09:43 Tests run: 4, Failures: 0, Errors: 0, Skipped: 0, Time elapsed: 0.004 sec - in org.openmrs.notification.MessageTest
29-Oct-2020 15:09:43 Running org.openmrs.PersonNameTest
29-Oct-2020 15:09:43 Tests run: 19, Failures: 0, Errors: 0, Skipped: 0, Time elapsed: 0.004 sec - in org.openmrs.PersonNameTest
29-Oct-2020 15:09:43 Running org.openmrs.EncounterProviderTest
29-Oct-2020 15:09:43 Tests run: 1, Failures: 0, Errors: 0, Skipped: 0, Time elapsed: 0 sec - in org.openmrs.EncounterProviderTest
29-Oct-2020 15:09:43 Running org.openmrs.hl7.HL7UtilTest
29-Oct-2020 15:09:43 Tests run: 5, Failures: 0, Errors: 0, Skipped: 0, Time elapsed: 0.012 sec - in org.openmrs.hl7.HL7UtilTest
29-Oct-2020 15:09:43 Running org.openmrs.hl7.HL7ServiceTest
29-Oct-2020 15:09:43 ERROR - HL7ServiceImpl.setFatalError(742) |2020-10-29 15:09:43,953| ca.uhn.hl7v2.HL7Exception: HL7 encoding not supported
29-Oct-2020 15:09:44 Tests run: 26, Failures: 0, Errors: 0, Skipped: 2, Time elapsed: 0.872 sec - in org.openmrs.hl7.HL7ServiceTest
29-Oct-2020 15:09:44 Running org.openmrs.hl7.handler.ORUR01HandlerTest
29-Oct-2020 15:09:45 Tests run: 37, Failures: 0, Errors: 0, Skipped: 0, Time elapsed: 1.529 sec - in org.openmrs.hl7.handler.ORUR01HandlerTest
29-Oct-2020 15:09:45 Running org.openmrs.OpenmrsTestsTest
29-Oct-2020 15:09:45 Tests run: 4, Failures: 0, Errors: 0, Skipped: 0, Time elapsed: 0.182 sec - in org.openmrs.OpenmrsTestsTest
29-Oct-2020 15:09:45 Running org.openmrs.propertyeditor.UserEditorTest
29-Oct-2020 15:09:46 Tests run: 2, Failures: 0, Errors: 0, Skipped: 0, Time elapsed: 0.304 sec - in org.openmrs.propertyeditor.UserEditorTest
29-Oct-2020 15:09:46 Running org.openmrs.propertyeditor.PersonAttributeTypeEditorTest
29-Oct-2020 15:09:46 Tests run: 2, Failures: 0, Errors: 0, Skipped: 0, Time elapsed: 0.325 sec - in org.openmrs.propertyeditor.PersonAttributeTypeEditorTest
29-Oct-2020 15:09:46 Running org.openmrs.propertyeditor.ConceptNumericEditorTest
29-Oct-2020 15:09:46 Tests run: 2, Failures: 0, Errors: 0, Skipped: 0, Time elapsed: 0.388 sec - in org.openmrs.propertyeditor.ConceptNumericEditorTest
29-Oct-2020 15:09:46 Running org.openmrs.propertyeditor.ConceptSourceEditorTest
29-Oct-2020 15:09:47 Tests run: 2, Failures: 0, Errors: 0, Skipped: 0, Time elapsed: 0.281 sec - in org.openmrs.propertyeditor.ConceptSourceEditorTest
29-Oct-2020 15:09:47 Running org.openmrs.propertyeditor.ProgramWorkflowEditorTest
29-Oct-2020 15:09:47 Tests run: 1, Failures: 0, Errors: 0, Skipped: 0, Time elapsed: 0.34 sec - in org.openmrs.propertyeditor.ProgramWorkflowEditorTest
29-Oct-2020 15:09:47 Running org.openmrs.propertyeditor.CohortEditorTest
29-Oct-2020 15:09:47 Tests run: 2, Failures: 0, Errors: 0, Skipped: 0, Time elapsed: 0.323 sec - in org.openmrs.propertyeditor.CohortEditorTest
29-Oct-2020 15:09:47 Running org.openmrs.propertyeditor.ProviderEditorTest
29-Oct-2020 15:09:48 Tests run: 2, Failures: 0, Errors: 0, Skipped: 0, Time elapsed: 0.257 sec - in org.openmrs.propertyeditor.ProviderEditorTest
29-Oct-2020 15:09:48 Running org.openmrs.propertyeditor.EncounterTypeEditorTest
29-Oct-2020 15:09:48 Tests run: 2, Failures: 0, Errors: 0, Skipped: 0, Time elapsed: 0.258 sec - in org.openmrs.propertyeditor.EncounterTypeEditorTest
29-Oct-2020 15:09:48 Running org.openmrs.propertyeditor.ConceptNameEditorTest
29-Oct-2020 15:09:48 Tests run: 2, Failures: 0, Errors: 0, Skipped: 0, Time elapsed: 0.327 sec - in org.openmrs.propertyeditor.ConceptNameEditorTest
29-Oct-2020 15:09:48 Running org.openmrs.propertyeditor.PatientIdentifierTypeEditorTest
29-Oct-2020 15:09:49 Tests run: 2, Failures: 0, Errors: 0, Skipped: 0, Time elapsed: 0.28 sec - in org.openmrs.propertyeditor.PatientIdentifierTypeEditorTest
29-Oct-2020 15:09:49 Running org.openmrs.propertyeditor.LocationTagEditorTest
29-Oct-2020 15:09:49 Tests run: 2, Failures: 0, Errors: 0, Skipped: 0, Time elapsed: 0.312 sec - in org.openmrs.propertyeditor.LocationTagEditorTest
29-Oct-2020 15:09:49 Running org.openmrs.propertyeditor.ConceptDatatypeEditorTest
29-Oct-2020 15:09:49 Tests run: 2, Failures: 0, Errors: 0, Skipped: 0, Time elapsed: 0.305 sec - in org.openmrs.propertyeditor.ConceptDatatypeEditorTest
29-Oct-2020 15:09:49 Running org.openmrs.propertyeditor.ConceptAnswerEditorTest
29-Oct-2020 15:09:50 Tests run: 2, Failures: 0, Errors: 0, Skipped: 0, Time elapsed: 0.352 sec - in org.openmrs.propertyeditor.ConceptAnswerEditorTest
29-Oct-2020 15:09:50 Running org.openmrs.propertyeditor.ConceptClassEditorTest
29-Oct-2020 15:09:50 Tests run: 2, Failures: 0, Errors: 0, Skipped: 0, Time elapsed: 0.303 sec - in org.openmrs.propertyeditor.ConceptClassEditorTest
29-Oct-2020 15:09:50 Running org.openmrs.propertyeditor.ProgramWorkflowStateEditorTest
29-Oct-2020 15:09:50 Tests run: 1, Failures: 0, Errors: 0, Skipped: 0, Time elapsed: 0.284 sec - in org.openmrs.propertyeditor.ProgramWorkflowStateEditorTest
29-Oct-2020 15:09:50 Running org.openmrs.propertyeditor.ProgramEditorTest
29-Oct-2020 15:09:50 Tests run: 4, Failures: 0, Errors: 0, Skipped: 0, Time elapsed: 0.363 sec - in org.openmrs.propertyeditor.ProgramEditorTest
29-Oct-2020 15:09:50 Running org.openmrs.propertyeditor.DateOrDatetimeEditorTest
29-Oct-2020 15:09:50 Tests run: 6, Failures: 0, Errors: 0, Skipped: 0, Time elapsed: 0.009 sec - in org.openmrs.propertyeditor.DateOrDatetimeEditorTest
29-Oct-2020 15:09:50 Running org.openmrs.propertyeditor.VisitEditorTest
29-Oct-2020 15:09:51 Tests run: 2, Failures: 0, Errors: 0, Skipped: 0, Time elapsed: 0.363 sec - in org.openmrs.propertyeditor.VisitEditorTest
29-Oct-2020 15:09:51 Running org.openmrs.propertyeditor.VisitTypeEditorTest
29-Oct-2020 15:09:51 Tests run: 2, Failures: 0, Errors: 0, Skipped: 0, Time elapsed: 0.318 sec - in org.openmrs.propertyeditor.VisitTypeEditorTest
29-Oct-2020 15:09:51 Running org.openmrs.propertyeditor.RoleEditorTest
29-Oct-2020 15:09:52 Tests run: 2, Failures: 0, Errors: 0, Skipped: 0, Time elapsed: 0.354 sec - in org.openmrs.propertyeditor.RoleEditorTest
29-Oct-2020 15:09:52 Running org.openmrs.propertyeditor.ConceptEditorTest
29-Oct-2020 15:09:52 Tests run: 2, Failures: 0, Errors: 0, Skipped: 0, Time elapsed: 0.292 sec - in org.openmrs.propertyeditor.ConceptEditorTest
29-Oct-2020 15:09:52 Running org.openmrs.propertyeditor.WorkflowCollectionEditorTest
29-Oct-2020 15:09:52 Tests run: 1, Failures: 0, Errors: 0, Skipped: 0, Time elapsed: 0.331 sec - in org.openmrs.propertyeditor.WorkflowCollectionEditorTest
29-Oct-2020 15:09:52 Running org.openmrs.propertyeditor.PersonAttributeEditorTest
29-Oct-2020 15:09:52 Tests run: 2, Failures: 0, Errors: 0, Skipped: 0, Time elapsed: 0.307 sec - in org.openmrs.propertyeditor.PersonAttributeEditorTest
29-Oct-2020 15:09:52 Running org.openmrs.propertyeditor.FormEditorTest
29-Oct-2020 15:09:53 Tests run: 2, Failures: 0, Errors: 0, Skipped: 0, Time elapsed: 0.269 sec - in org.openmrs.propertyeditor.FormEditorTest
29-Oct-2020 15:09:53 Running org.openmrs.propertyeditor.OrderEditorTest
29-Oct-2020 15:09:53 Tests run: 2, Failures: 0, Errors: 0, Skipped: 0, Time elapsed: 0.376 sec - in org.openmrs.propertyeditor.OrderEditorTest
29-Oct-2020 15:09:53 Running org.openmrs.propertyeditor.PrivilegeEditorTest
29-Oct-2020 15:09:53 Tests run: 2, Failures: 0, Errors: 0, Skipped: 0, Time elapsed: 0.312 sec - in org.openmrs.propertyeditor.PrivilegeEditorTest
29-Oct-2020 15:09:53 Running org.openmrs.propertyeditor.EncounterEditorTest
29-Oct-2020 15:09:54 Tests run: 2, Failures: 0, Errors: 0, Skipped: 0, Time elapsed: 0.283 sec - in org.openmrs.propertyeditor.EncounterEditorTest
29-Oct-2020 15:09:54 Running org.openmrs.propertyeditor.DrugEditorTest
29-Oct-2020 15:09:54 Tests run: 2, Failures: 0, Errors: 0, Skipped: 0, Time elapsed: 0.287 sec - in org.openmrs.propertyeditor.DrugEditorTest
29-Oct-2020 15:09:54 Running org.openmrs.propertyeditor.PersonEditorTest
29-Oct-2020 15:09:54 Tests run: 2, Failures: 0, Errors: 0, Skipped: 0, Time elapsed: 0.313 sec - in org.openmrs.propertyeditor.PersonEditorTest
29-Oct-2020 15:09:54 Running org.openmrs.propertyeditor.LocationEditorTest
29-Oct-2020 15:09:55 Tests run: 2, Failures: 0, Errors: 0, Skipped: 0, Time elapsed: 0.274 sec - in org.openmrs.propertyeditor.LocationEditorTest
29-Oct-2020 15:09:55 Running org.openmrs.propertyeditor.PatientEditorTest
29-Oct-2020 15:09:55 Tests run: 2, Failures: 0, Errors: 0, Skipped: 0, Time elapsed: 0.403 sec - in org.openmrs.propertyeditor.PatientEditorTest
29-Oct-2020 15:09:55 Running org.openmrs.propertyeditor.ConceptAnswersEditorTest
29-Oct-2020 15:09:55 Tests run: 1, Failures: 0, Errors: 0, Skipped: 0, Time elapsed: 0.255 sec - in org.openmrs.propertyeditor.ConceptAnswersEditorTest
29-Oct-2020 15:09:55 Running org.openmrs.EncounterTest
29-Oct-2020 15:09:56 Tests run: 56, Failures: 0, Errors: 0, Skipped: 0, Time elapsed: 0.648 sec - in org.openmrs.EncounterTest
29-Oct-2020 15:09:56 Running org.openmrs.AllergenTest
29-Oct-2020 15:09:56 Tests run: 6, Failures: 0, Errors: 0, Skipped: 0, Time elapsed: 0.322 sec - in org.openmrs.AllergenTest
29-Oct-2020 15:09:56 Running org.openmrs.customdatatype.datatype.DateDatatypeTest
29-Oct-2020 15:09:56 Tests run: 2, Failures: 0, Errors: 0, Skipped: 0, Time elapsed: 0.001 sec - in org.openmrs.customdatatype.datatype.DateDatatypeTest
29-Oct-2020 15:09:56 Running org.openmrs.customdatatype.datatype.RegexValidatedTextTest
29-Oct-2020 15:09:56 Tests run: 3, Failures: 0, Errors: 0, Skipped: 0, Time elapsed: 0.001 sec - in org.openmrs.customdatatype.datatype.RegexValidatedTextTest
29-Oct-2020 15:09:56 Running org.openmrs.customdatatype.datatype.BaseOpenmrsDatatypeTest
29-Oct-2020 15:09:56 Tests run: 1, Failures: 0, Errors: 0, Skipped: 0, Time elapsed: 0 sec - in org.openmrs.customdatatype.datatype.BaseOpenmrsDatatypeTest
29-Oct-2020 15:09:56 Running org.openmrs.customdatatype.datatype.BaseMetadataDatatypeTest
29-Oct-2020 15:09:56 Tests run: 1, Failures: 0, Errors: 0, Skipped: 0, Time elapsed: 0.005 sec - in org.openmrs.customdatatype.datatype.BaseMetadataDatatypeTest
29-Oct-2020 15:09:56 Running org.openmrs.customdatatype.CustomDatatypeUtilTest
29-Oct-2020 15:09:56 Tests run: 1, Failures: 0, Errors: 0, Skipped: 0, Time elapsed: 0.247 sec - in org.openmrs.customdatatype.CustomDatatypeUtilTest
29-Oct-2020 15:09:56 Running org.openmrs.module.ModuleActivatorTest
29-Oct-2020 15:09:56 Tests run: 1, Failures: 0, Errors: 0, Skipped: 1, Time elapsed: 0.001 sec - in org.openmrs.module.ModuleActivatorTest
29-Oct-2020 15:09:56 Running org.openmrs.module.ModuleUtilTest
29-Oct-2020 15:09:57 Tests run: 43, Failures: 0, Errors: 0, Skipped: 0, Time elapsed: 0.419 sec - in org.openmrs.module.ModuleUtilTest
29-Oct-2020 15:09:57 Running org.openmrs.module.VersionComparatorTest
29-Oct-2020 15:09:57 Tests run: 1, Failures: 0, Errors: 0, Skipped: 0, Time elapsed: 0 sec - in org.openmrs.module.VersionComparatorTest
29-Oct-2020 15:09:57 Running org.openmrs.module.ModuleInteroperabilityTest
29-Oct-2020 15:09:57 Tests run: 1, Failures: 0, Errors: 0, Skipped: 0, Time elapsed: 0.419 sec - in org.openmrs.module.ModuleInteroperabilityTest
29-Oct-2020 15:09:57 Running org.openmrs.module.ModuleClassLoaderTest
29-Oct-2020 15:09:58 Tests run: 10, Failures: 0, Errors: 0, Skipped: 0, Time elapsed: 0.339 sec - in org.openmrs.module.ModuleClassLoaderTest
29-Oct-2020 15:09:58 Running org.openmrs.module.ModuleFileParserTest
29-Oct-2020 15:09:58 Tests run: 5, Failures: 0, Errors: 0, Skipped: 0, Time elapsed: 0.008 sec - in org.openmrs.module.ModuleFileParserTest
29-Oct-2020 15:09:58
29-Oct-2020 15:09:58 Results :
29-Oct-2020 15:09:58
29-Oct-2020 15:09:58 Tests run: 3266, Failures: 0, Errors: 0, Skipped: 29
29-Oct-2020 15:09:58
29-Oct-2020 15:09:58 [INFO]
29-Oct-2020 15:09:58 [INFO] --- maven-jar-plugin:2.3.2:jar (default-jar) @ openmrs-api ---
29-Oct-2020 15:09:58 [INFO] Building jar: /home/bamboo-agent/bamboo-agent/xml-data/build-dir/TRUNK-OC2-JOB1/api/target/openmrs-api-2.0.9-SNAPSHOT.jar
29-Oct-2020 15:09:59 [INFO]
29-Oct-2020 15:09:59 [INFO] --- maven-jar-plugin:2.3.2:test-jar (default) @ openmrs-api ---
29-Oct-2020 15:09:59 [INFO] Building jar: /home/bamboo-agent/bamboo-agent/xml-data/build-dir/TRUNK-OC2-JOB1/api/target/openmrs-api-2.0.9-SNAPSHOT-tests.jar
29-Oct-2020 15:09:59 [INFO]                                                                         
29-Oct-2020 15:09:59 [INFO] ------------------------------------------------------------------------
29-Oct-2020 15:09:59 [INFO] Building openmrs-web 2.0.9-SNAPSHOT
29-Oct-2020 15:09:59 [INFO] ------------------------------------------------------------------------
29-Oct-2020 15:09:59 [INFO]
29-Oct-2020 15:09:59 [INFO] --- maven-clean-plugin:2.5:clean (default-clean) @ openmrs-web ---
29-Oct-2020 15:09:59 [INFO]
29-Oct-2020 15:09:59 [INFO] --- buildnumber-maven-plugin:1.1:create (default) @ openmrs-web ---
29-Oct-2020 15:09:59 [INFO]
29-Oct-2020 15:09:59 [INFO] --- build-helper-maven-plugin:1.5:parse-version (parse-version) @ openmrs-web ---
29-Oct-2020 15:09:59 [INFO]
29-Oct-2020 15:09:59 [INFO] --- maven-java-formatter-plugin:0.3:format (default) @ openmrs-web ---
29-Oct-2020 15:09:59 [INFO] Using 'UTF-8' encoding to format source files.
29-Oct-2020 15:09:59 [INFO] Number of files to be formatted: 50
29-Oct-2020 15:09:59 [INFO] Successfully formatted: 0 file(s)
29-Oct-2020 15:09:59 [INFO] Fail to format        : 0 file(s)
29-Oct-2020 15:09:59 [INFO] Skipped               : 50 file(s)
29-Oct-2020 15:09:59 [INFO] Approximate time taken: 0s
29-Oct-2020 15:09:59 [INFO]
29-Oct-2020 15:09:59 [INFO] --- maven-resources-plugin:2.4:resources (default-resources) @ openmrs-web ---
29-Oct-2020 15:09:59 [INFO] Using 'UTF-8' encoding to copy filtered resources.
29-Oct-2020 15:09:59 [INFO] Copying 22 resources
29-Oct-2020 15:09:59 [INFO]
29-Oct-2020 15:09:59 [INFO] --- maven-compiler-plugin:2.1:compile (default-compile) @ openmrs-web ---
29-Oct-2020 15:09:59 [INFO] Compiling 39 source files to /home/bamboo-agent/bamboo-agent/xml-data/build-dir/TRUNK-OC2-JOB1/web/target/classes
29-Oct-2020 15:10:01 [INFO]
29-Oct-2020 15:10:01 [INFO] --- maven-resources-plugin:2.4:testResources (default-testResources) @ openmrs-web ---
29-Oct-2020 15:10:01 [INFO] Using 'UTF-8' encoding to copy filtered resources.
29-Oct-2020 15:10:01 [INFO] skip non existing resourceDirectory /home/bamboo-agent/bamboo-agent/xml-data/build-dir/TRUNK-OC2-JOB1/web/src/test/resources
29-Oct-2020 15:10:01 [INFO]
29-Oct-2020 15:10:01 [INFO] --- maven-compiler-plugin:2.1:testCompile (default-testCompile) @ openmrs-web ---
29-Oct-2020 15:10:01 [INFO] Compiling 11 source files to /home/bamboo-agent/bamboo-agent/xml-data/build-dir/TRUNK-OC2-JOB1/web/target/test-classes
29-Oct-2020 15:10:02 [INFO]
29-Oct-2020 15:10:02 [INFO] --- maven-surefire-plugin:2.18.1:test (default-test) @ openmrs-web ---
29-Oct-2020 15:10:02 [INFO] Surefire report directory: /home/bamboo-agent/bamboo-agent/xml-data/build-dir/TRUNK-OC2-JOB1/web/target/surefire-reports
29-Oct-2020 15:10:02
29-Oct-2020 15:10:02 -------------------------------------------------------
29-Oct-2020 15:10:02 T E S T S
29-Oct-2020 15:10:02 -------------------------------------------------------
29-Oct-2020 15:10:04 Running org.openmrs.web.filter.update.UpdateFilterTest
29-Oct-2020 15:10:14 Tests run: 5, Failures: 0, Errors: 0, Skipped: 0, Time elapsed: 9.771 sec - in org.openmrs.web.filter.update.UpdateFilterTest
29-Oct-2020 15:10:14 Running org.openmrs.web.filter.update.util.FilterUtilTest
29-Oct-2020 15:10:14 Tests run: 2, Failures: 0, Errors: 0, Skipped: 2, Time elapsed: 0.01 sec - in org.openmrs.web.filter.update.util.FilterUtilTest
29-Oct-2020 15:10:14 Running org.openmrs.web.filter.update.GZIPFilterTest
29-Oct-2020 15:10:14 Tests run: 1, Failures: 0, Errors: 0, Skipped: 0, Time elapsed: 0.202 sec - in org.openmrs.web.filter.update.GZIPFilterTest
29-Oct-2020 15:10:14 Running org.openmrs.web.WebUtilTest
29-Oct-2020 15:10:14 Tests run: 10, Failures: 0, Errors: 0, Skipped: 0, Time elapsed: 0 sec - in org.openmrs.web.WebUtilTest
29-Oct-2020 15:10:14 Running org.openmrs.module.web.WebModuleUtilTest
29-Oct-2020 15:10:14 SLF4J: Class path contains multiple SLF4J bindings.
29-Oct-2020 15:10:14 SLF4J: Found binding in [jar:file:/home/bamboo-agent/.m2/repository/org/slf4j/slf4j-log4j12/1.6.0/slf4j-log4j12-1.6.0.jar!/org/slf4j/impl/StaticLoggerBinder.class]
29-Oct-2020 15:10:14 SLF4J: Found binding in [jar:file:/home/bamboo-agent/.m2/repository/org/slf4j/slf4j-log4j12/1.6.0/slf4j-log4j12-1.6.0.jar!/org/slf4j/impl/StaticLoggerBinder.class]
29-Oct-2020 15:10:14 SLF4J: See http://www.slf4j.org/codes.html#multiple_bindings for an explanation.
29-Oct-2020 15:10:15 Tests run: 9, Failures: 0, Errors: 0, Skipped: 0, Time elapsed: 1.107 sec - in org.openmrs.module.web.WebModuleUtilTest
29-Oct-2020 15:10:15
29-Oct-2020 15:10:15 Results :
29-Oct-2020 15:10:15
29-Oct-2020 15:10:15 Tests run: 27, Failures: 0, Errors: 0, Skipped: 2
29-Oct-2020 15:10:15
29-Oct-2020 15:10:15 [INFO]
29-Oct-2020 15:10:15 [INFO] --- maven-jar-plugin:2.3.2:jar (default-jar) @ openmrs-web ---
29-Oct-2020 15:10:15 [INFO] Building jar: /home/bamboo-agent/bamboo-agent/xml-data/build-dir/TRUNK-OC2-JOB1/web/target/openmrs-web-2.0.9-SNAPSHOT.jar
29-Oct-2020 15:10:15 [INFO]
29-Oct-2020 15:10:15 [INFO] --- maven-jar-plugin:2.3.2:test-jar (default) @ openmrs-web ---
29-Oct-2020 15:10:15 [INFO] Building jar: /home/bamboo-agent/bamboo-agent/xml-data/build-dir/TRUNK-OC2-JOB1/web/target/openmrs-web-2.0.9-SNAPSHOT-tests.jar
29-Oct-2020 15:10:15 [INFO]                                                                         
29-Oct-2020 15:10:15 [INFO] ------------------------------------------------------------------------
29-Oct-2020 15:10:15 [INFO] Building openmrs-webapp 2.0.9-SNAPSHOT
29-Oct-2020 15:10:15 [INFO] ------------------------------------------------------------------------
29-Oct-2020 15:10:15 [INFO]
29-Oct-2020 15:10:15 [INFO] --- maven-clean-plugin:2.5:clean (default-clean) @ openmrs-webapp ---
29-Oct-2020 15:10:15 [INFO]
29-Oct-2020 15:10:15 [INFO] --- buildnumber-maven-plugin:1.1:create (default) @ openmrs-webapp ---
29-Oct-2020 15:10:15 [INFO]
29-Oct-2020 15:10:15 [INFO] --- build-helper-maven-plugin:1.5:parse-version (parse-version) @ openmrs-webapp ---
29-Oct-2020 15:10:15 [INFO]
29-Oct-2020 15:10:15 [INFO] --- maven-resources-plugin:2.4:resources (default-resources) @ openmrs-webapp ---
29-Oct-2020 15:10:15 [INFO] Using 'UTF-8' encoding to copy filtered resources.
29-Oct-2020 15:10:15 [INFO] Copying 2 resources
29-Oct-2020 15:10:15 [INFO] Copying 1 resource to ../jetty
29-Oct-2020 15:10:15 [INFO]
29-Oct-2020 15:10:15 [INFO] --- maven-antrun-plugin:1.4:run (default) @ openmrs-webapp ---
29-Oct-2020 15:10:16 project.artifactId
29-Oct-2020 15:10:16 [INFO] Executing tasks
29-Oct-2020 15:10:16     [unzip] Expanding: /home/bamboo-agent/bamboo-agent/xml-data/build-dir/TRUNK-OC2-JOB1/webapp/src/main/resources/liquibase-demo-data.zip into /home/bamboo-agent/bamboo-agent/xml-data/build-dir/TRUNK-OC2-JOB1/webapp/target/classes
29-Oct-2020 15:10:16 [INFO] Executed tasks
29-Oct-2020 15:10:16 [INFO]
29-Oct-2020 15:10:16 [INFO] --- maven-compiler-plugin:2.1:compile (default-compile) @ openmrs-webapp ---
29-Oct-2020 15:10:16 [INFO] No sources to compile
29-Oct-2020 15:10:16 [INFO]
29-Oct-2020 15:10:16 [INFO] --- maven-resources-plugin:2.4:testResources (default-testResources) @ openmrs-webapp ---
29-Oct-2020 15:10:16 [INFO] Using 'UTF-8' encoding to copy filtered resources.
29-Oct-2020 15:10:16 [INFO] Copying 1 resource
29-Oct-2020 15:10:16 [INFO]
29-Oct-2020 15:10:16 [INFO] --- maven-compiler-plugin:2.1:testCompile (default-testCompile) @ openmrs-webapp ---
29-Oct-2020 15:10:16 [INFO] Compiling 3 source files to /home/bamboo-agent/bamboo-agent/xml-data/build-dir/TRUNK-OC2-JOB1/webapp/target/test-classes
29-Oct-2020 15:10:17 [INFO]
29-Oct-2020 15:10:17 [INFO] --- maven-surefire-plugin:2.18.1:test (default-test) @ openmrs-webapp ---
29-Oct-2020 15:10:17 [INFO] Surefire report directory: /home/bamboo-agent/bamboo-agent/xml-data/build-dir/TRUNK-OC2-JOB1/webapp/target/surefire-reports
29-Oct-2020 15:10:17
29-Oct-2020 15:10:17 -------------------------------------------------------
29-Oct-2020 15:10:17 T E S T S
29-Oct-2020 15:10:17 -------------------------------------------------------
29-Oct-2020 15:10:17 Running org.openmrs.MessagePropertiesFilesTest
29-Oct-2020 15:10:17 Tests run: 0, Failures: 0, Errors: 0, Skipped: 0, Time elapsed: 0.005 sec - in org.openmrs.MessagePropertiesFilesTest
29-Oct-2020 15:10:17
29-Oct-2020 15:10:17 Results :
29-Oct-2020 15:10:17
29-Oct-2020 15:10:17 Tests run: 0, Failures: 0, Errors: 0, Skipped: 0
29-Oct-2020 15:10:17
29-Oct-2020 15:10:17 [INFO]
29-Oct-2020 15:10:17 [INFO] --- maven-war-plugin:2.4:war (default-war) @ openmrs-webapp ---
29-Oct-2020 15:10:17 [INFO] Packaging webapp
29-Oct-2020 15:10:17 [INFO] Assembling webapp [openmrs-webapp] in [/home/bamboo-agent/bamboo-agent/xml-data/build-dir/TRUNK-OC2-JOB1/webapp/target/openmrs]
29-Oct-2020 15:10:17 [INFO] Processing war project
29-Oct-2020 15:10:17 [INFO] Copying webapp webResources [/home/bamboo-agent/bamboo-agent/xml-data/build-dir/TRUNK-OC2-JOB1/webapp/src/main/webapp] to [/home/bamboo-agent/bamboo-agent/xml-data/build-dir/TRUNK-OC2-JOB1/webapp/target/openmrs]
29-Oct-2020 15:10:17 [INFO] Copying webapp resources [/home/bamboo-agent/bamboo-agent/xml-data/build-dir/TRUNK-OC2-JOB1/webapp/src/main/webapp]
29-Oct-2020 15:10:18 [INFO] Webapp assembled in [430 msecs]
29-Oct-2020 15:10:18 [INFO] Building war: /home/bamboo-agent/bamboo-agent/xml-data/build-dir/TRUNK-OC2-JOB1/webapp/target/openmrs.war
29-Oct-2020 15:10:20 [INFO]
29-Oct-2020 15:10:20 [INFO] --- maven-jar-plugin:2.3.2:test-jar (default) @ openmrs-webapp ---
29-Oct-2020 15:10:20 [INFO] Building jar: /home/bamboo-agent/bamboo-agent/xml-data/build-dir/TRUNK-OC2-JOB1/webapp/target/openmrs-tests.jar
29-Oct-2020 15:10:20 [INFO] ------------------------------------------------------------------------
29-Oct-2020 15:10:20 [INFO] Reactor Summary:
29-Oct-2020 15:10:20 [INFO]
29-Oct-2020 15:10:20 [INFO] OpenMRS ............................................ SUCCESS [  1.268 s]
29-Oct-2020 15:10:20 [INFO] openmrs-tools ...................................... SUCCESS [  1.499 s]
29-Oct-2020 15:10:20 [INFO] openmrs-test ....................................... SUCCESS [  0.562 s]
29-Oct-2020 15:10:20 [INFO] openmrs-api ........................................ SUCCESS [02:43 min]
29-Oct-2020 15:10:20 [INFO] openmrs-web ........................................ SUCCESS [ 16.152 s]
29-Oct-2020 15:10:20 [INFO] openmrs-webapp ..................................... SUCCESS [  4.922 s]
29-Oct-2020 15:10:20 [INFO] ------------------------------------------------------------------------
29-Oct-2020 15:10:20 [INFO] BUILD SUCCESS
29-Oct-2020 15:10:20 [INFO] ------------------------------------------------------------------------
29-Oct-2020 15:10:20 [INFO] Total time: 03:08 min
29-Oct-2020 15:10:20 [INFO] Finished at: 2020-10-29T15:10:20+00:00
29-Oct-2020 15:10:20 [INFO] Final Memory: 100M/605M
29-Oct-2020 15:10:20 [INFO] ------------------------------------------------------------------------
29-Oct-2020 15:10:21 Parsing test results under /home/bamboo-agent/bamboo-agent/xml-data/build-dir/TRUNK-OC2-JOB1...
29-Oct-2020 15:10:21 Finished task 'Build' with result: Success
29-Oct-2020 15:10:21 Running post build plugin 'Docker Container Cleanup'
29-Oct-2020 15:10:21 Running post build plugin 'NCover Results Collector'
29-Oct-2020 15:10:21 Running post build plugin 'Clover Results Collector'
29-Oct-2020 15:10:21 Running post build plugin 'Sauce OnDemand Post Runner'
29-Oct-2020 15:10:21 Running post build plugin 'npm Cache Cleanup'
29-Oct-2020 15:10:21 Running post build plugin 'Artifact Copier'
29-Oct-2020 15:10:21 Publishing an artifact: openmrs-war
29-Oct-2020 15:10:23 Finished publishing of artifact Non required shared artifact: [openmrs-war], pattern: [**/openmrs.war] anchored at: [webapp/target] in 1.598 s
29-Oct-2020 15:10:23 Publishing an artifact: openmrs-api
29-Oct-2020 15:10:23 Finished publishing of artifact Non required shared artifact: [openmrs-api], pattern: [**/openmrs-api*.jar] anchored at: [webapp/target/openmrs/WEB-INF/lib] in 749.5 ms
29-Oct-2020 15:10:23 Publishing an artifact: sonar-issues
29-Oct-2020 15:10:23 Unable to publish artifact [sonar-issues]: the source directory /home/bamboo-agent/bamboo-agent/xml-data/build-dir/TRUNK-OC2-JOB1/target/sonar/issues-report does not exist.
29-Oct-2020 15:10:23 The artifact hasn't been successfully published after 2.753 ms
29-Oct-2020 15:10:23 Finalising the build...
29-Oct-2020 15:10:23 Stopping timer.
29-Oct-2020 15:10:23 Build TRUNK-OC2-JOB1-241 completed.
29-Oct-2020 15:10:24 Running on server: post build plugin 'NCover Results Collector'
29-Oct-2020 15:10:24 Running on server: post build plugin 'Build Hanging Detection Configuration'
29-Oct-2020 15:10:24 Running on server: post build plugin 'Clover Delta Calculator'
29-Oct-2020 15:10:24 Running on server: post build plugin 'Maven Dependencies Postprocessor'
29-Oct-2020 15:10:24 All post build plugins have finished
29-Oct-2020 15:10:24 Generating build results summary...
29-Oct-2020 15:10:26 Saving build results to disk...
29-Oct-2020 15:10:26 Logging substituted variables...
29-Oct-2020 15:10:26 Indexing build results...
29-Oct-2020 15:10:26 Finished building TRUNK-OC2-JOB1-241.