Runs unit test and deploys artifacts to maven repo. More details of the release in https://wiki.openmrs.org/x/i4DTAw

Build: #42 failed Run by child build REFAPP-OMODDISTRO

Stages & jobs

  1. Default Stage

  2. Release

    Requires a user to start manually

Build result summary

Details

Completed
Duration
7 minutes
Labels
None
Revisions
Appointment Scheduling UI Git
ae8532c8178f5bd077115552097f9d317225fe39 ae8532c8178f5bd077115552097f9d317225fe39
Release scripts
868194ebaa115dd7ad65b0872ca497c4a66fdca5 868194ebaa115dd7ad65b0872ca497c4a66fdca5
Total tests
6
Fixed in
#43 (Manual run by Wyclif Luyima)

Tests

Responsible

No one has taken responsibility for this failure

Code commits

Appointment Scheduling UI Git
Author Commit Message Commit date
root <root@bamboo.pih-emr.org> root <root@bamboo.pih-emr.org> ae8532c8178f5bd077115552097f9d317225fe39 ae8532c8178f5bd077115552097f9d317225fe39 'automatic update of mvn version dependencies'

Tests

New test failures 4
Status Test View job Duration
Collapse Failed AppointmentSchedulingUIActivatorTest testStartup History
Default Job < 1 sec
org.dbunit.dataset.NoSuchTableException: person
	at org.dbunit.database.DatabaseDataSet.getTableMetaData(DatabaseDataSet.java:282)
	at org.dbunit.operation.AbstractOperation.getOperationMetaData(AbstractOperation.java:80)
	at org.dbunit.operation.RefreshOperation.execute(RefreshOperation.java:98)
	at org.openmrs.test.BaseContextSensitiveTest.executeDataSet(BaseContextSensitiveTest.java:583)
	at org.openmrs.test.BaseContextSensitiveTest.executeDataSet(BaseContextSensitiveTest.java:495)
	at org.openmrs.test.BaseContextSensitiveTest.initializeInMemoryDatabase(BaseContextSensitiveTest.java:436)
	at org.openmrs.test.BaseContextSensitiveTest.baseSetupWithStandardDataAndAuthentication(BaseContextSensitiveTest.java:687)
(36 more lines...)
Collapse Failed AppointmentCheckInTagComponentTest shouldCheckPatientInToAppointment History
Default Job 5 mins
org.dbunit.dataset.NoSuchTableException: person
	at org.dbunit.database.DatabaseDataSet.getTableMetaData(DatabaseDataSet.java:282)
	at org.dbunit.operation.AbstractOperation.getOperationMetaData(AbstractOperation.java:80)
	at org.dbunit.operation.RefreshOperation.execute(RefreshOperation.java:98)
	at org.openmrs.test.BaseContextSensitiveTest.executeDataSet(BaseContextSensitiveTest.java:583)
	at org.openmrs.test.BaseContextSensitiveTest.executeDataSet(BaseContextSensitiveTest.java:495)
	at org.openmrs.test.BaseContextSensitiveTest.initializeInMemoryDatabase(BaseContextSensitiveTest.java:436)
	at org.openmrs.test.BaseContextSensitiveTest.baseSetupWithStandardDataAndAuthentication(BaseContextSensitiveTest.java:687)
(36 more lines...)
Collapse Failed AppointmentStatusToLocalizedStatusTypeConverterTest shouldConvertToLocalizedString History
Default Job < 1 sec
org.dbunit.dataset.NoSuchTableException: person
	at org.dbunit.database.DatabaseDataSet.getTableMetaData(DatabaseDataSet.java:282)
	at org.dbunit.operation.AbstractOperation.getOperationMetaData(AbstractOperation.java:80)
	at org.dbunit.operation.RefreshOperation.execute(RefreshOperation.java:98)
	at org.openmrs.test.BaseContextSensitiveTest.executeDataSet(BaseContextSensitiveTest.java:583)
	at org.openmrs.test.BaseContextSensitiveTest.executeDataSet(BaseContextSensitiveTest.java:495)
	at org.openmrs.test.BaseContextSensitiveTest.initializeInMemoryDatabase(BaseContextSensitiveTest.java:436)
	at org.openmrs.test.BaseContextSensitiveTest.baseSetupWithStandardDataAndAuthentication(BaseContextSensitiveTest.java:687)
(36 more lines...)
Collapse Failed AppointmentSchedulingUIDataSetDefinitionLibraryTest testCreateDailyScheduledAppointmentDataSetDefinition History
Default Job < 1 sec
org.dbunit.dataset.NoSuchTableException: person
	at org.dbunit.database.DatabaseDataSet.getTableMetaData(DatabaseDataSet.java:282)
	at org.dbunit.operation.AbstractOperation.getOperationMetaData(AbstractOperation.java:80)
	at org.dbunit.operation.RefreshOperation.execute(RefreshOperation.java:98)
	at org.openmrs.test.BaseContextSensitiveTest.executeDataSet(BaseContextSensitiveTest.java:583)
	at org.openmrs.test.BaseContextSensitiveTest.executeDataSet(BaseContextSensitiveTest.java:495)
	at org.openmrs.test.BaseContextSensitiveTest.initializeInMemoryDatabase(BaseContextSensitiveTest.java:436)
	at org.openmrs.test.BaseContextSensitiveTest.baseSetupWithStandardDataAndAuthentication(BaseContextSensitiveTest.java:687)
(36 more lines...)