Build: #25 failed Manual run by Mark Goodrich

Stages & jobs

  1. Default Stage

  2. Release

    Requires a user to start manually

Build result summary

Details

Completed
Duration
31 seconds
Labels
None
Revisions
openmrs-packager-maven-plugin
fcf8e8f7e174434609fcc01d39d36f06bf9a4734 fcf8e8f7e174434609fcc01d39d36f06bf9a4734
Release scripts
ab83775184d5fb0f928388fa25ee675b855dd53c ab83775184d5fb0f928388fa25ee675b855dd53c
Total tests
8
Failing since
#24 (Changes by mgoodrich <mark.goodrich@live.com>)
Fixed in
#26 (Manual run by Mark Goodrich)

Tests

Responsible

This build has been failing since #24
No one has taken responsibility

Configuration changes

Plan configuration has changed since the last successful build. See the plan audit log for more details.

Tests

Existing test failures 8
Status Test Failing since View job Duration
org.apache.maven.it.VerificationException: Exit code was non-zero: 1; command line and log =  /usr/share/apache-maven-3.2.5/bin/mvn -N -X -e --batch-mode -Dmaven.repo.local=/home/bamboo-agent/.m2/repository org.apache.maven.plugins:maven-clean-plugin:clean compile Apache Maven 3.2.5 (12a6b3acb947671f09b81f49094c53f426d8cea1; 2014-12-14T17:29:23+00:00) Maven home: /usr/share/apache-maven-3.2.5 Java version: 1.8.0_242, vendor: Private Build Java home: /usr/lib/jvm/java-8-openjdk-amd64/jre Default locale: en_US, platform encoding: UTF-8 OS name: "linux", version: "4.4.0-174-generic", arch: "amd64", family: "unix" [INFO] Error stacktraces are turned on. [DEBUG] Reading global settings from /usr/share/apache-maven-3.2.5/conf/settings.xml [DEBUG] Reading user settings from /home/bamboo-agent/.m2/settings.xml [DEBUG] Using local repository at /home/bamboo-agent/.m2/repository [DEBUG] Using manager EnhancedLocalRepositoryManager with priority 10.0 for /home/bamboo-agent/.m2/repository [INFO] Scanning for projects... [DEBUG] Extension realms for project org.openmrs.maven.plugins:openmrs-packager-maven-plugin-config-test-parent:pom:1.0.0-SNAPSHOT: (none) [DEBUG] Looking up lifecyle mappings for packaging pom from ClassRealm[plexus.core, parent: null] [DEBUG] === REACTOR BUILD PLAN ================================================ [DEBUG] Project: org.openmrs.maven.plugins:openmrs-packager-maven-plugin-config-test-parent:pom:1.0.0-SNAPSHOT [DEBUG] Tasks:   [org.apache.maven.plugins:maven-clean-plugin:clean, compile] [DEBUG] Style:   Regular [DEBUG] ======================================================================= [INFO]                                                                          [INFO] ------------------------------------------------------------------------ [INFO] Building OpenMRS config parent test 1.0.0-SNAPSHOT [INFO] ------------------------------------------------------------------------ [DEBUG] Lifecycle default -> [validate, initialize, generate-sources, process-sources, generate-resources, process-resources, compile, process-classes, generate-test-sources, process-test-sources, generate-test-resources, process-test-resources, test-compile, process-test-classes, test, prepare-package, package, pre-integration-test, integration-test, post-integration-test, verify, install, deploy] [DEBUG] Lifecycle clean -> [pre-clean, clean, post-clean] [DEBUG] Lifecycle site -> [pre-site, site, post-site, site-deploy] [DEBUG] Could not find metadata org.openmrs.maven.plugins:openmrs-packager-maven-plugin:1.2.0-SNAPSHOT/maven-metadata.xml in local (/home/bamboo-agent/.m2/repository) [DEBUG] Could not find metadata org.openmrs.maven.plugins:openmrs-packager-maven-plugin:1.2.0-SNAPSHOT/maven-metadata.xml in local (/home/bamboo-agent/.m2/repository) [WARNING] The POM for org.openmrs.maven.plugins:openmrs-packager-maven-plugin:jar:1.2.0-SNAPSHOT is missing, no dependency information available [INFO] ------------------------------------------------------------------------ [INFO] BUILD FAILURE [INFO] ------------------------------------------------------------------------ [INFO] Total time: 0.164 s [INFO] Finished at: 2020-02-25T18:54:10+00:00 [INFO] Final Memory: 6M/106M [INFO] ------------------------------------------------------------------------ [ERROR] Plugin org.openmrs.maven.plugins:openmrs-packager-maven-plugin:1.2.0-SNAPSHOT or one of its dependencies could not be resolved: Could not find artifact org.openmrs.maven.plugins:openmrs-packager-maven-plugin:jar:1.2.0-SNAPSHOT -> [Help 1] org.apache.maven.plugin.PluginResolutionException: Plugin org.openmrs.maven.plugins:openmrs-packager-maven-plugin:1.2.0-SNAPSHOT or one of its dependencies could not be resolved: Could not find artifact org.openmrs.maven.plugins:openmrs-packager-maven-plugin:jar:1.2.0-SNAPSHOT  at org.apache.maven.plugin.internal.DefaultPluginDependenciesResolver.resolve(DefaultPluginDependenciesResolver.java:133)  at org.apache.maven.plugin.internal.DefaultMavenPluginManager.getPluginDescriptor(DefaultMavenPluginManager.java:150)  at org.apache.maven.plugin.internal.DefaultMavenPluginManager.getMojoDescriptor(DefaultMavenPluginManager.java:269)  at org.apache.maven.plugin.DefaultBuildPluginManager.getMojoDescriptor(DefaultBuildPluginManager.java:239)  at org.apache.maven.lifecycle.internal.DefaultLifecycleExecutionPlanCalculator.setupMojoExecution(DefaultLifecycleExecutionPlanCalculator.java:158)  at org.apache.maven.lifecycle.internal.DefaultLifecycleExecutionPlanCalculator.setupMojoExecutions(DefaultLifecycleExecutionPlanCalculator.java:145)  at org.apache.maven.lifecycle.internal.DefaultLifecycleExecutionPlanCalculator.calculateExecutionPlan(DefaultLifecycleExecutionPlanCalculator.java:122)  at org.apache.maven.lifecycle.internal.DefaultLifecycleExecutionPlanCalculator.calculateExecutionPlan(DefaultLifecycleExecutionPlanCalculator.java:135)  at org.apache.maven.lifecycle.internal.builder.BuilderCommon.resolveBuildPlan(BuilderCommon.java:97)  at org.apache.maven.lifecycle.internal.LifecycleModuleBuilder.buildProject(LifecycleModuleBuilder.java:109)  at org.apache.maven.lifecycle.internal.LifecycleModuleBuilder.buildProject(LifecycleModuleBuilder.java:80)  at org.apache.maven.lifecycle.internal.builder.singlethreaded.SingleThreadedBuilder.build(SingleThreadedBuilder.java:51)  at org.apache.maven.lifecycle.internal.LifecycleStarter.execute(LifecycleStarter.java:120)  at org.apache.maven.DefaultMaven.doExecute(DefaultMaven.java:355)  at org.apache.maven.DefaultMaven.execute(DefaultMaven.java:155)  at org.apache.maven.cli.MavenCli.execute(MavenCli.java:584)  at org.apache.maven.cli.MavenCli.doMain(MavenCli.java:216)  at org.apache.maven.cli.MavenCli.main(MavenCli.java:160)  at sun.reflect.NativeMethodAccessorImpl.invoke0(Native Method)  at sun.reflect.NativeMethodAccessorImpl.invoke(NativeMethodAccessorImpl.java:62)  at sun.reflect.DelegatingMethodAccessorImpl.invoke(DelegatingMethodAccessorImpl.java:43)  at java.lang.reflect.Method.invoke(Method.java:498)  at org.codehaus.plexus.classworlds.launcher.Launcher.launchEnhanced(Launcher.java:289)  at org.codehaus.plexus.classworlds.launcher.Launcher.launch(Launcher.java:229)  at org.codehaus.plexus.classworlds.launcher.Launcher.mainWithExitCode(Launcher.java:415)  at org.codehaus.plexus.classworlds.launcher.Launcher.main(Launcher.java:356) Caused by: org.eclipse.aether.resolution.ArtifactResolutionException: Could not find artifact org.openmrs.maven.plugins:openmrs-packager-maven-plugin:jar:1.2.0-SNAPSHOT  at org.eclipse.aether.internal.impl.DefaultArtifactResolver.resolve(DefaultArtifactResolver.java:444)  at org.eclipse.aether.internal.impl.DefaultArtifactResolver.resolveArtifacts(DefaultArtifactResolver.java:246)  at org.eclipse.aether.internal.impl.DefaultArtifactResolver.resolveArtifact(DefaultArtifactResolver.java:223)  at org.eclipse.aether.internal.impl.DefaultRepositorySystem.resolveArtifact(DefaultRepositorySystem.java:294)  at org.apache.maven.plugin.internal.DefaultPluginDependenciesResolver.resolve(DefaultPluginDependenciesResolver.java:129)  ... 25 more Caused by: org.eclipse.aether.transfer.ArtifactNotFoundException: Could not find artifact org.openmrs.maven.plugins:openmrs-packager-maven-plugin:jar:1.2.0-SNAPSHOT  at org.eclipse.aether.internal.impl.DefaultArtifactResolver.resolve(DefaultArtifactResolver.java:434)  ... 29 more [ERROR]  [ERROR]  [ERROR] For more information about the errors and possible solutions, please read the following articles: [ERROR] [Help 1] http://cwiki.apache.org/confluence/display/MAVEN/PluginResolutionException 
org.apache.maven.it.VerificationException: Exit code was non-zero: 1; command line and log = 
/usr/share/apache-maven-3.2.5/bin/mvn -N -X -e --batch-mode -Dmaven.repo.local=/home/bamboo-agent/.m2/repository org.apache.maven.plugins:maven-clean-plugin:clean compile
Apache Maven 3.2.5 (12a6b3acb947671f09b81f49094c53f426d8cea1; 2014-12-14T17:29:23+00:00)
Maven home: /usr/share/apache-maven-3.2.5
Java version: 1.8.0_242, vendor: Private Build
Java home: /usr/lib/jvm/java-8-openjdk-amd64/jre
Default locale: en_US, platform encoding: UTF-8
(108 more lines...)
org.apache.maven.it.VerificationException: Exit code was non-zero: 1; command line and log =  /usr/share/apache-maven-3.2.5/bin/mvn -N -X -e --batch-mode -Dmaven.repo.local=/home/bamboo-agent/.m2/repository org.apache.maven.plugins:maven-clean-plugin:clean install Apache Maven 3.2.5 (12a6b3acb947671f09b81f49094c53f426d8cea1; 2014-12-14T17:29:23+00:00) Maven home: /usr/share/apache-maven-3.2.5 Java version: 1.8.0_242, vendor: Private Build Java home: /usr/lib/jvm/java-8-openjdk-amd64/jre Default locale: en_US, platform encoding: UTF-8 OS name: "linux", version: "4.4.0-174-generic", arch: "amd64", family: "unix" [INFO] Error stacktraces are turned on. [DEBUG] Reading global settings from /usr/share/apache-maven-3.2.5/conf/settings.xml [DEBUG] Reading user settings from /home/bamboo-agent/.m2/settings.xml [DEBUG] Using local repository at /home/bamboo-agent/.m2/repository [DEBUG] Using manager EnhancedLocalRepositoryManager with priority 10.0 for /home/bamboo-agent/.m2/repository [INFO] Scanning for projects... [DEBUG] Extension realms for project org.openmrs.maven.plugins:openmrs-packager-maven-plugin-config-test-parent:pom:1.0.0-SNAPSHOT: (none) [DEBUG] Looking up lifecyle mappings for packaging pom from ClassRealm[plexus.core, parent: null] [DEBUG] === REACTOR BUILD PLAN ================================================ [DEBUG] Project: org.openmrs.maven.plugins:openmrs-packager-maven-plugin-config-test-parent:pom:1.0.0-SNAPSHOT [DEBUG] Tasks:   [org.apache.maven.plugins:maven-clean-plugin:clean, install] [DEBUG] Style:   Regular [DEBUG] ======================================================================= [INFO]                                                                          [INFO] ------------------------------------------------------------------------ [INFO] Building OpenMRS config parent test 1.0.0-SNAPSHOT [INFO] ------------------------------------------------------------------------ [DEBUG] Lifecycle default -> [validate, initialize, generate-sources, process-sources, generate-resources, process-resources, compile, process-classes, generate-test-sources, process-test-sources, generate-test-resources, process-test-resources, test-compile, process-test-classes, test, prepare-package, package, pre-integration-test, integration-test, post-integration-test, verify, install, deploy] [DEBUG] Lifecycle clean -> [pre-clean, clean, post-clean] [DEBUG] Lifecycle site -> [pre-site, site, post-site, site-deploy] [DEBUG] Could not find metadata org.openmrs.maven.plugins:openmrs-packager-maven-plugin:1.2.0-SNAPSHOT/maven-metadata.xml in local (/home/bamboo-agent/.m2/repository) [DEBUG] Could not find metadata org.openmrs.maven.plugins:openmrs-packager-maven-plugin:1.2.0-SNAPSHOT/maven-metadata.xml in local (/home/bamboo-agent/.m2/repository) [WARNING] The POM for org.openmrs.maven.plugins:openmrs-packager-maven-plugin:jar:1.2.0-SNAPSHOT is missing, no dependency information available [INFO] ------------------------------------------------------------------------ [INFO] BUILD FAILURE [INFO] ------------------------------------------------------------------------ [INFO] Total time: 0.152 s [INFO] Finished at: 2020-02-25T18:54:26+00:00 [INFO] Final Memory: 6M/106M [INFO] ------------------------------------------------------------------------ [ERROR] Plugin org.openmrs.maven.plugins:openmrs-packager-maven-plugin:1.2.0-SNAPSHOT or one of its dependencies could not be resolved: Could not find artifact org.openmrs.maven.plugins:openmrs-packager-maven-plugin:jar:1.2.0-SNAPSHOT -> [Help 1] org.apache.maven.plugin.PluginResolutionException: Plugin org.openmrs.maven.plugins:openmrs-packager-maven-plugin:1.2.0-SNAPSHOT or one of its dependencies could not be resolved: Could not find artifact org.openmrs.maven.plugins:openmrs-packager-maven-plugin:jar:1.2.0-SNAPSHOT  at org.apache.maven.plugin.internal.DefaultPluginDependenciesResolver.resolve(DefaultPluginDependenciesResolver.java:133)  at org.apache.maven.plugin.internal.DefaultMavenPluginManager.getPluginDescriptor(DefaultMavenPluginManager.java:150)  at org.apache.maven.plugin.internal.DefaultMavenPluginManager.getMojoDescriptor(DefaultMavenPluginManager.java:269)  at org.apache.maven.plugin.DefaultBuildPluginManager.getMojoDescriptor(DefaultBuildPluginManager.java:239)  at org.apache.maven.lifecycle.internal.DefaultLifecycleExecutionPlanCalculator.setupMojoExecution(DefaultLifecycleExecutionPlanCalculator.java:158)  at org.apache.maven.lifecycle.internal.DefaultLifecycleExecutionPlanCalculator.setupMojoExecutions(DefaultLifecycleExecutionPlanCalculator.java:145)  at org.apache.maven.lifecycle.internal.DefaultLifecycleExecutionPlanCalculator.calculateExecutionPlan(DefaultLifecycleExecutionPlanCalculator.java:122)  at org.apache.maven.lifecycle.internal.DefaultLifecycleExecutionPlanCalculator.calculateExecutionPlan(DefaultLifecycleExecutionPlanCalculator.java:135)  at org.apache.maven.lifecycle.internal.builder.BuilderCommon.resolveBuildPlan(BuilderCommon.java:97)  at org.apache.maven.lifecycle.internal.LifecycleModuleBuilder.buildProject(LifecycleModuleBuilder.java:109)  at org.apache.maven.lifecycle.internal.LifecycleModuleBuilder.buildProject(LifecycleModuleBuilder.java:80)  at org.apache.maven.lifecycle.internal.builder.singlethreaded.SingleThreadedBuilder.build(SingleThreadedBuilder.java:51)  at org.apache.maven.lifecycle.internal.LifecycleStarter.execute(LifecycleStarter.java:120)  at org.apache.maven.DefaultMaven.doExecute(DefaultMaven.java:355)  at org.apache.maven.DefaultMaven.execute(DefaultMaven.java:155)  at org.apache.maven.cli.MavenCli.execute(MavenCli.java:584)  at org.apache.maven.cli.MavenCli.doMain(MavenCli.java:216)  at org.apache.maven.cli.MavenCli.main(MavenCli.java:160)  at sun.reflect.NativeMethodAccessorImpl.invoke0(Native Method)  at sun.reflect.NativeMethodAccessorImpl.invoke(NativeMethodAccessorImpl.java:62)  at sun.reflect.DelegatingMethodAccessorImpl.invoke(DelegatingMethodAccessorImpl.java:43)  at java.lang.reflect.Method.invoke(Method.java:498)  at org.codehaus.plexus.classworlds.launcher.Launcher.launchEnhanced(Launcher.java:289)  at org.codehaus.plexus.classworlds.launcher.Launcher.launch(Launcher.java:229)  at org.codehaus.plexus.classworlds.launcher.Launcher.mainWithExitCode(Launcher.java:415)  at org.codehaus.plexus.classworlds.launcher.Launcher.main(Launcher.java:356) Caused by: org.eclipse.aether.resolution.ArtifactResolutionException: Could not find artifact org.openmrs.maven.plugins:openmrs-packager-maven-plugin:jar:1.2.0-SNAPSHOT  at org.eclipse.aether.internal.impl.DefaultArtifactResolver.resolve(DefaultArtifactResolver.java:444)  at org.eclipse.aether.internal.impl.DefaultArtifactResolver.resolveArtifacts(DefaultArtifactResolver.java:246)  at org.eclipse.aether.internal.impl.DefaultArtifactResolver.resolveArtifact(DefaultArtifactResolver.java:223)  at org.eclipse.aether.internal.impl.DefaultRepositorySystem.resolveArtifact(DefaultRepositorySystem.java:294)  at org.apache.maven.plugin.internal.DefaultPluginDependenciesResolver.resolve(DefaultPluginDependenciesResolver.java:129)  ... 25 more Caused by: org.eclipse.aether.transfer.ArtifactNotFoundException: Could not find artifact org.openmrs.maven.plugins:openmrs-packager-maven-plugin:jar:1.2.0-SNAPSHOT  at org.eclipse.aether.internal.impl.DefaultArtifactResolver.resolve(DefaultArtifactResolver.java:434)  ... 29 more [ERROR]  [ERROR]  [ERROR] For more information about the errors and possible solutions, please read the following articles: [ERROR] [Help 1] http://cwiki.apache.org/confluence/display/MAVEN/PluginResolutionException 
org.apache.maven.it.VerificationException: Exit code was non-zero: 1; command line and log = 
/usr/share/apache-maven-3.2.5/bin/mvn -N -X -e --batch-mode -Dmaven.repo.local=/home/bamboo-agent/.m2/repository org.apache.maven.plugins:maven-clean-plugin:clean install
Apache Maven 3.2.5 (12a6b3acb947671f09b81f49094c53f426d8cea1; 2014-12-14T17:29:23+00:00)
Maven home: /usr/share/apache-maven-3.2.5
Java version: 1.8.0_242, vendor: Private Build
Java home: /usr/lib/jvm/java-8-openjdk-amd64/jre
Default locale: en_US, platform encoding: UTF-8
(108 more lines...)
org.apache.maven.it.VerificationException: Exit code was non-zero: 1; command line and log =  /usr/share/apache-maven-3.2.5/bin/mvn -N -X -e --batch-mode -Dmaven.repo.local=/home/bamboo-agent/.m2/repository org.apache.maven.plugins:maven-clean-plugin:clean install Apache Maven 3.2.5 (12a6b3acb947671f09b81f49094c53f426d8cea1; 2014-12-14T17:29:23+00:00) Maven home: /usr/share/apache-maven-3.2.5 Java version: 1.8.0_242, vendor: Private Build Java home: /usr/lib/jvm/java-8-openjdk-amd64/jre Default locale: en_US, platform encoding: UTF-8 OS name: "linux", version: "4.4.0-174-generic", arch: "amd64", family: "unix" [INFO] Error stacktraces are turned on. [DEBUG] Reading global settings from /usr/share/apache-maven-3.2.5/conf/settings.xml [DEBUG] Reading user settings from /home/bamboo-agent/.m2/settings.xml [DEBUG] Using local repository at /home/bamboo-agent/.m2/repository [DEBUG] Using manager EnhancedLocalRepositoryManager with priority 10.0 for /home/bamboo-agent/.m2/repository [INFO] Scanning for projects... [DEBUG] Extension realms for project org.openmrs.maven.plugins:openmrs-packager-maven-plugin-config-test-parent:pom:1.0.0-SNAPSHOT: (none) [DEBUG] Looking up lifecyle mappings for packaging pom from ClassRealm[plexus.core, parent: null] [DEBUG] === REACTOR BUILD PLAN ================================================ [DEBUG] Project: org.openmrs.maven.plugins:openmrs-packager-maven-plugin-config-test-parent:pom:1.0.0-SNAPSHOT [DEBUG] Tasks:   [org.apache.maven.plugins:maven-clean-plugin:clean, install] [DEBUG] Style:   Regular [DEBUG] ======================================================================= [INFO]                                                                          [INFO] ------------------------------------------------------------------------ [INFO] Building OpenMRS config parent test 1.0.0-SNAPSHOT [INFO] ------------------------------------------------------------------------ [DEBUG] Lifecycle default -> [validate, initialize, generate-sources, process-sources, generate-resources, process-resources, compile, process-classes, generate-test-sources, process-test-sources, generate-test-resources, process-test-resources, test-compile, process-test-classes, test, prepare-package, package, pre-integration-test, integration-test, post-integration-test, verify, install, deploy] [DEBUG] Lifecycle clean -> [pre-clean, clean, post-clean] [DEBUG] Lifecycle site -> [pre-site, site, post-site, site-deploy] [DEBUG] Could not find metadata org.openmrs.maven.plugins:openmrs-packager-maven-plugin:1.2.0-SNAPSHOT/maven-metadata.xml in local (/home/bamboo-agent/.m2/repository) [DEBUG] Could not find metadata org.openmrs.maven.plugins:openmrs-packager-maven-plugin:1.2.0-SNAPSHOT/maven-metadata.xml in local (/home/bamboo-agent/.m2/repository) [WARNING] The POM for org.openmrs.maven.plugins:openmrs-packager-maven-plugin:jar:1.2.0-SNAPSHOT is missing, no dependency information available [INFO] ------------------------------------------------------------------------ [INFO] BUILD FAILURE [INFO] ------------------------------------------------------------------------ [INFO] Total time: 0.239 s [INFO] Finished at: 2020-02-25T18:54:19+00:00 [INFO] Final Memory: 6M/106M [INFO] ------------------------------------------------------------------------ [ERROR] Plugin org.openmrs.maven.plugins:openmrs-packager-maven-plugin:1.2.0-SNAPSHOT or one of its dependencies could not be resolved: Could not find artifact org.openmrs.maven.plugins:openmrs-packager-maven-plugin:jar:1.2.0-SNAPSHOT -> [Help 1] org.apache.maven.plugin.PluginResolutionException: Plugin org.openmrs.maven.plugins:openmrs-packager-maven-plugin:1.2.0-SNAPSHOT or one of its dependencies could not be resolved: Could not find artifact org.openmrs.maven.plugins:openmrs-packager-maven-plugin:jar:1.2.0-SNAPSHOT  at org.apache.maven.plugin.internal.DefaultPluginDependenciesResolver.resolve(DefaultPluginDependenciesResolver.java:133)  at org.apache.maven.plugin.internal.DefaultMavenPluginManager.getPluginDescriptor(DefaultMavenPluginManager.java:150)  at org.apache.maven.plugin.internal.DefaultMavenPluginManager.getMojoDescriptor(DefaultMavenPluginManager.java:269)  at org.apache.maven.plugin.DefaultBuildPluginManager.getMojoDescriptor(DefaultBuildPluginManager.java:239)  at org.apache.maven.lifecycle.internal.DefaultLifecycleExecutionPlanCalculator.setupMojoExecution(DefaultLifecycleExecutionPlanCalculator.java:158)  at org.apache.maven.lifecycle.internal.DefaultLifecycleExecutionPlanCalculator.setupMojoExecutions(DefaultLifecycleExecutionPlanCalculator.java:145)  at org.apache.maven.lifecycle.internal.DefaultLifecycleExecutionPlanCalculator.calculateExecutionPlan(DefaultLifecycleExecutionPlanCalculator.java:122)  at org.apache.maven.lifecycle.internal.DefaultLifecycleExecutionPlanCalculator.calculateExecutionPlan(DefaultLifecycleExecutionPlanCalculator.java:135)  at org.apache.maven.lifecycle.internal.builder.BuilderCommon.resolveBuildPlan(BuilderCommon.java:97)  at org.apache.maven.lifecycle.internal.LifecycleModuleBuilder.buildProject(LifecycleModuleBuilder.java:109)  at org.apache.maven.lifecycle.internal.LifecycleModuleBuilder.buildProject(LifecycleModuleBuilder.java:80)  at org.apache.maven.lifecycle.internal.builder.singlethreaded.SingleThreadedBuilder.build(SingleThreadedBuilder.java:51)  at org.apache.maven.lifecycle.internal.LifecycleStarter.execute(LifecycleStarter.java:120)  at org.apache.maven.DefaultMaven.doExecute(DefaultMaven.java:355)  at org.apache.maven.DefaultMaven.execute(DefaultMaven.java:155)  at org.apache.maven.cli.MavenCli.execute(MavenCli.java:584)  at org.apache.maven.cli.MavenCli.doMain(MavenCli.java:216)  at org.apache.maven.cli.MavenCli.main(MavenCli.java:160)  at sun.reflect.NativeMethodAccessorImpl.invoke0(Native Method)  at sun.reflect.NativeMethodAccessorImpl.invoke(NativeMethodAccessorImpl.java:62)  at sun.reflect.DelegatingMethodAccessorImpl.invoke(DelegatingMethodAccessorImpl.java:43)  at java.lang.reflect.Method.invoke(Method.java:498)  at org.codehaus.plexus.classworlds.launcher.Launcher.launchEnhanced(Launcher.java:289)  at org.codehaus.plexus.classworlds.launcher.Launcher.launch(Launcher.java:229)  at org.codehaus.plexus.classworlds.launcher.Launcher.mainWithExitCode(Launcher.java:415)  at org.codehaus.plexus.classworlds.launcher.Launcher.main(Launcher.java:356) Caused by: org.eclipse.aether.resolution.ArtifactResolutionException: Could not find artifact org.openmrs.maven.plugins:openmrs-packager-maven-plugin:jar:1.2.0-SNAPSHOT  at org.eclipse.aether.internal.impl.DefaultArtifactResolver.resolve(DefaultArtifactResolver.java:444)  at org.eclipse.aether.internal.impl.DefaultArtifactResolver.resolveArtifacts(DefaultArtifactResolver.java:246)  at org.eclipse.aether.internal.impl.DefaultArtifactResolver.resolveArtifact(DefaultArtifactResolver.java:223)  at org.eclipse.aether.internal.impl.DefaultRepositorySystem.resolveArtifact(DefaultRepositorySystem.java:294)  at org.apache.maven.plugin.internal.DefaultPluginDependenciesResolver.resolve(DefaultPluginDependenciesResolver.java:129)  ... 25 more Caused by: org.eclipse.aether.transfer.ArtifactNotFoundException: Could not find artifact org.openmrs.maven.plugins:openmrs-packager-maven-plugin:jar:1.2.0-SNAPSHOT  at org.eclipse.aether.internal.impl.DefaultArtifactResolver.resolve(DefaultArtifactResolver.java:434)  ... 29 more [ERROR]  [ERROR]  [ERROR] For more information about the errors and possible solutions, please read the following articles: [ERROR] [Help 1] http://cwiki.apache.org/confluence/display/MAVEN/PluginResolutionException 
org.apache.maven.it.VerificationException: Exit code was non-zero: 1; command line and log = 
/usr/share/apache-maven-3.2.5/bin/mvn -N -X -e --batch-mode -Dmaven.repo.local=/home/bamboo-agent/.m2/repository org.apache.maven.plugins:maven-clean-plugin:clean install
Apache Maven 3.2.5 (12a6b3acb947671f09b81f49094c53f426d8cea1; 2014-12-14T17:29:23+00:00)
Maven home: /usr/share/apache-maven-3.2.5
Java version: 1.8.0_242, vendor: Private Build
Java home: /usr/lib/jvm/java-8-openjdk-amd64/jre
Default locale: en_US, platform encoding: UTF-8
(108 more lines...)
org.apache.maven.it.VerificationException: Exit code was non-zero: 1; command line and log =  /usr/share/apache-maven-3.2.5/bin/mvn -N -X -e --batch-mode -Dmaven.repo.local=/home/bamboo-agent/.m2/repository org.apache.maven.plugins:maven-clean-plugin:clean install Apache Maven 3.2.5 (12a6b3acb947671f09b81f49094c53f426d8cea1; 2014-12-14T17:29:23+00:00) Maven home: /usr/share/apache-maven-3.2.5 Java version: 1.8.0_242, vendor: Private Build Java home: /usr/lib/jvm/java-8-openjdk-amd64/jre Default locale: en_US, platform encoding: UTF-8 OS name: "linux", version: "4.4.0-174-generic", arch: "amd64", family: "unix" [INFO] Error stacktraces are turned on. [DEBUG] Reading global settings from /usr/share/apache-maven-3.2.5/conf/settings.xml [DEBUG] Reading user settings from /home/bamboo-agent/.m2/settings.xml [DEBUG] Using local repository at /home/bamboo-agent/.m2/repository [DEBUG] Using manager EnhancedLocalRepositoryManager with priority 10.0 for /home/bamboo-agent/.m2/repository [INFO] Scanning for projects... [DEBUG] Extension realms for project org.openmrs.maven.plugins:openmrs-packager-maven-plugin-config-test-parent:pom:1.0.0-SNAPSHOT: (none) [DEBUG] Looking up lifecyle mappings for packaging pom from ClassRealm[plexus.core, parent: null] [DEBUG] === REACTOR BUILD PLAN ================================================ [DEBUG] Project: org.openmrs.maven.plugins:openmrs-packager-maven-plugin-config-test-parent:pom:1.0.0-SNAPSHOT [DEBUG] Tasks:   [org.apache.maven.plugins:maven-clean-plugin:clean, install] [DEBUG] Style:   Regular [DEBUG] ======================================================================= [INFO]                                                                          [INFO] ------------------------------------------------------------------------ [INFO] Building OpenMRS config parent test 1.0.0-SNAPSHOT [INFO] ------------------------------------------------------------------------ [DEBUG] Lifecycle default -> [validate, initialize, generate-sources, process-sources, generate-resources, process-resources, compile, process-classes, generate-test-sources, process-test-sources, generate-test-resources, process-test-resources, test-compile, process-test-classes, test, prepare-package, package, pre-integration-test, integration-test, post-integration-test, verify, install, deploy] [DEBUG] Lifecycle clean -> [pre-clean, clean, post-clean] [DEBUG] Lifecycle site -> [pre-site, site, post-site, site-deploy] [DEBUG] Could not find metadata org.openmrs.maven.plugins:openmrs-packager-maven-plugin:1.2.0-SNAPSHOT/maven-metadata.xml in local (/home/bamboo-agent/.m2/repository) [DEBUG] Could not find metadata org.openmrs.maven.plugins:openmrs-packager-maven-plugin:1.2.0-SNAPSHOT/maven-metadata.xml in local (/home/bamboo-agent/.m2/repository) [WARNING] The POM for org.openmrs.maven.plugins:openmrs-packager-maven-plugin:jar:1.2.0-SNAPSHOT is missing, no dependency information available [INFO] ------------------------------------------------------------------------ [INFO] BUILD FAILURE [INFO] ------------------------------------------------------------------------ [INFO] Total time: 0.176 s [INFO] Finished at: 2020-02-25T18:54:21+00:00 [INFO] Final Memory: 6M/106M [INFO] ------------------------------------------------------------------------ [ERROR] Plugin org.openmrs.maven.plugins:openmrs-packager-maven-plugin:1.2.0-SNAPSHOT or one of its dependencies could not be resolved: Could not find artifact org.openmrs.maven.plugins:openmrs-packager-maven-plugin:jar:1.2.0-SNAPSHOT -> [Help 1] org.apache.maven.plugin.PluginResolutionException: Plugin org.openmrs.maven.plugins:openmrs-packager-maven-plugin:1.2.0-SNAPSHOT or one of its dependencies could not be resolved: Could not find artifact org.openmrs.maven.plugins:openmrs-packager-maven-plugin:jar:1.2.0-SNAPSHOT  at org.apache.maven.plugin.internal.DefaultPluginDependenciesResolver.resolve(DefaultPluginDependenciesResolver.java:133)  at org.apache.maven.plugin.internal.DefaultMavenPluginManager.getPluginDescriptor(DefaultMavenPluginManager.java:150)  at org.apache.maven.plugin.internal.DefaultMavenPluginManager.getMojoDescriptor(DefaultMavenPluginManager.java:269)  at org.apache.maven.plugin.DefaultBuildPluginManager.getMojoDescriptor(DefaultBuildPluginManager.java:239)  at org.apache.maven.lifecycle.internal.DefaultLifecycleExecutionPlanCalculator.setupMojoExecution(DefaultLifecycleExecutionPlanCalculator.java:158)  at org.apache.maven.lifecycle.internal.DefaultLifecycleExecutionPlanCalculator.setupMojoExecutions(DefaultLifecycleExecutionPlanCalculator.java:145)  at org.apache.maven.lifecycle.internal.DefaultLifecycleExecutionPlanCalculator.calculateExecutionPlan(DefaultLifecycleExecutionPlanCalculator.java:122)  at org.apache.maven.lifecycle.internal.DefaultLifecycleExecutionPlanCalculator.calculateExecutionPlan(DefaultLifecycleExecutionPlanCalculator.java:135)  at org.apache.maven.lifecycle.internal.builder.BuilderCommon.resolveBuildPlan(BuilderCommon.java:97)  at org.apache.maven.lifecycle.internal.LifecycleModuleBuilder.buildProject(LifecycleModuleBuilder.java:109)  at org.apache.maven.lifecycle.internal.LifecycleModuleBuilder.buildProject(LifecycleModuleBuilder.java:80)  at org.apache.maven.lifecycle.internal.builder.singlethreaded.SingleThreadedBuilder.build(SingleThreadedBuilder.java:51)  at org.apache.maven.lifecycle.internal.LifecycleStarter.execute(LifecycleStarter.java:120)  at org.apache.maven.DefaultMaven.doExecute(DefaultMaven.java:355)  at org.apache.maven.DefaultMaven.execute(DefaultMaven.java:155)  at org.apache.maven.cli.MavenCli.execute(MavenCli.java:584)  at org.apache.maven.cli.MavenCli.doMain(MavenCli.java:216)  at org.apache.maven.cli.MavenCli.main(MavenCli.java:160)  at sun.reflect.NativeMethodAccessorImpl.invoke0(Native Method)  at sun.reflect.NativeMethodAccessorImpl.invoke(NativeMethodAccessorImpl.java:62)  at sun.reflect.DelegatingMethodAccessorImpl.invoke(DelegatingMethodAccessorImpl.java:43)  at java.lang.reflect.Method.invoke(Method.java:498)  at org.codehaus.plexus.classworlds.launcher.Launcher.launchEnhanced(Launcher.java:289)  at org.codehaus.plexus.classworlds.launcher.Launcher.launch(Launcher.java:229)  at org.codehaus.plexus.classworlds.launcher.Launcher.mainWithExitCode(Launcher.java:415)  at org.codehaus.plexus.classworlds.launcher.Launcher.main(Launcher.java:356) Caused by: org.eclipse.aether.resolution.ArtifactResolutionException: Could not find artifact org.openmrs.maven.plugins:openmrs-packager-maven-plugin:jar:1.2.0-SNAPSHOT  at org.eclipse.aether.internal.impl.DefaultArtifactResolver.resolve(DefaultArtifactResolver.java:444)  at org.eclipse.aether.internal.impl.DefaultArtifactResolver.resolveArtifacts(DefaultArtifactResolver.java:246)  at org.eclipse.aether.internal.impl.DefaultArtifactResolver.resolveArtifact(DefaultArtifactResolver.java:223)  at org.eclipse.aether.internal.impl.DefaultRepositorySystem.resolveArtifact(DefaultRepositorySystem.java:294)  at org.apache.maven.plugin.internal.DefaultPluginDependenciesResolver.resolve(DefaultPluginDependenciesResolver.java:129)  ... 25 more Caused by: org.eclipse.aether.transfer.ArtifactNotFoundException: Could not find artifact org.openmrs.maven.plugins:openmrs-packager-maven-plugin:jar:1.2.0-SNAPSHOT  at org.eclipse.aether.internal.impl.DefaultArtifactResolver.resolve(DefaultArtifactResolver.java:434)  ... 29 more [ERROR]  [ERROR]  [ERROR] For more information about the errors and possible solutions, please read the following articles: [ERROR] [Help 1] http://cwiki.apache.org/confluence/display/MAVEN/PluginResolutionException 
org.apache.maven.it.VerificationException: Exit code was non-zero: 1; command line and log = 
/usr/share/apache-maven-3.2.5/bin/mvn -N -X -e --batch-mode -Dmaven.repo.local=/home/bamboo-agent/.m2/repository org.apache.maven.plugins:maven-clean-plugin:clean install
Apache Maven 3.2.5 (12a6b3acb947671f09b81f49094c53f426d8cea1; 2014-12-14T17:29:23+00:00)
Maven home: /usr/share/apache-maven-3.2.5
Java version: 1.8.0_242, vendor: Private Build
Java home: /usr/lib/jvm/java-8-openjdk-amd64/jre
Default locale: en_US, platform encoding: UTF-8
(108 more lines...)
org.apache.maven.it.VerificationException: Exit code was non-zero: 1; command line and log =  /usr/share/apache-maven-3.2.5/bin/mvn -N -X -e --batch-mode -Dmaven.repo.local=/home/bamboo-agent/.m2/repository org.apache.maven.plugins:maven-clean-plugin:clean install Apache Maven 3.2.5 (12a6b3acb947671f09b81f49094c53f426d8cea1; 2014-12-14T17:29:23+00:00) Maven home: /usr/share/apache-maven-3.2.5 Java version: 1.8.0_242, vendor: Private Build Java home: /usr/lib/jvm/java-8-openjdk-amd64/jre Default locale: en_US, platform encoding: UTF-8 OS name: "linux", version: "4.4.0-174-generic", arch: "amd64", family: "unix" [INFO] Error stacktraces are turned on. [DEBUG] Reading global settings from /usr/share/apache-maven-3.2.5/conf/settings.xml [DEBUG] Reading user settings from /home/bamboo-agent/.m2/settings.xml [DEBUG] Using local repository at /home/bamboo-agent/.m2/repository [DEBUG] Using manager EnhancedLocalRepositoryManager with priority 10.0 for /home/bamboo-agent/.m2/repository [INFO] Scanning for projects... [DEBUG] Extension realms for project org.openmrs.maven.plugins:openmrs-packager-maven-plugin-config-test-parent:pom:1.0.0-SNAPSHOT: (none) [DEBUG] Looking up lifecyle mappings for packaging pom from ClassRealm[plexus.core, parent: null] [DEBUG] === REACTOR BUILD PLAN ================================================ [DEBUG] Project: org.openmrs.maven.plugins:openmrs-packager-maven-plugin-config-test-parent:pom:1.0.0-SNAPSHOT [DEBUG] Tasks:   [org.apache.maven.plugins:maven-clean-plugin:clean, install] [DEBUG] Style:   Regular [DEBUG] ======================================================================= [INFO]                                                                          [INFO] ------------------------------------------------------------------------ [INFO] Building OpenMRS config parent test 1.0.0-SNAPSHOT [INFO] ------------------------------------------------------------------------ [DEBUG] Lifecycle default -> [validate, initialize, generate-sources, process-sources, generate-resources, process-resources, compile, process-classes, generate-test-sources, process-test-sources, generate-test-resources, process-test-resources, test-compile, process-test-classes, test, prepare-package, package, pre-integration-test, integration-test, post-integration-test, verify, install, deploy] [DEBUG] Lifecycle clean -> [pre-clean, clean, post-clean] [DEBUG] Lifecycle site -> [pre-site, site, post-site, site-deploy] [DEBUG] Could not find metadata org.openmrs.maven.plugins:openmrs-packager-maven-plugin:1.2.0-SNAPSHOT/maven-metadata.xml in local (/home/bamboo-agent/.m2/repository) [DEBUG] Could not find metadata org.openmrs.maven.plugins:openmrs-packager-maven-plugin:1.2.0-SNAPSHOT/maven-metadata.xml in local (/home/bamboo-agent/.m2/repository) [WARNING] The POM for org.openmrs.maven.plugins:openmrs-packager-maven-plugin:jar:1.2.0-SNAPSHOT is missing, no dependency information available [INFO] ------------------------------------------------------------------------ [INFO] BUILD FAILURE [INFO] ------------------------------------------------------------------------ [INFO] Total time: 0.149 s [INFO] Finished at: 2020-02-25T18:54:24+00:00 [INFO] Final Memory: 6M/106M [INFO] ------------------------------------------------------------------------ [ERROR] Plugin org.openmrs.maven.plugins:openmrs-packager-maven-plugin:1.2.0-SNAPSHOT or one of its dependencies could not be resolved: Could not find artifact org.openmrs.maven.plugins:openmrs-packager-maven-plugin:jar:1.2.0-SNAPSHOT -> [Help 1] org.apache.maven.plugin.PluginResolutionException: Plugin org.openmrs.maven.plugins:openmrs-packager-maven-plugin:1.2.0-SNAPSHOT or one of its dependencies could not be resolved: Could not find artifact org.openmrs.maven.plugins:openmrs-packager-maven-plugin:jar:1.2.0-SNAPSHOT  at org.apache.maven.plugin.internal.DefaultPluginDependenciesResolver.resolve(DefaultPluginDependenciesResolver.java:133)  at org.apache.maven.plugin.internal.DefaultMavenPluginManager.getPluginDescriptor(DefaultMavenPluginManager.java:150)  at org.apache.maven.plugin.internal.DefaultMavenPluginManager.getMojoDescriptor(DefaultMavenPluginManager.java:269)  at org.apache.maven.plugin.DefaultBuildPluginManager.getMojoDescriptor(DefaultBuildPluginManager.java:239)  at org.apache.maven.lifecycle.internal.DefaultLifecycleExecutionPlanCalculator.setupMojoExecution(DefaultLifecycleExecutionPlanCalculator.java:158)  at org.apache.maven.lifecycle.internal.DefaultLifecycleExecutionPlanCalculator.setupMojoExecutions(DefaultLifecycleExecutionPlanCalculator.java:145)  at org.apache.maven.lifecycle.internal.DefaultLifecycleExecutionPlanCalculator.calculateExecutionPlan(DefaultLifecycleExecutionPlanCalculator.java:122)  at org.apache.maven.lifecycle.internal.DefaultLifecycleExecutionPlanCalculator.calculateExecutionPlan(DefaultLifecycleExecutionPlanCalculator.java:135)  at org.apache.maven.lifecycle.internal.builder.BuilderCommon.resolveBuildPlan(BuilderCommon.java:97)  at org.apache.maven.lifecycle.internal.LifecycleModuleBuilder.buildProject(LifecycleModuleBuilder.java:109)  at org.apache.maven.lifecycle.internal.LifecycleModuleBuilder.buildProject(LifecycleModuleBuilder.java:80)  at org.apache.maven.lifecycle.internal.builder.singlethreaded.SingleThreadedBuilder.build(SingleThreadedBuilder.java:51)  at org.apache.maven.lifecycle.internal.LifecycleStarter.execute(LifecycleStarter.java:120)  at org.apache.maven.DefaultMaven.doExecute(DefaultMaven.java:355)  at org.apache.maven.DefaultMaven.execute(DefaultMaven.java:155)  at org.apache.maven.cli.MavenCli.execute(MavenCli.java:584)  at org.apache.maven.cli.MavenCli.doMain(MavenCli.java:216)  at org.apache.maven.cli.MavenCli.main(MavenCli.java:160)  at sun.reflect.NativeMethodAccessorImpl.invoke0(Native Method)  at sun.reflect.NativeMethodAccessorImpl.invoke(NativeMethodAccessorImpl.java:62)  at sun.reflect.DelegatingMethodAccessorImpl.invoke(DelegatingMethodAccessorImpl.java:43)  at java.lang.reflect.Method.invoke(Method.java:498)  at org.codehaus.plexus.classworlds.launcher.Launcher.launchEnhanced(Launcher.java:289)  at org.codehaus.plexus.classworlds.launcher.Launcher.launch(Launcher.java:229)  at org.codehaus.plexus.classworlds.launcher.Launcher.mainWithExitCode(Launcher.java:415)  at org.codehaus.plexus.classworlds.launcher.Launcher.main(Launcher.java:356) Caused by: org.eclipse.aether.resolution.ArtifactResolutionException: Could not find artifact org.openmrs.maven.plugins:openmrs-packager-maven-plugin:jar:1.2.0-SNAPSHOT  at org.eclipse.aether.internal.impl.DefaultArtifactResolver.resolve(DefaultArtifactResolver.java:444)  at org.eclipse.aether.internal.impl.DefaultArtifactResolver.resolveArtifacts(DefaultArtifactResolver.java:246)  at org.eclipse.aether.internal.impl.DefaultArtifactResolver.resolveArtifact(DefaultArtifactResolver.java:223)  at org.eclipse.aether.internal.impl.DefaultRepositorySystem.resolveArtifact(DefaultRepositorySystem.java:294)  at org.apache.maven.plugin.internal.DefaultPluginDependenciesResolver.resolve(DefaultPluginDependenciesResolver.java:129)  ... 25 more Caused by: org.eclipse.aether.transfer.ArtifactNotFoundException: Could not find artifact org.openmrs.maven.plugins:openmrs-packager-maven-plugin:jar:1.2.0-SNAPSHOT  at org.eclipse.aether.internal.impl.DefaultArtifactResolver.resolve(DefaultArtifactResolver.java:434)  ... 29 more [ERROR]  [ERROR]  [ERROR] For more information about the errors and possible solutions, please read the following articles: [ERROR] [Help 1] http://cwiki.apache.org/confluence/display/MAVEN/PluginResolutionException 
org.apache.maven.it.VerificationException: Exit code was non-zero: 1; command line and log = 
/usr/share/apache-maven-3.2.5/bin/mvn -N -X -e --batch-mode -Dmaven.repo.local=/home/bamboo-agent/.m2/repository org.apache.maven.plugins:maven-clean-plugin:clean install
Apache Maven 3.2.5 (12a6b3acb947671f09b81f49094c53f426d8cea1; 2014-12-14T17:29:23+00:00)
Maven home: /usr/share/apache-maven-3.2.5
Java version: 1.8.0_242, vendor: Private Build
Java home: /usr/lib/jvm/java-8-openjdk-amd64/jre
Default locale: en_US, platform encoding: UTF-8
(108 more lines...)
org.apache.maven.it.VerificationException: Exit code was non-zero: 1; command line and log =  /usr/share/apache-maven-3.2.5/bin/mvn -N -X -e --batch-mode -Dmaven.repo.local=/home/bamboo-agent/.m2/repository org.apache.maven.plugins:maven-clean-plugin:clean compile Apache Maven 3.2.5 (12a6b3acb947671f09b81f49094c53f426d8cea1; 2014-12-14T17:29:23+00:00) Maven home: /usr/share/apache-maven-3.2.5 Java version: 1.8.0_242, vendor: Private Build Java home: /usr/lib/jvm/java-8-openjdk-amd64/jre Default locale: en_US, platform encoding: UTF-8 OS name: "linux", version: "4.4.0-174-generic", arch: "amd64", family: "unix" [INFO] Error stacktraces are turned on. [DEBUG] Reading global settings from /usr/share/apache-maven-3.2.5/conf/settings.xml [DEBUG] Reading user settings from /home/bamboo-agent/.m2/settings.xml [DEBUG] Using local repository at /home/bamboo-agent/.m2/repository [DEBUG] Using manager EnhancedLocalRepositoryManager with priority 10.0 for /home/bamboo-agent/.m2/repository [INFO] Scanning for projects... [DEBUG] Extension realms for project org.openmrs.maven.plugins:openmrs-packager-maven-plugin-config-test-parent:pom:1.0.0-SNAPSHOT: (none) [DEBUG] Looking up lifecyle mappings for packaging pom from ClassRealm[plexus.core, parent: null] [DEBUG] === REACTOR BUILD PLAN ================================================ [DEBUG] Project: org.openmrs.maven.plugins:openmrs-packager-maven-plugin-config-test-parent:pom:1.0.0-SNAPSHOT [DEBUG] Tasks:   [org.apache.maven.plugins:maven-clean-plugin:clean, compile] [DEBUG] Style:   Regular [DEBUG] ======================================================================= [INFO]                                                                          [INFO] ------------------------------------------------------------------------ [INFO] Building OpenMRS config parent test 1.0.0-SNAPSHOT [INFO] ------------------------------------------------------------------------ [DEBUG] Lifecycle default -> [validate, initialize, generate-sources, process-sources, generate-resources, process-resources, compile, process-classes, generate-test-sources, process-test-sources, generate-test-resources, process-test-resources, test-compile, process-test-classes, test, prepare-package, package, pre-integration-test, integration-test, post-integration-test, verify, install, deploy] [DEBUG] Lifecycle clean -> [pre-clean, clean, post-clean] [DEBUG] Lifecycle site -> [pre-site, site, post-site, site-deploy] [DEBUG] Could not find metadata org.openmrs.maven.plugins:openmrs-packager-maven-plugin:1.2.0-SNAPSHOT/maven-metadata.xml in local (/home/bamboo-agent/.m2/repository) [DEBUG] Could not find metadata org.openmrs.maven.plugins:openmrs-packager-maven-plugin:1.2.0-SNAPSHOT/maven-metadata.xml in local (/home/bamboo-agent/.m2/repository) [WARNING] The POM for org.openmrs.maven.plugins:openmrs-packager-maven-plugin:jar:1.2.0-SNAPSHOT is missing, no dependency information available [INFO] ------------------------------------------------------------------------ [INFO] BUILD FAILURE [INFO] ------------------------------------------------------------------------ [INFO] Total time: 0.144 s [INFO] Finished at: 2020-02-25T18:54:16+00:00 [INFO] Final Memory: 6M/106M [INFO] ------------------------------------------------------------------------ [ERROR] Plugin org.openmrs.maven.plugins:openmrs-packager-maven-plugin:1.2.0-SNAPSHOT or one of its dependencies could not be resolved: Could not find artifact org.openmrs.maven.plugins:openmrs-packager-maven-plugin:jar:1.2.0-SNAPSHOT -> [Help 1] org.apache.maven.plugin.PluginResolutionException: Plugin org.openmrs.maven.plugins:openmrs-packager-maven-plugin:1.2.0-SNAPSHOT or one of its dependencies could not be resolved: Could not find artifact org.openmrs.maven.plugins:openmrs-packager-maven-plugin:jar:1.2.0-SNAPSHOT  at org.apache.maven.plugin.internal.DefaultPluginDependenciesResolver.resolve(DefaultPluginDependenciesResolver.java:133)  at org.apache.maven.plugin.internal.DefaultMavenPluginManager.getPluginDescriptor(DefaultMavenPluginManager.java:150)  at org.apache.maven.plugin.internal.DefaultMavenPluginManager.getMojoDescriptor(DefaultMavenPluginManager.java:269)  at org.apache.maven.plugin.DefaultBuildPluginManager.getMojoDescriptor(DefaultBuildPluginManager.java:239)  at org.apache.maven.lifecycle.internal.DefaultLifecycleExecutionPlanCalculator.setupMojoExecution(DefaultLifecycleExecutionPlanCalculator.java:158)  at org.apache.maven.lifecycle.internal.DefaultLifecycleExecutionPlanCalculator.setupMojoExecutions(DefaultLifecycleExecutionPlanCalculator.java:145)  at org.apache.maven.lifecycle.internal.DefaultLifecycleExecutionPlanCalculator.calculateExecutionPlan(DefaultLifecycleExecutionPlanCalculator.java:122)  at org.apache.maven.lifecycle.internal.DefaultLifecycleExecutionPlanCalculator.calculateExecutionPlan(DefaultLifecycleExecutionPlanCalculator.java:135)  at org.apache.maven.lifecycle.internal.builder.BuilderCommon.resolveBuildPlan(BuilderCommon.java:97)  at org.apache.maven.lifecycle.internal.LifecycleModuleBuilder.buildProject(LifecycleModuleBuilder.java:109)  at org.apache.maven.lifecycle.internal.LifecycleModuleBuilder.buildProject(LifecycleModuleBuilder.java:80)  at org.apache.maven.lifecycle.internal.builder.singlethreaded.SingleThreadedBuilder.build(SingleThreadedBuilder.java:51)  at org.apache.maven.lifecycle.internal.LifecycleStarter.execute(LifecycleStarter.java:120)  at org.apache.maven.DefaultMaven.doExecute(DefaultMaven.java:355)  at org.apache.maven.DefaultMaven.execute(DefaultMaven.java:155)  at org.apache.maven.cli.MavenCli.execute(MavenCli.java:584)  at org.apache.maven.cli.MavenCli.doMain(MavenCli.java:216)  at org.apache.maven.cli.MavenCli.main(MavenCli.java:160)  at sun.reflect.NativeMethodAccessorImpl.invoke0(Native Method)  at sun.reflect.NativeMethodAccessorImpl.invoke(NativeMethodAccessorImpl.java:62)  at sun.reflect.DelegatingMethodAccessorImpl.invoke(DelegatingMethodAccessorImpl.java:43)  at java.lang.reflect.Method.invoke(Method.java:498)  at org.codehaus.plexus.classworlds.launcher.Launcher.launchEnhanced(Launcher.java:289)  at org.codehaus.plexus.classworlds.launcher.Launcher.launch(Launcher.java:229)  at org.codehaus.plexus.classworlds.launcher.Launcher.mainWithExitCode(Launcher.java:415)  at org.codehaus.plexus.classworlds.launcher.Launcher.main(Launcher.java:356) Caused by: org.eclipse.aether.resolution.ArtifactResolutionException: Could not find artifact org.openmrs.maven.plugins:openmrs-packager-maven-plugin:jar:1.2.0-SNAPSHOT  at org.eclipse.aether.internal.impl.DefaultArtifactResolver.resolve(DefaultArtifactResolver.java:444)  at org.eclipse.aether.internal.impl.DefaultArtifactResolver.resolveArtifacts(DefaultArtifactResolver.java:246)  at org.eclipse.aether.internal.impl.DefaultArtifactResolver.resolveArtifact(DefaultArtifactResolver.java:223)  at org.eclipse.aether.internal.impl.DefaultRepositorySystem.resolveArtifact(DefaultRepositorySystem.java:294)  at org.apache.maven.plugin.internal.DefaultPluginDependenciesResolver.resolve(DefaultPluginDependenciesResolver.java:129)  ... 25 more Caused by: org.eclipse.aether.transfer.ArtifactNotFoundException: Could not find artifact org.openmrs.maven.plugins:openmrs-packager-maven-plugin:jar:1.2.0-SNAPSHOT  at org.eclipse.aether.internal.impl.DefaultArtifactResolver.resolve(DefaultArtifactResolver.java:434)  ... 29 more [ERROR]  [ERROR]  [ERROR] For more information about the errors and possible solutions, please read the following articles: [ERROR] [Help 1] http://cwiki.apache.org/confluence/display/MAVEN/PluginResolutionException 
org.apache.maven.it.VerificationException: Exit code was non-zero: 1; command line and log = 
/usr/share/apache-maven-3.2.5/bin/mvn -N -X -e --batch-mode -Dmaven.repo.local=/home/bamboo-agent/.m2/repository org.apache.maven.plugins:maven-clean-plugin:clean compile
Apache Maven 3.2.5 (12a6b3acb947671f09b81f49094c53f426d8cea1; 2014-12-14T17:29:23+00:00)
Maven home: /usr/share/apache-maven-3.2.5
Java version: 1.8.0_242, vendor: Private Build
Java home: /usr/lib/jvm/java-8-openjdk-amd64/jre
Default locale: en_US, platform encoding: UTF-8
(108 more lines...)
org.apache.maven.it.VerificationException: Exit code was non-zero: 1; command line and log =  /usr/share/apache-maven-3.2.5/bin/mvn -N -X -e --batch-mode -Dmaven.repo.local=/home/bamboo-agent/.m2/repository org.apache.maven.plugins:maven-clean-plugin:clean install Apache Maven 3.2.5 (12a6b3acb947671f09b81f49094c53f426d8cea1; 2014-12-14T17:29:23+00:00) Maven home: /usr/share/apache-maven-3.2.5 Java version: 1.8.0_242, vendor: Private Build Java home: /usr/lib/jvm/java-8-openjdk-amd64/jre Default locale: en_US, platform encoding: UTF-8 OS name: "linux", version: "4.4.0-174-generic", arch: "amd64", family: "unix" [INFO] Error stacktraces are turned on. [DEBUG] Reading global settings from /usr/share/apache-maven-3.2.5/conf/settings.xml [DEBUG] Reading user settings from /home/bamboo-agent/.m2/settings.xml [DEBUG] Using local repository at /home/bamboo-agent/.m2/repository [DEBUG] Using manager EnhancedLocalRepositoryManager with priority 10.0 for /home/bamboo-agent/.m2/repository [INFO] Scanning for projects... [DEBUG] Extension realms for project org.openmrs.maven.plugins:openmrs-packager-maven-plugin-config-test-parent:pom:1.0.0-SNAPSHOT: (none) [DEBUG] Looking up lifecyle mappings for packaging pom from ClassRealm[plexus.core, parent: null] [DEBUG] === REACTOR BUILD PLAN ================================================ [DEBUG] Project: org.openmrs.maven.plugins:openmrs-packager-maven-plugin-config-test-parent:pom:1.0.0-SNAPSHOT [DEBUG] Tasks:   [org.apache.maven.plugins:maven-clean-plugin:clean, install] [DEBUG] Style:   Regular [DEBUG] ======================================================================= [INFO]                                                                          [INFO] ------------------------------------------------------------------------ [INFO] Building OpenMRS config parent test 1.0.0-SNAPSHOT [INFO] ------------------------------------------------------------------------ [DEBUG] Lifecycle default -> [validate, initialize, generate-sources, process-sources, generate-resources, process-resources, compile, process-classes, generate-test-sources, process-test-sources, generate-test-resources, process-test-resources, test-compile, process-test-classes, test, prepare-package, package, pre-integration-test, integration-test, post-integration-test, verify, install, deploy] [DEBUG] Lifecycle clean -> [pre-clean, clean, post-clean] [DEBUG] Lifecycle site -> [pre-site, site, post-site, site-deploy] [DEBUG] Could not find metadata org.openmrs.maven.plugins:openmrs-packager-maven-plugin:1.2.0-SNAPSHOT/maven-metadata.xml in local (/home/bamboo-agent/.m2/repository) [DEBUG] Could not find metadata org.openmrs.maven.plugins:openmrs-packager-maven-plugin:1.2.0-SNAPSHOT/maven-metadata.xml in local (/home/bamboo-agent/.m2/repository) [WARNING] The POM for org.openmrs.maven.plugins:openmrs-packager-maven-plugin:jar:1.2.0-SNAPSHOT is missing, no dependency information available [INFO] ------------------------------------------------------------------------ [INFO] BUILD FAILURE [INFO] ------------------------------------------------------------------------ [INFO] Total time: 0.160 s [INFO] Finished at: 2020-02-25T18:54:13+00:00 [INFO] Final Memory: 6M/106M [INFO] ------------------------------------------------------------------------ [ERROR] Plugin org.openmrs.maven.plugins:openmrs-packager-maven-plugin:1.2.0-SNAPSHOT or one of its dependencies could not be resolved: Could not find artifact org.openmrs.maven.plugins:openmrs-packager-maven-plugin:jar:1.2.0-SNAPSHOT -> [Help 1] org.apache.maven.plugin.PluginResolutionException: Plugin org.openmrs.maven.plugins:openmrs-packager-maven-plugin:1.2.0-SNAPSHOT or one of its dependencies could not be resolved: Could not find artifact org.openmrs.maven.plugins:openmrs-packager-maven-plugin:jar:1.2.0-SNAPSHOT  at org.apache.maven.plugin.internal.DefaultPluginDependenciesResolver.resolve(DefaultPluginDependenciesResolver.java:133)  at org.apache.maven.plugin.internal.DefaultMavenPluginManager.getPluginDescriptor(DefaultMavenPluginManager.java:150)  at org.apache.maven.plugin.internal.DefaultMavenPluginManager.getMojoDescriptor(DefaultMavenPluginManager.java:269)  at org.apache.maven.plugin.DefaultBuildPluginManager.getMojoDescriptor(DefaultBuildPluginManager.java:239)  at org.apache.maven.lifecycle.internal.DefaultLifecycleExecutionPlanCalculator.setupMojoExecution(DefaultLifecycleExecutionPlanCalculator.java:158)  at org.apache.maven.lifecycle.internal.DefaultLifecycleExecutionPlanCalculator.setupMojoExecutions(DefaultLifecycleExecutionPlanCalculator.java:145)  at org.apache.maven.lifecycle.internal.DefaultLifecycleExecutionPlanCalculator.calculateExecutionPlan(DefaultLifecycleExecutionPlanCalculator.java:122)  at org.apache.maven.lifecycle.internal.DefaultLifecycleExecutionPlanCalculator.calculateExecutionPlan(DefaultLifecycleExecutionPlanCalculator.java:135)  at org.apache.maven.lifecycle.internal.builder.BuilderCommon.resolveBuildPlan(BuilderCommon.java:97)  at org.apache.maven.lifecycle.internal.LifecycleModuleBuilder.buildProject(LifecycleModuleBuilder.java:109)  at org.apache.maven.lifecycle.internal.LifecycleModuleBuilder.buildProject(LifecycleModuleBuilder.java:80)  at org.apache.maven.lifecycle.internal.builder.singlethreaded.SingleThreadedBuilder.build(SingleThreadedBuilder.java:51)  at org.apache.maven.lifecycle.internal.LifecycleStarter.execute(LifecycleStarter.java:120)  at org.apache.maven.DefaultMaven.doExecute(DefaultMaven.java:355)  at org.apache.maven.DefaultMaven.execute(DefaultMaven.java:155)  at org.apache.maven.cli.MavenCli.execute(MavenCli.java:584)  at org.apache.maven.cli.MavenCli.doMain(MavenCli.java:216)  at org.apache.maven.cli.MavenCli.main(MavenCli.java:160)  at sun.reflect.NativeMethodAccessorImpl.invoke0(Native Method)  at sun.reflect.NativeMethodAccessorImpl.invoke(NativeMethodAccessorImpl.java:62)  at sun.reflect.DelegatingMethodAccessorImpl.invoke(DelegatingMethodAccessorImpl.java:43)  at java.lang.reflect.Method.invoke(Method.java:498)  at org.codehaus.plexus.classworlds.launcher.Launcher.launchEnhanced(Launcher.java:289)  at org.codehaus.plexus.classworlds.launcher.Launcher.launch(Launcher.java:229)  at org.codehaus.plexus.classworlds.launcher.Launcher.mainWithExitCode(Launcher.java:415)  at org.codehaus.plexus.classworlds.launcher.Launcher.main(Launcher.java:356) Caused by: org.eclipse.aether.resolution.ArtifactResolutionException: Could not find artifact org.openmrs.maven.plugins:openmrs-packager-maven-plugin:jar:1.2.0-SNAPSHOT  at org.eclipse.aether.internal.impl.DefaultArtifactResolver.resolve(DefaultArtifactResolver.java:444)  at org.eclipse.aether.internal.impl.DefaultArtifactResolver.resolveArtifacts(DefaultArtifactResolver.java:246)  at org.eclipse.aether.internal.impl.DefaultArtifactResolver.resolveArtifact(DefaultArtifactResolver.java:223)  at org.eclipse.aether.internal.impl.DefaultRepositorySystem.resolveArtifact(DefaultRepositorySystem.java:294)  at org.apache.maven.plugin.internal.DefaultPluginDependenciesResolver.resolve(DefaultPluginDependenciesResolver.java:129)  ... 25 more Caused by: org.eclipse.aether.transfer.ArtifactNotFoundException: Could not find artifact org.openmrs.maven.plugins:openmrs-packager-maven-plugin:jar:1.2.0-SNAPSHOT  at org.eclipse.aether.internal.impl.DefaultArtifactResolver.resolve(DefaultArtifactResolver.java:434)  ... 29 more [ERROR]  [ERROR]  [ERROR] For more information about the errors and possible solutions, please read the following articles: [ERROR] [Help 1] http://cwiki.apache.org/confluence/display/MAVEN/PluginResolutionException 
org.apache.maven.it.VerificationException: Exit code was non-zero: 1; command line and log = 
/usr/share/apache-maven-3.2.5/bin/mvn -N -X -e --batch-mode -Dmaven.repo.local=/home/bamboo-agent/.m2/repository org.apache.maven.plugins:maven-clean-plugin:clean install
Apache Maven 3.2.5 (12a6b3acb947671f09b81f49094c53f426d8cea1; 2014-12-14T17:29:23+00:00)
Maven home: /usr/share/apache-maven-3.2.5
Java version: 1.8.0_242, vendor: Private Build
Java home: /usr/lib/jvm/java-8-openjdk-amd64/jre
Default locale: en_US, platform encoding: UTF-8
(108 more lines...)
org.apache.maven.it.VerificationException: Exit code was non-zero: 1; command line and log =  /usr/share/apache-maven-3.2.5/bin/mvn -N -X -e --batch-mode -Dmaven.repo.local=/home/bamboo-agent/.m2/repository org.apache.maven.plugins:maven-clean-plugin:clean package Apache Maven 3.2.5 (12a6b3acb947671f09b81f49094c53f426d8cea1; 2014-12-14T17:29:23+00:00) Maven home: /usr/share/apache-maven-3.2.5 Java version: 1.8.0_242, vendor: Private Build Java home: /usr/lib/jvm/java-8-openjdk-amd64/jre Default locale: en_US, platform encoding: UTF-8 OS name: "linux", version: "4.4.0-174-generic", arch: "amd64", family: "unix" [INFO] Error stacktraces are turned on. [DEBUG] Reading global settings from /usr/share/apache-maven-3.2.5/conf/settings.xml [DEBUG] Reading user settings from /home/bamboo-agent/.m2/settings.xml [DEBUG] Using local repository at /home/bamboo-agent/.m2/repository [DEBUG] Using manager EnhancedLocalRepositoryManager with priority 10.0 for /home/bamboo-agent/.m2/repository [INFO] Scanning for projects... [DEBUG] Extension realms for project org.openmrs.maven.plugins:openmrs-packager-maven-plugin-config-test-parent:pom:1.0.0-SNAPSHOT: (none) [DEBUG] Looking up lifecyle mappings for packaging pom from ClassRealm[plexus.core, parent: null] [DEBUG] === REACTOR BUILD PLAN ================================================ [DEBUG] Project: org.openmrs.maven.plugins:openmrs-packager-maven-plugin-config-test-parent:pom:1.0.0-SNAPSHOT [DEBUG] Tasks:   [org.apache.maven.plugins:maven-clean-plugin:clean, package] [DEBUG] Style:   Regular [DEBUG] ======================================================================= [INFO]                                                                          [INFO] ------------------------------------------------------------------------ [INFO] Building OpenMRS config parent test 1.0.0-SNAPSHOT [INFO] ------------------------------------------------------------------------ [DEBUG] Lifecycle default -> [validate, initialize, generate-sources, process-sources, generate-resources, process-resources, compile, process-classes, generate-test-sources, process-test-sources, generate-test-resources, process-test-resources, test-compile, process-test-classes, test, prepare-package, package, pre-integration-test, integration-test, post-integration-test, verify, install, deploy] [DEBUG] Lifecycle clean -> [pre-clean, clean, post-clean] [DEBUG] Lifecycle site -> [pre-site, site, post-site, site-deploy] [DEBUG] Could not find metadata org.openmrs.maven.plugins:openmrs-packager-maven-plugin:1.2.0-SNAPSHOT/maven-metadata.xml in local (/home/bamboo-agent/.m2/repository) [DEBUG] Could not find metadata org.openmrs.maven.plugins:openmrs-packager-maven-plugin:1.2.0-SNAPSHOT/maven-metadata.xml in local (/home/bamboo-agent/.m2/repository) [WARNING] The POM for org.openmrs.maven.plugins:openmrs-packager-maven-plugin:jar:1.2.0-SNAPSHOT is missing, no dependency information available [INFO] ------------------------------------------------------------------------ [INFO] BUILD FAILURE [INFO] ------------------------------------------------------------------------ [INFO] Total time: 0.175 s [INFO] Finished at: 2020-02-25T18:54:29+00:00 [INFO] Final Memory: 6M/106M [INFO] ------------------------------------------------------------------------ [ERROR] Plugin org.openmrs.maven.plugins:openmrs-packager-maven-plugin:1.2.0-SNAPSHOT or one of its dependencies could not be resolved: Could not find artifact org.openmrs.maven.plugins:openmrs-packager-maven-plugin:jar:1.2.0-SNAPSHOT -> [Help 1] org.apache.maven.plugin.PluginResolutionException: Plugin org.openmrs.maven.plugins:openmrs-packager-maven-plugin:1.2.0-SNAPSHOT or one of its dependencies could not be resolved: Could not find artifact org.openmrs.maven.plugins:openmrs-packager-maven-plugin:jar:1.2.0-SNAPSHOT  at org.apache.maven.plugin.internal.DefaultPluginDependenciesResolver.resolve(DefaultPluginDependenciesResolver.java:133)  at org.apache.maven.plugin.internal.DefaultMavenPluginManager.getPluginDescriptor(DefaultMavenPluginManager.java:150)  at org.apache.maven.plugin.internal.DefaultMavenPluginManager.getMojoDescriptor(DefaultMavenPluginManager.java:269)  at org.apache.maven.plugin.DefaultBuildPluginManager.getMojoDescriptor(DefaultBuildPluginManager.java:239)  at org.apache.maven.lifecycle.internal.DefaultLifecycleExecutionPlanCalculator.setupMojoExecution(DefaultLifecycleExecutionPlanCalculator.java:158)  at org.apache.maven.lifecycle.internal.DefaultLifecycleExecutionPlanCalculator.setupMojoExecutions(DefaultLifecycleExecutionPlanCalculator.java:145)  at org.apache.maven.lifecycle.internal.DefaultLifecycleExecutionPlanCalculator.calculateExecutionPlan(DefaultLifecycleExecutionPlanCalculator.java:122)  at org.apache.maven.lifecycle.internal.DefaultLifecycleExecutionPlanCalculator.calculateExecutionPlan(DefaultLifecycleExecutionPlanCalculator.java:135)  at org.apache.maven.lifecycle.internal.builder.BuilderCommon.resolveBuildPlan(BuilderCommon.java:97)  at org.apache.maven.lifecycle.internal.LifecycleModuleBuilder.buildProject(LifecycleModuleBuilder.java:109)  at org.apache.maven.lifecycle.internal.LifecycleModuleBuilder.buildProject(LifecycleModuleBuilder.java:80)  at org.apache.maven.lifecycle.internal.builder.singlethreaded.SingleThreadedBuilder.build(SingleThreadedBuilder.java:51)  at org.apache.maven.lifecycle.internal.LifecycleStarter.execute(LifecycleStarter.java:120)  at org.apache.maven.DefaultMaven.doExecute(DefaultMaven.java:355)  at org.apache.maven.DefaultMaven.execute(DefaultMaven.java:155)  at org.apache.maven.cli.MavenCli.execute(MavenCli.java:584)  at org.apache.maven.cli.MavenCli.doMain(MavenCli.java:216)  at org.apache.maven.cli.MavenCli.main(MavenCli.java:160)  at sun.reflect.NativeMethodAccessorImpl.invoke0(Native Method)  at sun.reflect.NativeMethodAccessorImpl.invoke(NativeMethodAccessorImpl.java:62)  at sun.reflect.DelegatingMethodAccessorImpl.invoke(DelegatingMethodAccessorImpl.java:43)  at java.lang.reflect.Method.invoke(Method.java:498)  at org.codehaus.plexus.classworlds.launcher.Launcher.launchEnhanced(Launcher.java:289)  at org.codehaus.plexus.classworlds.launcher.Launcher.launch(Launcher.java:229)  at org.codehaus.plexus.classworlds.launcher.Launcher.mainWithExitCode(Launcher.java:415)  at org.codehaus.plexus.classworlds.launcher.Launcher.main(Launcher.java:356) Caused by: org.eclipse.aether.resolution.ArtifactResolutionException: Could not find artifact org.openmrs.maven.plugins:openmrs-packager-maven-plugin:jar:1.2.0-SNAPSHOT  at org.eclipse.aether.internal.impl.DefaultArtifactResolver.resolve(DefaultArtifactResolver.java:444)  at org.eclipse.aether.internal.impl.DefaultArtifactResolver.resolveArtifacts(DefaultArtifactResolver.java:246)  at org.eclipse.aether.internal.impl.DefaultArtifactResolver.resolveArtifact(DefaultArtifactResolver.java:223)  at org.eclipse.aether.internal.impl.DefaultRepositorySystem.resolveArtifact(DefaultRepositorySystem.java:294)  at org.apache.maven.plugin.internal.DefaultPluginDependenciesResolver.resolve(DefaultPluginDependenciesResolver.java:129)  ... 25 more Caused by: org.eclipse.aether.transfer.ArtifactNotFoundException: Could not find artifact org.openmrs.maven.plugins:openmrs-packager-maven-plugin:jar:1.2.0-SNAPSHOT  at org.eclipse.aether.internal.impl.DefaultArtifactResolver.resolve(DefaultArtifactResolver.java:434)  ... 29 more [ERROR]  [ERROR]  [ERROR] For more information about the errors and possible solutions, please read the following articles: [ERROR] [Help 1] http://cwiki.apache.org/confluence/display/MAVEN/PluginResolutionException 
org.apache.maven.it.VerificationException: Exit code was non-zero: 1; command line and log = 
/usr/share/apache-maven-3.2.5/bin/mvn -N -X -e --batch-mode -Dmaven.repo.local=/home/bamboo-agent/.m2/repository org.apache.maven.plugins:maven-clean-plugin:clean package
Apache Maven 3.2.5 (12a6b3acb947671f09b81f49094c53f426d8cea1; 2014-12-14T17:29:23+00:00)
Maven home: /usr/share/apache-maven-3.2.5
Java version: 1.8.0_242, vendor: Private Build
Java home: /usr/lib/jvm/java-8-openjdk-amd64/jre
Default locale: en_US, platform encoding: UTF-8
(108 more lines...)