Build: #811 failed

Job: Run QA Framework failed

Stages & jobs

  1. BDD UI Test Framework

Build log

The build generated 1,672 lines of output.The output is too long and has been truncated to the last 1,000 lines. Download or view full build log

15-Sep-2021 20:21:39 [INFO] Configured Artifact: org.openmrs.module:reporting-omod:1.23.0:jar
15-Sep-2021 20:21:39 [INFO] Configured Artifact: org.openmrs.module:adminui-omod:1.5.0:jar
15-Sep-2021 20:21:39 [INFO] Configured Artifact: org.openmrs.module:registrationcore-omod:1.11.0:jar
15-Sep-2021 20:21:39 [INFO] Configured Artifact: org.openmrs.module:appointmentscheduling-omod:1.16.0:jar
15-Sep-2021 20:21:39 [INFO] Configured Artifact: org.openmrs.module:atlas-omod:2.2.5:omod
15-Sep-2021 20:21:39 [INFO] Configured Artifact: org.openmrs.module:calculation-omod:1.3.0:jar
15-Sep-2021 20:21:39 [INFO] Configured Artifact: org.openmrs.module:webservices.rest-omod:2.32.0-SNAPSHOT:jar
15-Sep-2021 20:21:39 [INFO] Downloading: http://mavenrepo.openmrs.org/nexus/content/repositories/public/org/openmrs/module/webservices.rest-omod/2.32.0-SNAPSHOT/maven-metadata.xml
15-Sep-2021 20:21:39 [INFO] Downloaded: http://mavenrepo.openmrs.org/nexus/content/repositories/public/org/openmrs/module/webservices.rest-omod/2.32.0-SNAPSHOT/maven-metadata.xml (1009 B at 3.7 KB/sec)
15-Sep-2021 20:21:39 [INFO] Downloading: http://mavenrepo.openmrs.org/nexus/content/repositories/public/org/openmrs/module/webservices.rest-omod/2.32.0-SNAPSHOT/webservices.rest-omod-2.32.0-20210915.182546-68.jar
15-Sep-2021 20:21:47 [INFO] Downloaded: http://mavenrepo.openmrs.org/nexus/content/repositories/public/org/openmrs/module/webservices.rest-omod/2.32.0-SNAPSHOT/webservices.rest-omod-2.32.0-20210915.182546-68.jar (6750 KB at 839.8 KB/sec)
15-Sep-2021 20:21:47 [INFO] Configured Artifact: org.openmrs.module:spa-omod:1.0.8:jar
15-Sep-2021 20:21:47 [INFO] Configured Artifact: org.openmrs.module:uicommons-omod:2.18.0:jar
15-Sep-2021 20:21:47 [INFO] Configured Artifact: org.openmrs.module:uiframework-omod:3.21.0:jar
15-Sep-2021 20:21:47 [INFO] Configured Artifact: org.openmrs.module:metadatasharing-omod:1.8.0:jar
15-Sep-2021 20:21:47 [INFO] Copying addresshierarchy-omod-2.14.2.jar to /home/bamboo-agent/bamboo-agent/xml-data/build-dir/CONTRIB-QA-FRAMEWORK/package/target/distro/web/modules/addresshierarchy-2.14.2.omod
15-Sep-2021 20:21:47 [INFO] Copying legacyui-omod-1.8.3.jar to /home/bamboo-agent/bamboo-agent/xml-data/build-dir/CONTRIB-QA-FRAMEWORK/package/target/distro/web/modules/legacyui-1.8.3.omod
15-Sep-2021 20:21:47 [INFO] Copying openconceptlab-omod-1.2.6.jar to /home/bamboo-agent/bamboo-agent/xml-data/build-dir/CONTRIB-QA-FRAMEWORK/package/target/distro/web/modules/openconceptlab-1.2.6.omod
15-Sep-2021 20:21:47 [INFO] Copying metadatadeploy-omod-1.13.0.jar to /home/bamboo-agent/bamboo-agent/xml-data/build-dir/CONTRIB-QA-FRAMEWORK/package/target/distro/web/modules/metadatadeploy-1.13.0.omod
15-Sep-2021 20:21:47 [INFO] Copying reportingrest-omod-1.12.0.jar to /home/bamboo-agent/bamboo-agent/xml-data/build-dir/CONTRIB-QA-FRAMEWORK/package/target/distro/web/modules/reportingrest-1.12.0.omod
15-Sep-2021 20:21:47 [INFO] Copying owa-omod-1.13.0.jar to /home/bamboo-agent/bamboo-agent/xml-data/build-dir/CONTRIB-QA-FRAMEWORK/package/target/distro/web/modules/owa-1.13.0.omod
15-Sep-2021 20:21:47 [INFO] Copying fhir2-omod-1.2.2.jar to /home/bamboo-agent/bamboo-agent/xml-data/build-dir/CONTRIB-QA-FRAMEWORK/package/target/distro/web/modules/fhir2-1.2.2.omod
15-Sep-2021 20:21:48 [INFO] Copying serialization.xstream-omod-0.2.15.omod to /home/bamboo-agent/bamboo-agent/xml-data/build-dir/CONTRIB-QA-FRAMEWORK/package/target/distro/web/modules/serialization.xstream-0.2.15.omod
15-Sep-2021 20:21:48 [INFO] Copying registrationapp-omod-1.24.0.jar to /home/bamboo-agent/bamboo-agent/xml-data/build-dir/CONTRIB-QA-FRAMEWORK/package/target/distro/web/modules/registrationapp-1.24.0.omod
15-Sep-2021 20:21:48 [INFO] Copying event-omod-2.10.0-SNAPSHOT.jar to /home/bamboo-agent/bamboo-agent/xml-data/build-dir/CONTRIB-QA-FRAMEWORK/package/target/distro/web/modules/event-2.10.0-SNAPSHOT.omod
15-Sep-2021 20:21:48 [INFO] Copying uilibrary-omod-2.0.7.jar to /home/bamboo-agent/bamboo-agent/xml-data/build-dir/CONTRIB-QA-FRAMEWORK/package/target/distro/web/modules/uilibrary-2.0.7.omod
15-Sep-2021 20:21:48 [INFO] Copying htmlwidgets-omod-1.10.0.jar to /home/bamboo-agent/bamboo-agent/xml-data/build-dir/CONTRIB-QA-FRAMEWORK/package/target/distro/web/modules/htmlwidgets-1.10.0.omod
15-Sep-2021 20:21:48 [INFO] Copying dataexchange-omod-1.3.7.jar to /home/bamboo-agent/bamboo-agent/xml-data/build-dir/CONTRIB-QA-FRAMEWORK/package/target/distro/web/modules/dataexchange-1.3.7.omod
15-Sep-2021 20:21:48 [INFO] Copying appui-omod-1.14.0.jar to /home/bamboo-agent/bamboo-agent/xml-data/build-dir/CONTRIB-QA-FRAMEWORK/package/target/distro/web/modules/appui-1.14.0.omod
15-Sep-2021 20:21:48 [INFO] Copying allergyui-omod-1.8.4.jar to /home/bamboo-agent/bamboo-agent/xml-data/build-dir/CONTRIB-QA-FRAMEWORK/package/target/distro/web/modules/allergyui-1.8.4.omod
15-Sep-2021 20:21:48 [INFO] Copying providermanagement-omod-2.13.0.jar to /home/bamboo-agent/bamboo-agent/xml-data/build-dir/CONTRIB-QA-FRAMEWORK/package/target/distro/web/modules/providermanagement-2.13.0.omod
15-Sep-2021 20:21:48 [INFO] Copying appointmentschedulingui-omod-1.12.0.jar to /home/bamboo-agent/bamboo-agent/xml-data/build-dir/CONTRIB-QA-FRAMEWORK/package/target/distro/web/modules/appointmentschedulingui-1.12.0.omod
15-Sep-2021 20:21:48 [INFO] Copying attachments-omod-2.5.0.jar to /home/bamboo-agent/bamboo-agent/xml-data/build-dir/CONTRIB-QA-FRAMEWORK/package/target/distro/web/modules/attachments-2.5.0.omod
15-Sep-2021 20:21:48 [INFO] Copying formentryapp-omod-1.4.2.jar to /home/bamboo-agent/bamboo-agent/xml-data/build-dir/CONTRIB-QA-FRAMEWORK/package/target/distro/web/modules/formentryapp-1.4.2.omod
15-Sep-2021 20:21:48 [INFO] Copying idgen-omod-4.7.0.jar to /home/bamboo-agent/bamboo-agent/xml-data/build-dir/CONTRIB-QA-FRAMEWORK/package/target/distro/web/modules/idgen-4.7.0.omod
15-Sep-2021 20:21:48 [INFO] Copying metadatamapping-omod-1.4.0.jar to /home/bamboo-agent/bamboo-agent/xml-data/build-dir/CONTRIB-QA-FRAMEWORK/package/target/distro/web/modules/metadatamapping-1.4.0.omod
15-Sep-2021 20:21:48 [INFO] Copying htmlformentryui-omod-2.0.0.jar to /home/bamboo-agent/bamboo-agent/xml-data/build-dir/CONTRIB-QA-FRAMEWORK/package/target/distro/web/modules/htmlformentryui-2.0.0.omod
15-Sep-2021 20:21:48 [INFO] Copying referencedemodata-omod-1.4.7.jar to /home/bamboo-agent/bamboo-agent/xml-data/build-dir/CONTRIB-QA-FRAMEWORK/package/target/distro/web/modules/referencedemodata-1.4.7.omod
15-Sep-2021 20:21:48 [INFO] Copying emrapi-omod-1.32.0.jar to /home/bamboo-agent/bamboo-agent/xml-data/build-dir/CONTRIB-QA-FRAMEWORK/package/target/distro/web/modules/emrapi-1.32.0.omod
15-Sep-2021 20:21:48 [INFO] Copying referenceapplication-omod-2.12.0-SNAPSHOT.jar to /home/bamboo-agent/bamboo-agent/xml-data/build-dir/CONTRIB-QA-FRAMEWORK/package/target/distro/web/modules/referenceapplication-2.12.0-SNAPSHOT.omod
15-Sep-2021 20:21:48 [INFO] Copying htmlformentry-omod-4.1.0.jar to /home/bamboo-agent/bamboo-agent/xml-data/build-dir/CONTRIB-QA-FRAMEWORK/package/target/distro/web/modules/htmlformentry-4.1.0.omod
15-Sep-2021 20:21:48 [INFO] Copying appframework-omod-2.16.0.jar to /home/bamboo-agent/bamboo-agent/xml-data/build-dir/CONTRIB-QA-FRAMEWORK/package/target/distro/web/modules/appframework-2.16.0.omod
15-Sep-2021 20:21:48 [INFO] Copying referencemetadata-omod-2.12.0.jar to /home/bamboo-agent/bamboo-agent/xml-data/build-dir/CONTRIB-QA-FRAMEWORK/package/target/distro/web/modules/referencemetadata-2.12.0.omod
15-Sep-2021 20:21:48 [INFO] Copying reportingui-omod-1.8.0.jar to /home/bamboo-agent/bamboo-agent/xml-data/build-dir/CONTRIB-QA-FRAMEWORK/package/target/distro/web/modules/reportingui-1.8.0.omod
15-Sep-2021 20:21:48 [INFO] Copying coreapps-omod-1.34.0-SNAPSHOT.jar to /home/bamboo-agent/bamboo-agent/xml-data/build-dir/CONTRIB-QA-FRAMEWORK/package/target/distro/web/modules/coreapps-1.34.0-SNAPSHOT.omod
15-Sep-2021 20:21:48 [INFO] Copying reportingcompatibility-omod-2.0.8.jar to /home/bamboo-agent/bamboo-agent/xml-data/build-dir/CONTRIB-QA-FRAMEWORK/package/target/distro/web/modules/reportingcompatibility-2.0.8.omod
15-Sep-2021 20:21:48 [INFO] Copying reporting-omod-1.23.0.jar to /home/bamboo-agent/bamboo-agent/xml-data/build-dir/CONTRIB-QA-FRAMEWORK/package/target/distro/web/modules/reporting-1.23.0.omod
15-Sep-2021 20:21:49 [INFO] Copying adminui-omod-1.5.0.jar to /home/bamboo-agent/bamboo-agent/xml-data/build-dir/CONTRIB-QA-FRAMEWORK/package/target/distro/web/modules/adminui-1.5.0.omod
15-Sep-2021 20:21:49 [INFO] Copying registrationcore-omod-1.11.0.jar to /home/bamboo-agent/bamboo-agent/xml-data/build-dir/CONTRIB-QA-FRAMEWORK/package/target/distro/web/modules/registrationcore-1.11.0.omod
15-Sep-2021 20:21:49 [INFO] Copying appointmentscheduling-omod-1.16.0.jar to /home/bamboo-agent/bamboo-agent/xml-data/build-dir/CONTRIB-QA-FRAMEWORK/package/target/distro/web/modules/appointmentscheduling-1.16.0.omod
15-Sep-2021 20:21:49 [INFO] Copying atlas-omod-2.2.5.omod to /home/bamboo-agent/bamboo-agent/xml-data/build-dir/CONTRIB-QA-FRAMEWORK/package/target/distro/web/modules/atlas-2.2.5.omod
15-Sep-2021 20:21:49 [INFO] Copying calculation-omod-1.3.0.jar to /home/bamboo-agent/bamboo-agent/xml-data/build-dir/CONTRIB-QA-FRAMEWORK/package/target/distro/web/modules/calculation-1.3.0.omod
15-Sep-2021 20:21:49 [INFO] Copying webservices.rest-omod-2.32.0-SNAPSHOT.jar to /home/bamboo-agent/bamboo-agent/xml-data/build-dir/CONTRIB-QA-FRAMEWORK/package/target/distro/web/modules/webservices.rest-2.32.0-SNAPSHOT.omod
15-Sep-2021 20:21:49 [INFO] Copying spa-omod-1.0.8.jar to /home/bamboo-agent/bamboo-agent/xml-data/build-dir/CONTRIB-QA-FRAMEWORK/package/target/distro/web/modules/spa-1.0.8.omod
15-Sep-2021 20:21:49 [INFO] Copying uicommons-omod-2.18.0.jar to /home/bamboo-agent/bamboo-agent/xml-data/build-dir/CONTRIB-QA-FRAMEWORK/package/target/distro/web/modules/uicommons-2.18.0.omod
15-Sep-2021 20:21:49 [INFO] Copying uiframework-omod-3.21.0.jar to /home/bamboo-agent/bamboo-agent/xml-data/build-dir/CONTRIB-QA-FRAMEWORK/package/target/distro/web/modules/uiframework-3.21.0.omod
15-Sep-2021 20:21:49 [INFO] Copying metadatasharing-omod-1.8.0.jar to /home/bamboo-agent/bamboo-agent/xml-data/build-dir/CONTRIB-QA-FRAMEWORK/package/target/distro/web/modules/metadatasharing-1.8.0.omod
15-Sep-2021 20:21:49
15-Sep-2021 20:21:49 Downloading OWAs...
15-Sep-2021 20:21:49
15-Sep-2021 20:21:49
15-Sep-2021 20:21:49 Downloading OWA: org.openmrs.owa:openmrs-owa-sysadmin:1.2
15-Sep-2021 20:21:49 [INFO] Configured Artifact: org.openmrs.owa:sysadmin:1.2:zip
15-Sep-2021 20:21:49 [INFO] Downloading: http://mavenrepo.openmrs.org/nexus/content/repositories/public/org/openmrs/owa/sysadmin/1.2/sysadmin-1.2.zip
15-Sep-2021 20:21:49 [INFO] Downloaded: http://mavenrepo.openmrs.org/nexus/content/repositories/public/org/openmrs/owa/sysadmin/1.2/sysadmin-1.2.zip (1081 KB at 1444.2 KB/sec)
15-Sep-2021 20:21:49 [INFO] Copying sysadmin-1.2.zip to /home/bamboo-agent/bamboo-agent/xml-data/build-dir/CONTRIB-QA-FRAMEWORK/package/target/distro/web/owa/sysadmin-1.2.zip
15-Sep-2021 20:21:49
15-Sep-2021 20:21:49 Creating Docker Compose configuration...
15-Sep-2021 20:21:49
15-Sep-2021 20:21:51
15-Sep-2021 20:21:51 The 'referenceapplication' distribution created! To start up the server run 'docker-compose up' from /home/bamboo-agent/bamboo-agent/xml-data/build-dir/CONTRIB-QA-FRAMEWORK/package/target/distro
15-Sep-2021 20:21:51
15-Sep-2021 20:21:51 [INFO]
15-Sep-2021 20:21:51 [INFO] --- openmrs-sdk-maven-plugin:4.0.0:build-distro (build-bundled-distro) @ referenceapplication-package ---
15-Sep-2021 20:21:51
15-Sep-2021 20:21:51 Downloading modules...
15-Sep-2021 20:21:51
15-Sep-2021 20:21:51 [INFO] Configured Artifact: org.openmrs.web:openmrs-webapp:2.4.0:war
15-Sep-2021 20:21:51 [INFO] Copying openmrs-webapp-2.4.0.war to /home/bamboo-agent/bamboo-agent/xml-data/build-dir/CONTRIB-QA-FRAMEWORK/package/target/bundled-distro/web/openmrs-2.4.0.war
15-Sep-2021 20:21:51 file:/home/bamboo-agent/bamboo-agent/xml-data/build-dir/CONTRIB-QA-FRAMEWORK/package/target/bundled-distro/web/openmrs-2.4.0.war
15-Sep-2021 20:21:51 target:/home/bamboo-agent/bamboo-agent/xml-data/build-dir/CONTRIB-QA-FRAMEWORK/package/target/bundled-distro/web
15-Sep-2021 20:21:51 [INFO] Configured Artifact: org.openmrs.module:addresshierarchy-omod:2.14.2:jar
15-Sep-2021 20:21:51 [INFO] Configured Artifact: org.openmrs.module:legacyui-omod:1.8.3:jar
15-Sep-2021 20:21:51 [INFO] Configured Artifact: org.openmrs.module:openconceptlab-omod:1.2.6:jar
15-Sep-2021 20:21:51 [INFO] Configured Artifact: org.openmrs.module:metadatadeploy-omod:1.13.0:jar
15-Sep-2021 20:21:51 [INFO] Configured Artifact: org.openmrs.module:reportingrest-omod:1.12.0:jar
15-Sep-2021 20:21:51 [INFO] Configured Artifact: org.openmrs.module:owa-omod:1.13.0:jar
15-Sep-2021 20:21:51 [INFO] Configured Artifact: org.openmrs.module:fhir2-omod:1.2.2:jar
15-Sep-2021 20:21:51 [INFO] Configured Artifact: org.openmrs.module:serialization.xstream-omod:0.2.15:omod
15-Sep-2021 20:21:51 [INFO] Configured Artifact: org.openmrs.module:registrationapp-omod:1.24.0:jar
15-Sep-2021 20:21:51 [INFO] Configured Artifact: org.openmrs:event-omod:2.10.0-SNAPSHOT:jar
15-Sep-2021 20:21:51 [INFO] Configured Artifact: org.openmrs.module:uilibrary-omod:2.0.7:jar
15-Sep-2021 20:21:51 [INFO] Configured Artifact: org.openmrs.module:htmlwidgets-omod:1.10.0:jar
15-Sep-2021 20:21:51 [INFO] Configured Artifact: org.openmrs.module:dataexchange-omod:1.3.7:jar
15-Sep-2021 20:21:51 [INFO] Configured Artifact: org.openmrs.module:appui-omod:1.14.0:jar
15-Sep-2021 20:21:51 [INFO] Configured Artifact: org.openmrs.module:allergyui-omod:1.8.4:jar
15-Sep-2021 20:21:51 [INFO] Configured Artifact: org.openmrs.module:providermanagement-omod:2.13.0:jar
15-Sep-2021 20:21:51 [INFO] Configured Artifact: org.openmrs.module:appointmentschedulingui-omod:1.12.0:jar
15-Sep-2021 20:21:51 [INFO] Configured Artifact: org.openmrs.module:attachments-omod:2.5.0:jar
15-Sep-2021 20:21:51 [INFO] Configured Artifact: org.openmrs.module:formentryapp-omod:1.4.2:jar
15-Sep-2021 20:21:51 [INFO] Configured Artifact: org.openmrs.module:idgen-omod:4.7.0:jar
15-Sep-2021 20:21:51 [INFO] Configured Artifact: org.openmrs.module:metadatamapping-omod:1.4.0:jar
15-Sep-2021 20:21:51 [INFO] Configured Artifact: org.openmrs.module:htmlformentryui-omod:2.0.0:jar
15-Sep-2021 20:21:51 [INFO] Configured Artifact: org.openmrs.module:referencedemodata-omod:1.4.7:jar
15-Sep-2021 20:21:51 [INFO] Configured Artifact: org.openmrs.module:emrapi-omod:1.32.0:jar
15-Sep-2021 20:21:51 [INFO] Configured Artifact: org.openmrs.module:referenceapplication-omod:2.12.0-SNAPSHOT:jar
15-Sep-2021 20:21:51 [INFO] Configured Artifact: org.openmrs.module:htmlformentry-omod:4.1.0:jar
15-Sep-2021 20:21:51 [INFO] Configured Artifact: org.openmrs.module:appframework-omod:2.16.0:jar
15-Sep-2021 20:21:51 [INFO] Configured Artifact: org.openmrs.module:referencemetadata-omod:2.12.0:jar
15-Sep-2021 20:21:51 [INFO] Configured Artifact: org.openmrs.module:reportingui-omod:1.8.0:jar
15-Sep-2021 20:21:51 [INFO] Configured Artifact: org.openmrs.module:coreapps-omod:1.34.0-SNAPSHOT:jar
15-Sep-2021 20:21:51 [INFO] Configured Artifact: org.openmrs.module:reportingcompatibility-omod:2.0.8:jar
15-Sep-2021 20:21:51 [INFO] Configured Artifact: org.openmrs.module:reporting-omod:1.23.0:jar
15-Sep-2021 20:21:51 [INFO] Configured Artifact: org.openmrs.module:adminui-omod:1.5.0:jar
15-Sep-2021 20:21:51 [INFO] Configured Artifact: org.openmrs.module:registrationcore-omod:1.11.0:jar
15-Sep-2021 20:21:51 [INFO] Configured Artifact: org.openmrs.module:appointmentscheduling-omod:1.16.0:jar
15-Sep-2021 20:21:51 [INFO] Configured Artifact: org.openmrs.module:atlas-omod:2.2.5:omod
15-Sep-2021 20:21:51 [INFO] Configured Artifact: org.openmrs.module:calculation-omod:1.3.0:jar
15-Sep-2021 20:21:51 [INFO] Configured Artifact: org.openmrs.module:webservices.rest-omod:2.32.0-SNAPSHOT:jar
15-Sep-2021 20:21:51 [INFO] Configured Artifact: org.openmrs.module:spa-omod:1.0.8:jar
15-Sep-2021 20:21:51 [INFO] Configured Artifact: org.openmrs.module:uicommons-omod:2.18.0:jar
15-Sep-2021 20:21:51 [INFO] Configured Artifact: org.openmrs.module:uiframework-omod:3.21.0:jar
15-Sep-2021 20:21:51 [INFO] Configured Artifact: org.openmrs.module:metadatasharing-omod:1.8.0:jar
15-Sep-2021 20:21:51 [INFO] Copying addresshierarchy-omod-2.14.2.jar to /home/bamboo-agent/bamboo-agent/xml-data/build-dir/CONTRIB-QA-FRAMEWORK/package/target/bundled-distro/web/WEB-INF/bundledModules/addresshierarchy-2.14.2.omod
15-Sep-2021 20:21:51 [INFO] Copying legacyui-omod-1.8.3.jar to /home/bamboo-agent/bamboo-agent/xml-data/build-dir/CONTRIB-QA-FRAMEWORK/package/target/bundled-distro/web/WEB-INF/bundledModules/legacyui-1.8.3.omod
15-Sep-2021 20:21:51 [INFO] Copying openconceptlab-omod-1.2.6.jar to /home/bamboo-agent/bamboo-agent/xml-data/build-dir/CONTRIB-QA-FRAMEWORK/package/target/bundled-distro/web/WEB-INF/bundledModules/openconceptlab-1.2.6.omod
15-Sep-2021 20:21:51 [INFO] Copying metadatadeploy-omod-1.13.0.jar to /home/bamboo-agent/bamboo-agent/xml-data/build-dir/CONTRIB-QA-FRAMEWORK/package/target/bundled-distro/web/WEB-INF/bundledModules/metadatadeploy-1.13.0.omod
15-Sep-2021 20:21:51 [INFO] Copying reportingrest-omod-1.12.0.jar to /home/bamboo-agent/bamboo-agent/xml-data/build-dir/CONTRIB-QA-FRAMEWORK/package/target/bundled-distro/web/WEB-INF/bundledModules/reportingrest-1.12.0.omod
15-Sep-2021 20:21:51 [INFO] Copying owa-omod-1.13.0.jar to /home/bamboo-agent/bamboo-agent/xml-data/build-dir/CONTRIB-QA-FRAMEWORK/package/target/bundled-distro/web/WEB-INF/bundledModules/owa-1.13.0.omod
15-Sep-2021 20:21:51 [INFO] Copying fhir2-omod-1.2.2.jar to /home/bamboo-agent/bamboo-agent/xml-data/build-dir/CONTRIB-QA-FRAMEWORK/package/target/bundled-distro/web/WEB-INF/bundledModules/fhir2-1.2.2.omod
15-Sep-2021 20:21:51 [INFO] Copying serialization.xstream-omod-0.2.15.omod to /home/bamboo-agent/bamboo-agent/xml-data/build-dir/CONTRIB-QA-FRAMEWORK/package/target/bundled-distro/web/WEB-INF/bundledModules/serialization.xstream-0.2.15.omod
15-Sep-2021 20:21:51 [INFO] Copying registrationapp-omod-1.24.0.jar to /home/bamboo-agent/bamboo-agent/xml-data/build-dir/CONTRIB-QA-FRAMEWORK/package/target/bundled-distro/web/WEB-INF/bundledModules/registrationapp-1.24.0.omod
15-Sep-2021 20:21:51 [INFO] Copying event-omod-2.10.0-SNAPSHOT.jar to /home/bamboo-agent/bamboo-agent/xml-data/build-dir/CONTRIB-QA-FRAMEWORK/package/target/bundled-distro/web/WEB-INF/bundledModules/event-2.10.0-SNAPSHOT.omod
15-Sep-2021 20:21:51 [INFO] Copying uilibrary-omod-2.0.7.jar to /home/bamboo-agent/bamboo-agent/xml-data/build-dir/CONTRIB-QA-FRAMEWORK/package/target/bundled-distro/web/WEB-INF/bundledModules/uilibrary-2.0.7.omod
15-Sep-2021 20:21:51 [INFO] Copying htmlwidgets-omod-1.10.0.jar to /home/bamboo-agent/bamboo-agent/xml-data/build-dir/CONTRIB-QA-FRAMEWORK/package/target/bundled-distro/web/WEB-INF/bundledModules/htmlwidgets-1.10.0.omod
15-Sep-2021 20:21:51 [INFO] Copying dataexchange-omod-1.3.7.jar to /home/bamboo-agent/bamboo-agent/xml-data/build-dir/CONTRIB-QA-FRAMEWORK/package/target/bundled-distro/web/WEB-INF/bundledModules/dataexchange-1.3.7.omod
15-Sep-2021 20:21:51 [INFO] Copying appui-omod-1.14.0.jar to /home/bamboo-agent/bamboo-agent/xml-data/build-dir/CONTRIB-QA-FRAMEWORK/package/target/bundled-distro/web/WEB-INF/bundledModules/appui-1.14.0.omod
15-Sep-2021 20:21:51 [INFO] Copying allergyui-omod-1.8.4.jar to /home/bamboo-agent/bamboo-agent/xml-data/build-dir/CONTRIB-QA-FRAMEWORK/package/target/bundled-distro/web/WEB-INF/bundledModules/allergyui-1.8.4.omod
15-Sep-2021 20:21:51 [INFO] Copying providermanagement-omod-2.13.0.jar to /home/bamboo-agent/bamboo-agent/xml-data/build-dir/CONTRIB-QA-FRAMEWORK/package/target/bundled-distro/web/WEB-INF/bundledModules/providermanagement-2.13.0.omod
15-Sep-2021 20:21:51 [INFO] Copying appointmentschedulingui-omod-1.12.0.jar to /home/bamboo-agent/bamboo-agent/xml-data/build-dir/CONTRIB-QA-FRAMEWORK/package/target/bundled-distro/web/WEB-INF/bundledModules/appointmentschedulingui-1.12.0.omod
15-Sep-2021 20:21:51 [INFO] Copying attachments-omod-2.5.0.jar to /home/bamboo-agent/bamboo-agent/xml-data/build-dir/CONTRIB-QA-FRAMEWORK/package/target/bundled-distro/web/WEB-INF/bundledModules/attachments-2.5.0.omod
15-Sep-2021 20:21:51 [INFO] Copying formentryapp-omod-1.4.2.jar to /home/bamboo-agent/bamboo-agent/xml-data/build-dir/CONTRIB-QA-FRAMEWORK/package/target/bundled-distro/web/WEB-INF/bundledModules/formentryapp-1.4.2.omod
15-Sep-2021 20:21:51 [INFO] Copying idgen-omod-4.7.0.jar to /home/bamboo-agent/bamboo-agent/xml-data/build-dir/CONTRIB-QA-FRAMEWORK/package/target/bundled-distro/web/WEB-INF/bundledModules/idgen-4.7.0.omod
15-Sep-2021 20:21:51 [INFO] Copying metadatamapping-omod-1.4.0.jar to /home/bamboo-agent/bamboo-agent/xml-data/build-dir/CONTRIB-QA-FRAMEWORK/package/target/bundled-distro/web/WEB-INF/bundledModules/metadatamapping-1.4.0.omod
15-Sep-2021 20:21:51 [INFO] Copying htmlformentryui-omod-2.0.0.jar to /home/bamboo-agent/bamboo-agent/xml-data/build-dir/CONTRIB-QA-FRAMEWORK/package/target/bundled-distro/web/WEB-INF/bundledModules/htmlformentryui-2.0.0.omod
15-Sep-2021 20:21:51 [INFO] Copying referencedemodata-omod-1.4.7.jar to /home/bamboo-agent/bamboo-agent/xml-data/build-dir/CONTRIB-QA-FRAMEWORK/package/target/bundled-distro/web/WEB-INF/bundledModules/referencedemodata-1.4.7.omod
15-Sep-2021 20:21:51 [INFO] Copying emrapi-omod-1.32.0.jar to /home/bamboo-agent/bamboo-agent/xml-data/build-dir/CONTRIB-QA-FRAMEWORK/package/target/bundled-distro/web/WEB-INF/bundledModules/emrapi-1.32.0.omod
15-Sep-2021 20:21:51 [INFO] Copying referenceapplication-omod-2.12.0-SNAPSHOT.jar to /home/bamboo-agent/bamboo-agent/xml-data/build-dir/CONTRIB-QA-FRAMEWORK/package/target/bundled-distro/web/WEB-INF/bundledModules/referenceapplication-2.12.0-SNAPSHOT.omod
15-Sep-2021 20:21:51 [INFO] Copying htmlformentry-omod-4.1.0.jar to /home/bamboo-agent/bamboo-agent/xml-data/build-dir/CONTRIB-QA-FRAMEWORK/package/target/bundled-distro/web/WEB-INF/bundledModules/htmlformentry-4.1.0.omod
15-Sep-2021 20:21:52 [INFO] Copying appframework-omod-2.16.0.jar to /home/bamboo-agent/bamboo-agent/xml-data/build-dir/CONTRIB-QA-FRAMEWORK/package/target/bundled-distro/web/WEB-INF/bundledModules/appframework-2.16.0.omod
15-Sep-2021 20:21:52 [INFO] Copying referencemetadata-omod-2.12.0.jar to /home/bamboo-agent/bamboo-agent/xml-data/build-dir/CONTRIB-QA-FRAMEWORK/package/target/bundled-distro/web/WEB-INF/bundledModules/referencemetadata-2.12.0.omod
15-Sep-2021 20:21:52 [INFO] Copying reportingui-omod-1.8.0.jar to /home/bamboo-agent/bamboo-agent/xml-data/build-dir/CONTRIB-QA-FRAMEWORK/package/target/bundled-distro/web/WEB-INF/bundledModules/reportingui-1.8.0.omod
15-Sep-2021 20:21:52 [INFO] Copying coreapps-omod-1.34.0-SNAPSHOT.jar to /home/bamboo-agent/bamboo-agent/xml-data/build-dir/CONTRIB-QA-FRAMEWORK/package/target/bundled-distro/web/WEB-INF/bundledModules/coreapps-1.34.0-SNAPSHOT.omod
15-Sep-2021 20:21:52 [INFO] Copying reportingcompatibility-omod-2.0.8.jar to /home/bamboo-agent/bamboo-agent/xml-data/build-dir/CONTRIB-QA-FRAMEWORK/package/target/bundled-distro/web/WEB-INF/bundledModules/reportingcompatibility-2.0.8.omod
15-Sep-2021 20:21:52 [INFO] Copying reporting-omod-1.23.0.jar to /home/bamboo-agent/bamboo-agent/xml-data/build-dir/CONTRIB-QA-FRAMEWORK/package/target/bundled-distro/web/WEB-INF/bundledModules/reporting-1.23.0.omod
15-Sep-2021 20:21:52 [INFO] Copying adminui-omod-1.5.0.jar to /home/bamboo-agent/bamboo-agent/xml-data/build-dir/CONTRIB-QA-FRAMEWORK/package/target/bundled-distro/web/WEB-INF/bundledModules/adminui-1.5.0.omod
15-Sep-2021 20:21:52 [INFO] Copying registrationcore-omod-1.11.0.jar to /home/bamboo-agent/bamboo-agent/xml-data/build-dir/CONTRIB-QA-FRAMEWORK/package/target/bundled-distro/web/WEB-INF/bundledModules/registrationcore-1.11.0.omod
15-Sep-2021 20:21:52 [INFO] Copying appointmentscheduling-omod-1.16.0.jar to /home/bamboo-agent/bamboo-agent/xml-data/build-dir/CONTRIB-QA-FRAMEWORK/package/target/bundled-distro/web/WEB-INF/bundledModules/appointmentscheduling-1.16.0.omod
15-Sep-2021 20:21:52 [INFO] Copying atlas-omod-2.2.5.omod to /home/bamboo-agent/bamboo-agent/xml-data/build-dir/CONTRIB-QA-FRAMEWORK/package/target/bundled-distro/web/WEB-INF/bundledModules/atlas-2.2.5.omod
15-Sep-2021 20:21:52 [INFO] Copying calculation-omod-1.3.0.jar to /home/bamboo-agent/bamboo-agent/xml-data/build-dir/CONTRIB-QA-FRAMEWORK/package/target/bundled-distro/web/WEB-INF/bundledModules/calculation-1.3.0.omod
15-Sep-2021 20:21:52 [INFO] Copying webservices.rest-omod-2.32.0-SNAPSHOT.jar to /home/bamboo-agent/bamboo-agent/xml-data/build-dir/CONTRIB-QA-FRAMEWORK/package/target/bundled-distro/web/WEB-INF/bundledModules/webservices.rest-2.32.0-SNAPSHOT.omod
15-Sep-2021 20:21:52 [INFO] Copying spa-omod-1.0.8.jar to /home/bamboo-agent/bamboo-agent/xml-data/build-dir/CONTRIB-QA-FRAMEWORK/package/target/bundled-distro/web/WEB-INF/bundledModules/spa-1.0.8.omod
15-Sep-2021 20:21:52 [INFO] Copying uicommons-omod-2.18.0.jar to /home/bamboo-agent/bamboo-agent/xml-data/build-dir/CONTRIB-QA-FRAMEWORK/package/target/bundled-distro/web/WEB-INF/bundledModules/uicommons-2.18.0.omod
15-Sep-2021 20:21:52 [INFO] Copying uiframework-omod-3.21.0.jar to /home/bamboo-agent/bamboo-agent/xml-data/build-dir/CONTRIB-QA-FRAMEWORK/package/target/bundled-distro/web/WEB-INF/bundledModules/uiframework-3.21.0.omod
15-Sep-2021 20:21:52 [INFO] Copying metadatasharing-omod-1.8.0.jar to /home/bamboo-agent/bamboo-agent/xml-data/build-dir/CONTRIB-QA-FRAMEWORK/package/target/bundled-distro/web/WEB-INF/bundledModules/metadatasharing-1.8.0.omod
15-Sep-2021 20:21:52
15-Sep-2021 20:21:52 Downloading OWAs...
15-Sep-2021 20:21:52
15-Sep-2021 20:21:52
15-Sep-2021 20:21:52 Downloading OWA: org.openmrs.owa:openmrs-owa-sysadmin:1.2
15-Sep-2021 20:21:52 [INFO] Configured Artifact: org.openmrs.owa:sysadmin:1.2:zip
15-Sep-2021 20:21:52 [INFO] Copying sysadmin-1.2.zip to /home/bamboo-agent/bamboo-agent/xml-data/build-dir/CONTRIB-QA-FRAMEWORK/package/target/bundled-distro/web/WEB-INF/bundledOwas/sysadmin-1.2.zip
15-Sep-2021 20:21:53
15-Sep-2021 20:21:53 Creating Docker Compose configuration...
15-Sep-2021 20:21:53
15-Sep-2021 20:21:55
15-Sep-2021 20:21:55 The 'referenceapplication' distribution created! To start up the server run 'docker-compose up' from /home/bamboo-agent/bamboo-agent/xml-data/build-dir/CONTRIB-QA-FRAMEWORK/package/target/bundled-distro
15-Sep-2021 20:21:55
15-Sep-2021 20:21:55 [INFO]
15-Sep-2021 20:21:55 [INFO] --- maven-compiler-plugin:3.1:compile (default-compile) @ referenceapplication-package ---
15-Sep-2021 20:21:55 [INFO] No sources to compile
15-Sep-2021 20:21:55 [INFO]
15-Sep-2021 20:21:55 [INFO] --- maven-resources-plugin:2.6:testResources (default-testResources) @ referenceapplication-package ---
15-Sep-2021 20:21:55 [INFO] Using 'UTF-8' encoding to copy filtered resources.
15-Sep-2021 20:21:55 [INFO] skip non existing resourceDirectory /home/bamboo-agent/bamboo-agent/xml-data/build-dir/CONTRIB-QA-FRAMEWORK/package/src/test/resources
15-Sep-2021 20:21:55 [INFO] skip non existing resourceDirectory /home/bamboo-agent/bamboo-agent/xml-data/build-dir/CONTRIB-QA-FRAMEWORK/package/src/test/resources
15-Sep-2021 20:21:55 [INFO]
15-Sep-2021 20:21:55 [INFO] --- maven-compiler-plugin:3.1:testCompile (default-testCompile) @ referenceapplication-package ---
15-Sep-2021 20:21:55 [INFO] No sources to compile
15-Sep-2021 20:21:55 [INFO]
15-Sep-2021 20:21:55 [INFO] --- maven-surefire-plugin:2.12:test (default-test) @ referenceapplication-package ---
15-Sep-2021 20:21:55 [INFO] Downloading: http://mavenrepo.openmrs.org/nexus/content/repositories/public/org/apache/maven/surefire/surefire-booter/2.12/surefire-booter-2.12.pom
15-Sep-2021 20:21:55 [INFO] Downloaded: http://mavenrepo.openmrs.org/nexus/content/repositories/public/org/apache/maven/surefire/surefire-booter/2.12/surefire-booter-2.12.pom (3 KB at 11.3 KB/sec)
15-Sep-2021 20:21:55 [INFO] Downloading: http://mavenrepo.openmrs.org/nexus/content/repositories/public/org/apache/maven/surefire/surefire-api/2.12/surefire-api-2.12.pom
15-Sep-2021 20:21:55 [INFO] Downloaded: http://mavenrepo.openmrs.org/nexus/content/repositories/public/org/apache/maven/surefire/surefire-api/2.12/surefire-api-2.12.pom (3 KB at 9.3 KB/sec)
15-Sep-2021 20:21:55 [INFO] Downloading: http://mavenrepo.openmrs.org/nexus/content/repositories/public/org/apache/maven/surefire/maven-surefire-common/2.12/maven-surefire-common-2.12.pom
15-Sep-2021 20:21:56 [INFO] Downloaded: http://mavenrepo.openmrs.org/nexus/content/repositories/public/org/apache/maven/surefire/maven-surefire-common/2.12/maven-surefire-common-2.12.pom (6 KB at 19.0 KB/sec)
15-Sep-2021 20:21:56 [INFO] Downloading: http://mavenrepo.openmrs.org/nexus/content/repositories/public/org/apache/maven/surefire/surefire-booter/2.12/surefire-booter-2.12.jar
15-Sep-2021 20:21:56 [INFO] Downloading: http://mavenrepo.openmrs.org/nexus/content/repositories/public/org/apache/maven/surefire/surefire-api/2.12/surefire-api-2.12.jar
15-Sep-2021 20:21:56 [INFO] Downloading: http://mavenrepo.openmrs.org/nexus/content/repositories/public/org/apache/maven/surefire/maven-surefire-common/2.12/maven-surefire-common-2.12.jar
15-Sep-2021 20:21:56 [INFO] Downloaded: http://mavenrepo.openmrs.org/nexus/content/repositories/public/org/apache/maven/surefire/surefire-booter/2.12/surefire-booter-2.12.jar (33 KB at 119.1 KB/sec)
15-Sep-2021 20:21:56 [INFO] Downloaded: http://mavenrepo.openmrs.org/nexus/content/repositories/public/org/apache/maven/surefire/surefire-api/2.12/surefire-api-2.12.jar (122 KB at 148.3 KB/sec)
15-Sep-2021 20:21:57 [INFO] Downloaded: http://mavenrepo.openmrs.org/nexus/content/repositories/public/org/apache/maven/surefire/maven-surefire-common/2.12/maven-surefire-common-2.12.jar (219 KB at 133.9 KB/sec)
15-Sep-2021 20:21:57 [INFO] No tests to run.
15-Sep-2021 20:21:57 [INFO] Surefire report directory: /home/bamboo-agent/bamboo-agent/xml-data/build-dir/CONTRIB-QA-FRAMEWORK/package/target/surefire-reports
15-Sep-2021 20:21:57
15-Sep-2021 20:21:57 -------------------------------------------------------
15-Sep-2021 20:21:57 T E S T S
15-Sep-2021 20:21:57 -------------------------------------------------------
15-Sep-2021 20:22:04
15-Sep-2021 20:22:04 Results :
15-Sep-2021 20:22:04
15-Sep-2021 20:22:04 Tests run: 0, Failures: 0, Errors: 0, Skipped: 0
15-Sep-2021 20:22:04
15-Sep-2021 20:22:04 [INFO]
15-Sep-2021 20:22:04 [INFO] --- maven-jar-plugin:2.4:jar (default-jar) @ referenceapplication-package ---
15-Sep-2021 20:22:04 [INFO] Building jar: /home/bamboo-agent/bamboo-agent/xml-data/build-dir/CONTRIB-QA-FRAMEWORK/package/target/referenceapplication-package-2.12.0-SNAPSHOT.jar
15-Sep-2021 20:22:04 [INFO]
15-Sep-2021 20:22:04 [INFO] --- maven-assembly-plugin:2.3:single (make-assembly) @ referenceapplication-package ---
15-Sep-2021 20:22:05 [INFO] Reading assembly descriptor: /home/bamboo-agent/bamboo-agent/xml-data/build-dir/CONTRIB-QA-FRAMEWORK/package/src/main/assembly/assembly.xml
15-Sep-2021 20:22:05 [INFO] Building zip: /home/bamboo-agent/bamboo-agent/xml-data/build-dir/CONTRIB-QA-FRAMEWORK/package/target/referenceapplication-package-2.12.0-SNAPSHOT-addons.zip
15-Sep-2021 20:22:09 [INFO]
15-Sep-2021 20:22:09 [INFO] --- build-helper-maven-plugin:3.0.0:attach-artifact (attach-artifacts) @ referenceapplication-package ---
15-Sep-2021 20:22:10 [INFO]
15-Sep-2021 20:22:10 [INFO] --- maven-jar-plugin:2.4:test-jar (default) @ referenceapplication-package ---
15-Sep-2021 20:22:10 [WARNING] JAR will be empty - no content was marked for inclusion!
15-Sep-2021 20:22:10 [INFO] Building jar: /home/bamboo-agent/bamboo-agent/xml-data/build-dir/CONTRIB-QA-FRAMEWORK/package/target/referenceapplication-package-2.12.0-SNAPSHOT-tests.jar
15-Sep-2021 20:22:10 [INFO]
15-Sep-2021 20:22:10 [INFO] --- maven-install-plugin:2.4:install (default-install) @ referenceapplication-package ---
15-Sep-2021 20:22:10 [INFO] Installing /home/bamboo-agent/bamboo-agent/xml-data/build-dir/CONTRIB-QA-FRAMEWORK/package/target/referenceapplication-package-2.12.0-SNAPSHOT.jar to /home/bamboo-agent/.m2/repository/org/openmrs/distro/referenceapplication-package/2.12.0-SNAPSHOT/referenceapplication-package-2.12.0-SNAPSHOT.jar
15-Sep-2021 20:22:10 [INFO] Installing /home/bamboo-agent/bamboo-agent/xml-data/build-dir/CONTRIB-QA-FRAMEWORK/package/pom.xml to /home/bamboo-agent/.m2/repository/org/openmrs/distro/referenceapplication-package/2.12.0-SNAPSHOT/referenceapplication-package-2.12.0-SNAPSHOT.pom
15-Sep-2021 20:22:10 [INFO] Installing /home/bamboo-agent/bamboo-agent/xml-data/build-dir/CONTRIB-QA-FRAMEWORK/package/target/referenceapplication-package-2.12.0-SNAPSHOT-addons.zip to /home/bamboo-agent/.m2/repository/org/openmrs/distro/referenceapplication-package/2.12.0-SNAPSHOT/referenceapplication-package-2.12.0-SNAPSHOT-addons.zip
15-Sep-2021 20:22:10 [INFO] Installing /home/bamboo-agent/bamboo-agent/xml-data/build-dir/CONTRIB-QA-FRAMEWORK/package/target/bundled-distro/web/openmrs.war to /home/bamboo-agent/.m2/repository/org/openmrs/distro/referenceapplication-package/2.12.0-SNAPSHOT/referenceapplication-package-2.12.0-SNAPSHOT.war
15-Sep-2021 20:22:10 [INFO] Installing /home/bamboo-agent/bamboo-agent/xml-data/build-dir/CONTRIB-QA-FRAMEWORK/package/target/referenceapplication-package-2.12.0-SNAPSHOT-tests.jar to /home/bamboo-agent/.m2/repository/org/openmrs/distro/referenceapplication-package/2.12.0-SNAPSHOT/referenceapplication-package-2.12.0-SNAPSHOT-tests.jar
15-Sep-2021 20:22:10 [INFO]                                                                         
15-Sep-2021 20:22:10 [INFO] ------------------------------------------------------------------------
15-Sep-2021 20:22:10 [INFO] Building Reference Application Distribution UI Tests 2.12.0-SNAPSHOT
15-Sep-2021 20:22:10 [INFO] ------------------------------------------------------------------------
15-Sep-2021 20:22:10 [INFO] Downloading: http://mavenrepo.openmrs.org/nexus/content/repositories/public/org/apache/maven/plugins/maven-failsafe-plugin/2.18.1/maven-failsafe-plugin-2.18.1.pom
15-Sep-2021 20:22:11 [INFO] Downloaded: http://mavenrepo.openmrs.org/nexus/content/repositories/public/org/apache/maven/plugins/maven-failsafe-plugin/2.18.1/maven-failsafe-plugin-2.18.1.pom (9 KB at 34.3 KB/sec)
15-Sep-2021 20:22:11 [INFO] Downloading: http://mavenrepo.openmrs.org/nexus/content/repositories/public/org/apache/maven/surefire/surefire/2.18.1/surefire-2.18.1.pom
15-Sep-2021 20:22:11 [INFO] Downloaded: http://mavenrepo.openmrs.org/nexus/content/repositories/public/org/apache/maven/surefire/surefire/2.18.1/surefire-2.18.1.pom (17 KB at 62.8 KB/sec)
15-Sep-2021 20:22:11 [INFO] Downloading: http://mavenrepo.openmrs.org/nexus/content/repositories/public/org/apache/maven/plugins/maven-failsafe-plugin/2.18.1/maven-failsafe-plugin-2.18.1.jar
15-Sep-2021 20:22:11 [INFO] Downloaded: http://mavenrepo.openmrs.org/nexus/content/repositories/public/org/apache/maven/plugins/maven-failsafe-plugin/2.18.1/maven-failsafe-plugin-2.18.1.jar (81 KB at 303.9 KB/sec)
15-Sep-2021 20:22:11 [INFO] Downloading: http://mavenrepo.openmrs.org/nexus/content/repositories/public/org/apache/maven/plugins/maven-antrun-plugin/1.8/maven-antrun-plugin-1.8.pom
15-Sep-2021 20:22:11 [INFO] Downloaded: http://mavenrepo.openmrs.org/nexus/content/repositories/public/org/apache/maven/plugins/maven-antrun-plugin/1.8/maven-antrun-plugin-1.8.pom (4 KB at 12.7 KB/sec)
15-Sep-2021 20:22:11 [INFO] Downloading: http://mavenrepo.openmrs.org/nexus/content/repositories/public/org/apache/maven/plugins/maven-plugins/27/maven-plugins-27.pom
15-Sep-2021 20:22:12 [INFO] Downloaded: http://mavenrepo.openmrs.org/nexus/content/repositories/public/org/apache/maven/plugins/maven-plugins/27/maven-plugins-27.pom (12 KB at 43.1 KB/sec)
15-Sep-2021 20:22:12 [INFO] Downloading: http://mavenrepo.openmrs.org/nexus/content/repositories/public/org/apache/maven/plugins/maven-antrun-plugin/1.8/maven-antrun-plugin-1.8.jar
15-Sep-2021 20:22:12 [INFO] Downloaded: http://mavenrepo.openmrs.org/nexus/content/repositories/public/org/apache/maven/plugins/maven-antrun-plugin/1.8/maven-antrun-plugin-1.8.jar (36 KB at 134.2 KB/sec)
15-Sep-2021 20:22:12 [INFO] Downloading: http://mavenrepo.openmrs.org/nexus/content/repositories/public/org/openmrs/contrib/uitestframework/2.4.0/uitestframework-2.4.0.pom
15-Sep-2021 20:22:12 [INFO] Downloaded: http://mavenrepo.openmrs.org/nexus/content/repositories/public/org/openmrs/contrib/uitestframework/2.4.0/uitestframework-2.4.0.pom (6 KB at 15.8 KB/sec)
15-Sep-2021 20:22:13 [INFO] Downloading: http://mavenrepo.openmrs.org/nexus/content/repositories/public/org/openmrs/contrib/uitestframework/2.4.0/uitestframework-2.4.0.jar
15-Sep-2021 20:22:15 [INFO] Downloaded: http://mavenrepo.openmrs.org/nexus/content/repositories/public/org/openmrs/contrib/uitestframework/2.4.0/uitestframework-2.4.0.jar (15766 KB at 6362.2 KB/sec)
15-Sep-2021 20:22:15 [INFO]
15-Sep-2021 20:22:15 [INFO] --- maven-clean-plugin:2.5:clean (default-clean) @ referenceapplication-ui-tests ---
15-Sep-2021 20:22:15 [INFO]
15-Sep-2021 20:22:15 [INFO] --- maven-resources-plugin:2.6:resources (default-resources) @ referenceapplication-ui-tests ---
15-Sep-2021 20:22:15 [INFO] Using 'UTF-8' encoding to copy filtered resources.
15-Sep-2021 20:22:15 [INFO] skip non existing resourceDirectory /home/bamboo-agent/bamboo-agent/xml-data/build-dir/CONTRIB-QA-FRAMEWORK/ui-tests/src/main/resources
15-Sep-2021 20:22:15 [INFO]
15-Sep-2021 20:22:15 [INFO] --- maven-compiler-plugin:3.1:compile (default-compile) @ referenceapplication-ui-tests ---
15-Sep-2021 20:22:15 [INFO] No sources to compile
15-Sep-2021 20:22:15 [INFO]
15-Sep-2021 20:22:15 [INFO] --- maven-resources-plugin:2.6:testResources (default-testResources) @ referenceapplication-ui-tests ---
15-Sep-2021 20:22:15 [INFO] Using 'UTF-8' encoding to copy filtered resources.
15-Sep-2021 20:22:15 [INFO] Copying 2 resources
15-Sep-2021 20:22:15 [INFO] Copying 2 resources
15-Sep-2021 20:22:15 [INFO]
15-Sep-2021 20:22:15 [INFO] --- maven-compiler-plugin:3.1:testCompile (default-testCompile) @ referenceapplication-ui-tests ---
15-Sep-2021 20:22:15 [INFO] Changes detected - recompiling the module!
15-Sep-2021 20:22:15 [INFO] Compiling 119 source files to /home/bamboo-agent/bamboo-agent/xml-data/build-dir/CONTRIB-QA-FRAMEWORK/ui-tests/target/test-classes
15-Sep-2021 20:22:19 [WARNING] /home/bamboo-agent/bamboo-agent/xml-data/build-dir/CONTRIB-QA-FRAMEWORK/ui-tests/src/test/java/org/openmrs/reference/AddDeleteLocationTest.java: Some input files use or override a deprecated API.
15-Sep-2021 20:22:19 [WARNING] /home/bamboo-agent/bamboo-agent/xml-data/build-dir/CONTRIB-QA-FRAMEWORK/ui-tests/src/test/java/org/openmrs/reference/AddDeleteLocationTest.java: Recompile with -Xlint:deprecation for details.
15-Sep-2021 20:22:19 [WARNING] /home/bamboo-agent/bamboo-agent/xml-data/build-dir/CONTRIB-QA-FRAMEWORK/ui-tests/src/test/java/org/openmrs/reference/AddRolesToUserTest.java: /home/bamboo-agent/bamboo-agent/xml-data/build-dir/CONTRIB-QA-FRAMEWORK/ui-tests/src/test/java/org/openmrs/reference/AddRolesToUserTest.java uses unchecked or unsafe operations.
15-Sep-2021 20:22:19 [WARNING] /home/bamboo-agent/bamboo-agent/xml-data/build-dir/CONTRIB-QA-FRAMEWORK/ui-tests/src/test/java/org/openmrs/reference/AddRolesToUserTest.java: Recompile with -Xlint:unchecked for details.
15-Sep-2021 20:22:19 [INFO]
15-Sep-2021 20:22:19 [INFO] --- maven-antrun-plugin:1.8:run (make-mac-chromedriver-executable) @ referenceapplication-ui-tests ---
15-Sep-2021 20:22:19 [INFO] Downloading: http://mavenrepo.openmrs.org/nexus/content/repositories/public/org/codehaus/plexus/plexus-utils/3.0.20/plexus-utils-3.0.20.jar
15-Sep-2021 20:22:19 [INFO] Downloaded: http://mavenrepo.openmrs.org/nexus/content/repositories/public/org/codehaus/plexus/plexus-utils/3.0.20/plexus-utils-3.0.20.jar (238 KB at 570.7 KB/sec)
15-Sep-2021 20:22:20 [INFO] Executing tasks
15-Sep-2021 20:22:20
15-Sep-2021 20:22:20 main:
15-Sep-2021 20:22:20 [INFO] An Ant BuildException has occured: /home/bamboo-agent/bamboo-agent/xml-data/build-dir/CONTRIB-QA-FRAMEWORK/ui-tests/target/test-classes/chromedriver/mac does not exist.
15-Sep-2021 20:22:20 around Ant part ...<chmod file="target/test-classes/chromedriver/mac/chromedriver" perm="755"/>... @ 4:79 in /home/bamboo-agent/bamboo-agent/xml-data/build-dir/CONTRIB-QA-FRAMEWORK/ui-tests/target/antrun/build-main.xml
15-Sep-2021 20:22:20 /home/bamboo-agent/bamboo-agent/xml-data/build-dir/CONTRIB-QA-FRAMEWORK/ui-tests/target/antrun/build-main.xml:4: /home/bamboo-agent/bamboo-agent/xml-data/build-dir/CONTRIB-QA-FRAMEWORK/ui-tests/target/test-classes/chromedriver/mac does not exist.
15-Sep-2021 20:22:20         at org.apache.tools.ant.types.AbstractFileSet.getDirectoryScanner(AbstractFileSet.java:484)
15-Sep-2021 20:22:20         at org.apache.tools.ant.taskdefs.ExecuteOn.runExec(ExecuteOn.java:369)
15-Sep-2021 20:22:20         at org.apache.tools.ant.taskdefs.ExecTask.execute(ExecTask.java:495)
15-Sep-2021 20:22:20         at org.apache.tools.ant.taskdefs.Chmod.execute(Chmod.java:181)
15-Sep-2021 20:22:20         at org.apache.tools.ant.UnknownElement.execute(UnknownElement.java:292)
15-Sep-2021 20:22:20         at sun.reflect.NativeMethodAccessorImpl.invoke0(Native Method)
15-Sep-2021 20:22:20         at sun.reflect.NativeMethodAccessorImpl.invoke(NativeMethodAccessorImpl.java:62)
15-Sep-2021 20:22:20         at sun.reflect.DelegatingMethodAccessorImpl.invoke(DelegatingMethodAccessorImpl.java:43)
15-Sep-2021 20:22:20         at java.lang.reflect.Method.invoke(Method.java:498)
15-Sep-2021 20:22:20         at org.apache.tools.ant.dispatch.DispatchUtils.execute(DispatchUtils.java:106)
15-Sep-2021 20:22:20         at org.apache.tools.ant.Task.perform(Task.java:348)
15-Sep-2021 20:22:20         at org.apache.tools.ant.Target.execute(Target.java:435)
15-Sep-2021 20:22:20         at org.apache.tools.ant.Target.performTasks(Target.java:456)
15-Sep-2021 20:22:20         at org.apache.tools.ant.Project.executeSortedTargets(Project.java:1393)
15-Sep-2021 20:22:20         at org.apache.tools.ant.Project.executeTarget(Project.java:1364)
15-Sep-2021 20:22:20         at org.apache.maven.plugin.antrun.AntRunMojo.execute(AntRunMojo.java:313)
15-Sep-2021 20:22:20         at org.apache.maven.plugin.DefaultBuildPluginManager.executeMojo(DefaultBuildPluginManager.java:134)
15-Sep-2021 20:22:20         at org.apache.maven.lifecycle.internal.MojoExecutor.execute(MojoExecutor.java:207)
15-Sep-2021 20:22:20         at org.apache.maven.lifecycle.internal.MojoExecutor.execute(MojoExecutor.java:153)
15-Sep-2021 20:22:20         at org.apache.maven.lifecycle.internal.MojoExecutor.execute(MojoExecutor.java:145)
15-Sep-2021 20:22:20         at org.apache.maven.lifecycle.internal.LifecycleModuleBuilder.buildProject(LifecycleModuleBuilder.java:116)
15-Sep-2021 20:22:20         at org.apache.maven.lifecycle.internal.LifecycleModuleBuilder.buildProject(LifecycleModuleBuilder.java:80)
15-Sep-2021 20:22:20         at org.apache.maven.lifecycle.internal.builder.singlethreaded.SingleThreadedBuilder.build(SingleThreadedBuilder.java:51)
15-Sep-2021 20:22:20         at org.apache.maven.lifecycle.internal.LifecycleStarter.execute(LifecycleStarter.java:128)
15-Sep-2021 20:22:20         at org.apache.maven.DefaultMaven.doExecute(DefaultMaven.java:307)
15-Sep-2021 20:22:20         at org.apache.maven.DefaultMaven.doExecute(DefaultMaven.java:193)
15-Sep-2021 20:22:20         at org.apache.maven.DefaultMaven.execute(DefaultMaven.java:106)
15-Sep-2021 20:22:20         at org.apache.maven.cli.MavenCli.execute(MavenCli.java:863)
15-Sep-2021 20:22:20         at org.apache.maven.cli.MavenCli.doMain(MavenCli.java:288)
15-Sep-2021 20:22:20         at org.apache.maven.cli.MavenCli.main(MavenCli.java:199)
15-Sep-2021 20:22:20         at sun.reflect.NativeMethodAccessorImpl.invoke0(Native Method)
15-Sep-2021 20:22:20         at sun.reflect.NativeMethodAccessorImpl.invoke(NativeMethodAccessorImpl.java:62)
15-Sep-2021 20:22:20         at sun.reflect.DelegatingMethodAccessorImpl.invoke(DelegatingMethodAccessorImpl.java:43)
15-Sep-2021 20:22:20         at java.lang.reflect.Method.invoke(Method.java:498)
15-Sep-2021 20:22:20         at org.codehaus.plexus.classworlds.launcher.Launcher.launchEnhanced(Launcher.java:289)
15-Sep-2021 20:22:20         at org.codehaus.plexus.classworlds.launcher.Launcher.launch(Launcher.java:229)
15-Sep-2021 20:22:20         at org.codehaus.plexus.classworlds.launcher.Launcher.mainWithExitCode(Launcher.java:415)
15-Sep-2021 20:22:20         at org.codehaus.plexus.classworlds.launcher.Launcher.main(Launcher.java:356)
15-Sep-2021 20:22:20 [INFO]
15-Sep-2021 20:22:20 [INFO] --- maven-antrun-plugin:1.8:run (make-linux-chromedriver-executable) @ referenceapplication-ui-tests ---
15-Sep-2021 20:22:20 [INFO] Executing tasks
15-Sep-2021 20:22:20
15-Sep-2021 20:22:20 main:
15-Sep-2021 20:22:20 [INFO] Executed tasks
15-Sep-2021 20:22:20 [INFO]
15-Sep-2021 20:22:20 [INFO] --- maven-antrun-plugin:1.8:run (make-mac-firefoxdriver-executable) @ referenceapplication-ui-tests ---
15-Sep-2021 20:22:20 [INFO] Executing tasks
15-Sep-2021 20:22:20
15-Sep-2021 20:22:20 main:
15-Sep-2021 20:22:20 [INFO] An Ant BuildException has occured: /home/bamboo-agent/bamboo-agent/xml-data/build-dir/CONTRIB-QA-FRAMEWORK/ui-tests/target/test-classes/firefoxdriver/mac does not exist.
15-Sep-2021 20:22:20 around Ant part ...<chmod file="target/test-classes/firefoxdriver/mac/geckodriver" perm="755"/>... @ 4:79 in /home/bamboo-agent/bamboo-agent/xml-data/build-dir/CONTRIB-QA-FRAMEWORK/ui-tests/target/antrun/build-main.xml
15-Sep-2021 20:22:20 /home/bamboo-agent/bamboo-agent/xml-data/build-dir/CONTRIB-QA-FRAMEWORK/ui-tests/target/antrun/build-main.xml:4: /home/bamboo-agent/bamboo-agent/xml-data/build-dir/CONTRIB-QA-FRAMEWORK/ui-tests/target/test-classes/firefoxdriver/mac does not exist.
15-Sep-2021 20:22:20         at org.apache.tools.ant.types.AbstractFileSet.getDirectoryScanner(AbstractFileSet.java:484)
15-Sep-2021 20:22:20         at org.apache.tools.ant.taskdefs.ExecuteOn.runExec(ExecuteOn.java:369)
15-Sep-2021 20:22:20         at org.apache.tools.ant.taskdefs.ExecTask.execute(ExecTask.java:495)
15-Sep-2021 20:22:20         at org.apache.tools.ant.taskdefs.Chmod.execute(Chmod.java:181)
15-Sep-2021 20:22:20         at org.apache.tools.ant.UnknownElement.execute(UnknownElement.java:292)
15-Sep-2021 20:22:20         at sun.reflect.NativeMethodAccessorImpl.invoke0(Native Method)
15-Sep-2021 20:22:20         at sun.reflect.NativeMethodAccessorImpl.invoke(NativeMethodAccessorImpl.java:62)
15-Sep-2021 20:22:20         at sun.reflect.DelegatingMethodAccessorImpl.invoke(DelegatingMethodAccessorImpl.java:43)
15-Sep-2021 20:22:20         at java.lang.reflect.Method.invoke(Method.java:498)
15-Sep-2021 20:22:20         at org.apache.tools.ant.dispatch.DispatchUtils.execute(DispatchUtils.java:106)
15-Sep-2021 20:22:20         at org.apache.tools.ant.Task.perform(Task.java:348)
15-Sep-2021 20:22:20         at org.apache.tools.ant.Target.execute(Target.java:435)
15-Sep-2021 20:22:20         at org.apache.tools.ant.Target.performTasks(Target.java:456)
15-Sep-2021 20:22:20         at org.apache.tools.ant.Project.executeSortedTargets(Project.java:1393)
15-Sep-2021 20:22:20         at org.apache.tools.ant.Project.executeTarget(Project.java:1364)
15-Sep-2021 20:22:20         at org.apache.maven.plugin.antrun.AntRunMojo.execute(AntRunMojo.java:313)
15-Sep-2021 20:22:20         at org.apache.maven.plugin.DefaultBuildPluginManager.executeMojo(DefaultBuildPluginManager.java:134)
15-Sep-2021 20:22:20         at org.apache.maven.lifecycle.internal.MojoExecutor.execute(MojoExecutor.java:207)
15-Sep-2021 20:22:20         at org.apache.maven.lifecycle.internal.MojoExecutor.execute(MojoExecutor.java:153)
15-Sep-2021 20:22:20         at org.apache.maven.lifecycle.internal.MojoExecutor.execute(MojoExecutor.java:145)
15-Sep-2021 20:22:20         at org.apache.maven.lifecycle.internal.LifecycleModuleBuilder.buildProject(LifecycleModuleBuilder.java:116)
15-Sep-2021 20:22:20         at org.apache.maven.lifecycle.internal.LifecycleModuleBuilder.buildProject(LifecycleModuleBuilder.java:80)
15-Sep-2021 20:22:20         at org.apache.maven.lifecycle.internal.builder.singlethreaded.SingleThreadedBuilder.build(SingleThreadedBuilder.java:51)
15-Sep-2021 20:22:20         at org.apache.maven.lifecycle.internal.LifecycleStarter.execute(LifecycleStarter.java:128)
15-Sep-2021 20:22:20         at org.apache.maven.DefaultMaven.doExecute(DefaultMaven.java:307)
15-Sep-2021 20:22:20         at org.apache.maven.DefaultMaven.doExecute(DefaultMaven.java:193)
15-Sep-2021 20:22:20         at org.apache.maven.DefaultMaven.execute(DefaultMaven.java:106)
15-Sep-2021 20:22:20         at org.apache.maven.cli.MavenCli.execute(MavenCli.java:863)
15-Sep-2021 20:22:20         at org.apache.maven.cli.MavenCli.doMain(MavenCli.java:288)
15-Sep-2021 20:22:20         at org.apache.maven.cli.MavenCli.main(MavenCli.java:199)
15-Sep-2021 20:22:20         at sun.reflect.NativeMethodAccessorImpl.invoke0(Native Method)
15-Sep-2021 20:22:20         at sun.reflect.NativeMethodAccessorImpl.invoke(NativeMethodAccessorImpl.java:62)
15-Sep-2021 20:22:20         at sun.reflect.DelegatingMethodAccessorImpl.invoke(DelegatingMethodAccessorImpl.java:43)
15-Sep-2021 20:22:20         at java.lang.reflect.Method.invoke(Method.java:498)
15-Sep-2021 20:22:20         at org.codehaus.plexus.classworlds.launcher.Launcher.launchEnhanced(Launcher.java:289)
15-Sep-2021 20:22:20         at org.codehaus.plexus.classworlds.launcher.Launcher.launch(Launcher.java:229)
15-Sep-2021 20:22:20         at org.codehaus.plexus.classworlds.launcher.Launcher.mainWithExitCode(Launcher.java:415)
15-Sep-2021 20:22:20         at org.codehaus.plexus.classworlds.launcher.Launcher.main(Launcher.java:356)
15-Sep-2021 20:22:20 [INFO]
15-Sep-2021 20:22:20 [INFO] --- maven-antrun-plugin:1.8:run (make-linux-firefoxdriver-executable) @ referenceapplication-ui-tests ---
15-Sep-2021 20:22:21 [INFO] Executing tasks
15-Sep-2021 20:22:21
15-Sep-2021 20:22:21 main:
15-Sep-2021 20:22:21 [INFO] Executed tasks
15-Sep-2021 20:22:21 [INFO]
15-Sep-2021 20:22:21 [INFO] --- maven-surefire-plugin:2.12:test (default-test) @ referenceapplication-ui-tests ---
15-Sep-2021 20:22:21 [INFO] Tests are skipped.
15-Sep-2021 20:22:21 [INFO]
15-Sep-2021 20:22:21 [INFO] --- maven-jar-plugin:2.4:jar (default-jar) @ referenceapplication-ui-tests ---
15-Sep-2021 20:22:21 [WARNING] JAR will be empty - no content was marked for inclusion!
15-Sep-2021 20:22:21 [INFO] Building jar: /home/bamboo-agent/bamboo-agent/xml-data/build-dir/CONTRIB-QA-FRAMEWORK/ui-tests/target/referenceapplication-ui-tests-2.12.0-SNAPSHOT.jar
15-Sep-2021 20:22:21 [INFO]
15-Sep-2021 20:22:21 [INFO] --- maven-jar-plugin:2.4:test-jar (default) @ referenceapplication-ui-tests ---
15-Sep-2021 20:22:21 [INFO] Building jar: /home/bamboo-agent/bamboo-agent/xml-data/build-dir/CONTRIB-QA-FRAMEWORK/ui-tests/target/referenceapplication-ui-tests-2.12.0-SNAPSHOT-tests.jar
15-Sep-2021 20:22:22 [INFO]
15-Sep-2021 20:22:22 [INFO] --- maven-failsafe-plugin:2.18.1:integration-test (default) @ referenceapplication-ui-tests ---
15-Sep-2021 20:22:22 [INFO] Downloading: http://mavenrepo.openmrs.org/nexus/content/repositories/public/org/apache/maven/surefire/maven-surefire-common/2.18.1/maven-surefire-common-2.18.1.pom
15-Sep-2021 20:22:22 [INFO] Downloaded: http://mavenrepo.openmrs.org/nexus/content/repositories/public/org/apache/maven/surefire/maven-surefire-common/2.18.1/maven-surefire-common-2.18.1.pom (7 KB at 20.1 KB/sec)
15-Sep-2021 20:22:22 [INFO] Downloading: http://mavenrepo.openmrs.org/nexus/content/repositories/public/org/apache/maven/plugin-tools/maven-plugin-annotations/3.3/maven-plugin-annotations-3.3.pom
15-Sep-2021 20:22:22 [INFO] Downloaded: http://mavenrepo.openmrs.org/nexus/content/repositories/public/org/apache/maven/plugin-tools/maven-plugin-annotations/3.3/maven-plugin-annotations-3.3.pom (2 KB at 6.3 KB/sec)
15-Sep-2021 20:22:22 [INFO] Downloading: http://mavenrepo.openmrs.org/nexus/content/repositories/public/org/apache/maven/plugin-tools/maven-plugin-tools/3.3/maven-plugin-tools-3.3.pom
15-Sep-2021 20:22:23 [INFO] Downloaded: http://mavenrepo.openmrs.org/nexus/content/repositories/public/org/apache/maven/plugin-tools/maven-plugin-tools/3.3/maven-plugin-tools-3.3.pom (13 KB at 49.0 KB/sec)
15-Sep-2021 20:22:23 [INFO] Downloading: http://mavenrepo.openmrs.org/nexus/content/repositories/public/org/apache/maven/surefire/surefire-api/2.18.1/surefire-api-2.18.1.pom
15-Sep-2021 20:22:23 [INFO] Downloaded: http://mavenrepo.openmrs.org/nexus/content/repositories/public/org/apache/maven/surefire/surefire-api/2.18.1/surefire-api-2.18.1.pom (3 KB at 7.8 KB/sec)
15-Sep-2021 20:22:23 [INFO] Downloading: http://mavenrepo.openmrs.org/nexus/content/repositories/public/org/apache/maven/surefire/surefire-booter/2.18.1/surefire-booter-2.18.1.pom
15-Sep-2021 20:22:23 [INFO] Downloaded: http://mavenrepo.openmrs.org/nexus/content/repositories/public/org/apache/maven/surefire/surefire-booter/2.18.1/surefire-booter-2.18.1.pom (3 KB at 11.0 KB/sec)
15-Sep-2021 20:22:23 [INFO] Downloading: http://mavenrepo.openmrs.org/nexus/content/repositories/public/org/apache/maven/surefire/maven-surefire-common/2.18.1/maven-surefire-common-2.18.1.jar
15-Sep-2021 20:22:23 [INFO] Downloading: http://mavenrepo.openmrs.org/nexus/content/repositories/public/org/apache/maven/surefire/surefire-api/2.18.1/surefire-api-2.18.1.jar
15-Sep-2021 20:22:23 [INFO] Downloading: http://mavenrepo.openmrs.org/nexus/content/repositories/public/org/apache/maven/surefire/surefire-booter/2.18.1/surefire-booter-2.18.1.jar
15-Sep-2021 20:22:23 [INFO] Downloading: http://mavenrepo.openmrs.org/nexus/content/repositories/public/org/apache/maven/plugin-tools/maven-plugin-annotations/3.3/maven-plugin-annotations-3.3.jar
15-Sep-2021 20:22:24 [INFO] Downloaded: http://mavenrepo.openmrs.org/nexus/content/repositories/public/org/apache/maven/surefire/surefire-booter/2.18.1/surefire-booter-2.18.1.jar (39 KB at 128.5 KB/sec)
15-Sep-2021 20:22:24 [INFO] Downloaded: http://mavenrepo.openmrs.org/nexus/content/repositories/public/org/apache/maven/surefire/maven-surefire-common/2.18.1/maven-surefire-common-2.18.1.jar (269 KB at 598.2 KB/sec)
15-Sep-2021 20:22:24 [INFO] Downloaded: http://mavenrepo.openmrs.org/nexus/content/repositories/public/org/apache/maven/surefire/surefire-api/2.18.1/surefire-api-2.18.1.jar (145 KB at 238.4 KB/sec)
15-Sep-2021 20:22:24 [INFO] Downloaded: http://mavenrepo.openmrs.org/nexus/content/repositories/public/org/apache/maven/plugin-tools/maven-plugin-annotations/3.3/maven-plugin-annotations-3.3.jar (14 KB at 18.3 KB/sec)
15-Sep-2021 20:22:24 [INFO] Tests are skipped.
15-Sep-2021 20:22:24 [INFO]
15-Sep-2021 20:22:24 [INFO] --- maven-failsafe-plugin:2.18.1:verify (default) @ referenceapplication-ui-tests ---
15-Sep-2021 20:22:24 [INFO] Tests are skipped.
15-Sep-2021 20:22:24 [INFO]
15-Sep-2021 20:22:24 [INFO] --- maven-install-plugin:2.4:install (default-install) @ referenceapplication-ui-tests ---
15-Sep-2021 20:22:24 [INFO] Installing /home/bamboo-agent/bamboo-agent/xml-data/build-dir/CONTRIB-QA-FRAMEWORK/ui-tests/target/referenceapplication-ui-tests-2.12.0-SNAPSHOT.jar to /home/bamboo-agent/.m2/repository/org/openmrs/distro/referenceapplication-ui-tests/2.12.0-SNAPSHOT/referenceapplication-ui-tests-2.12.0-SNAPSHOT.jar
15-Sep-2021 20:22:24 [INFO] Installing /home/bamboo-agent/bamboo-agent/xml-data/build-dir/CONTRIB-QA-FRAMEWORK/ui-tests/pom.xml to /home/bamboo-agent/.m2/repository/org/openmrs/distro/referenceapplication-ui-tests/2.12.0-SNAPSHOT/referenceapplication-ui-tests-2.12.0-SNAPSHOT.pom
15-Sep-2021 20:22:24 [INFO] Installing /home/bamboo-agent/bamboo-agent/xml-data/build-dir/CONTRIB-QA-FRAMEWORK/ui-tests/target/referenceapplication-ui-tests-2.12.0-SNAPSHOT-tests.jar to /home/bamboo-agent/.m2/repository/org/openmrs/distro/referenceapplication-ui-tests/2.12.0-SNAPSHOT/referenceapplication-ui-tests-2.12.0-SNAPSHOT-tests.jar
15-Sep-2021 20:22:24 [INFO] ------------------------------------------------------------------------
15-Sep-2021 20:22:24 [INFO] Reactor Summary:
15-Sep-2021 20:22:24 [INFO]
15-Sep-2021 20:22:24 [INFO] Reference Application Distribution ................. SUCCESS [  0.281 s]
15-Sep-2021 20:22:24 [INFO] Reference Application Distribution Package ......... SUCCESS [01:47 min]
15-Sep-2021 20:22:24 [INFO] Reference Application Distribution UI Tests ........ SUCCESS [ 13.942 s]
15-Sep-2021 20:22:24 [INFO] ------------------------------------------------------------------------
15-Sep-2021 20:22:24 [INFO] BUILD SUCCESS
15-Sep-2021 20:22:24 [INFO] ------------------------------------------------------------------------
15-Sep-2021 20:22:24 [INFO] Total time: 02:01 min
15-Sep-2021 20:22:24 [INFO] Finished at: 2021-09-15T20:22:24+00:00
15-Sep-2021 20:22:25 [INFO] Final Memory: 58M/282M
15-Sep-2021 20:22:25 [INFO] ------------------------------------------------------------------------
15-Sep-2021 20:22:25 Finished task 'Build distribution with ui-tests' with result: Success
15-Sep-2021 20:22:25 Starting task 'Checkout qaframework' of type 'com.atlassian.bamboo.plugins.vcs:task.vcs.checkout'
15-Sep-2021 20:22:25 Build always requires a clean checkout
15-Sep-2021 20:22:25 Cleaning build directory '/home/bamboo-agent/bamboo-agent/xml-data/build-dir/CONTRIB-QA-FRAMEWORK'
15-Sep-2021 20:22:25 Checking out into /home/bamboo-agent/bamboo-agent/xml-data/build-dir/CONTRIB-QA-FRAMEWORK
15-Sep-2021 20:22:25 Updating source code to revision: 71d9faa9dbb98d6e669ac2448e67db410e85dde5
15-Sep-2021 20:22:25 Enforcing full fetch as requested revision has not been found on the configured branch
15-Sep-2021 20:22:25 Creating local git repository in '/home/bamboo-agent/bamboo-agent/xml-data/build-dir/CONTRIB-QA-FRAMEWORK/.git'.
15-Sep-2021 20:22:25 Initialized empty Git repository in /home/bamboo-agent/bamboo-agent/xml-data/build-dir/CONTRIB-QA-FRAMEWORK/.git/
15-Sep-2021 20:22:25 Fetching 'refs/heads/*' from 'git://github.com/openmrs/openmrs-contrib-qaframework.git'.
15-Sep-2021 20:22:28 From git://github.com/openmrs/openmrs-contrib-qaframework
15-Sep-2021 20:22:28 * [new branch]      RATEST-169 -> RATEST-169
15-Sep-2021 20:22:28 * [new branch]      RATEST-169-services -> RATEST-169-services
15-Sep-2021 20:22:28 * [new branch]      gracepotma-patch-1 -> gracepotma-patch-1
15-Sep-2021 20:22:28 * [new branch]      gracepotma-patch-2 -> gracepotma-patch-2
15-Sep-2021 20:22:28 * [new branch]      master     -> master
15-Sep-2021 20:22:28 Checking out revision 71d9faa9dbb98d6e669ac2448e67db410e85dde5.
15-Sep-2021 20:22:29 Already on 'master'
15-Sep-2021 20:22:29 Updated source code to revision: 71d9faa9dbb98d6e669ac2448e67db410e85dde5
15-Sep-2021 20:22:29 Finished task 'Checkout qaframework' with result: Success
15-Sep-2021 20:22:29 Skipping execution of task 'Build qaframework' as it is disabled
15-Sep-2021 20:22:29 Skipping execution of task 'run cypress tests' as it is disabled
15-Sep-2021 20:22:29 Skipping execution of task 'install packages' as it is disabled
15-Sep-2021 20:22:29 Starting task 'setting test properties' of type 'com.atlassian.bamboo.plugins.scripttask:task.builder.script'
15-Sep-2021 20:22:29
Beginning to execute external process for build 'Contrib - OpenMRS QA Framework - Run QA Framework #811 (CONTRIB-QA-FRAMEWORK-811)'
... running command line:
/home/bamboo-agent/bamboo-agent/temp/CONTRIB-QA-FRAMEWORK-811-ScriptBuildTask-553888557291974355.sh
... in: /home/bamboo-agent/bamboo-agent/xml-data/build-dir/CONTRIB-QA-FRAMEWORK
... using extra environment variables:
bamboo_planRepository_1_branch=master
bamboo_capability_system_builder_grailsBuilder_Grails_2_3_7=/opt/grails
bamboo_planRepository_2_branch=master
bamboo_planRepository_1_branchDisplayName=master
bamboo_repository_revision_number=71d9faa9dbb98d6e669ac2448e67db410e85dde5
bamboo_saucelabs_username=rkorytkowski
bamboo_planRepository_3_type=gitv2
bamboo_repository_178257928_git_username=
bamboo_planRepository_3_revision=8838c8eeee749c044f9846bcb0a31a7065db1260
bamboo_buildKey=CONTRIB-QA-FRAMEWORK
bamboo_DISPLAY=10
bamboo_maven_release_version=2.8.0
bamboo_planRepository_3_branch=master
bamboo_planRepository_2_branchDisplayName=master
bamboo_shortJobName=Run QA Framework
bamboo_buildResultsUrl=https://ci.openmrs.org/browse/CONTRIB-QA-FRAMEWORK-811
bamboo_planRepository_repositoryUrl=git://github.com/openmrs/openmrs-contrib-qaframework.git
bamboo_agentId=189792258
bamboo_maven_development_version=
bamboo_capability_system_jdk_JDK_8=/usr/lib/jvm/java-8-openjdk-amd64
bamboo_planRepository_revision=71d9faa9dbb98d6e669ac2448e67db410e85dde5
bamboo_planRepository_previousRevision=b67aa4c1f6111a3e10493c0712a910564feef6a1
bamboo_repository_178257927_git_branch=master
bamboo_repository_178257927_revision_number=71d9faa9dbb98d6e669ac2448e67db410e85dde5
bamboo_repository_178257927_name=OpenMRS QA
bamboo_capability_system_jdk_JDK_1_8_0_265=/usr/lib/jvm/java-1.8.0-openjdk-amd64/
bamboo_repository_179830785_revision_number=c7f3671641ddaf3dd613e902e5622c3c5320323b
bamboo_repository_branch_name=master
bamboo_dockerhub_username=openmrsci
bamboo_planRepository_3_previousRevision=8838c8eeee749c044f9846bcb0a31a7065db1260
bamboo_repository_179830785_git_branch=master
bamboo_refapp_distro_scm=git@github.com:openmrs/openmrs-distro-referenceapplication.git
bamboo_planRepository_branch=master
bamboo_repository_178257927_git_username=
bamboo_capability_system_jdk_JDK_1_8_0_275=/usr/lib/jvm/java-1.8.0-openjdk-amd64/
bamboo_planRepository_3_branchName=master
bamboo_repository_179830785_git_username=
bamboo_capability_system_jdk_JDK_1_8_0_272=/usr/lib/jvm/java-1.8.0-openjdk-amd64/
bamboo_capability_system_jdk_JDK_11=/usr/lib/jvm/java-11-openjdk-amd64
bamboo_planRepository_1_type=gitv2
bamboo_planRepository_branchName=master
bamboo_repository_178257928_revision_number=8838c8eeee749c044f9846bcb0a31a7065db1260
bamboo_saucelabs_password=********
bamboo_repository_178257928_name=UI Test Framework
bamboo_capability_system_jdk_JDK=/usr/lib/jvm/java-1.8.0-openjdk-amd64/
bamboo_planRepository_3_name=UI Test Framework
bamboo_mavenBuildGoals=clean install
bamboo_hg_cache_directory=/home/bamboo-agent/bamboo-agent/xml-data/build-dir/_hg-repositories-cache
bamboo_planRepository_1_username=
bamboo_planRepository_type=gitv2
bamboo_git_cache_directory=/home/bamboo-agent/bamboo-agent/xml-data/build-dir/_git-repositories-cache
bamboo_planRepository_2_branchName=master
bamboo_capability_system_builder_node_Node_js=/usr/bin/node
bamboo_build_commandline_com_atlassian_bamboo_plugins_maven_task_builder_mvn3_2=/usr/share/apache-maven-3.3.9/bin/mvn --batch-mode -Djava.io.tmpdir=/home/bamboo-agent/bamboo-agent/.agent_tmp/CONTRIB-QA-FRAMEWORK clean install
bamboo_travis_password=********
bamboo_repository_178257927_git_repositoryUrl=git://github.com/openmrs/openmrs-contrib-qaframework.git
bamboo_build_commandline_com_atlassian_bamboo_plugins_maven_task_builder_mvn3_4=/usr/share/apache-maven-3.3.9/bin/mvn --batch-mode -Djava.io.tmpdir=/home/bamboo-agent/bamboo-agent/.agent_tmp/CONTRIB-QA-FRAMEWORK clean install
bamboo_capability_system_builder_mvn3_Maven_3=/usr/share/apache-maven-3.3.9
bamboo_tmp_directory=/home/bamboo-agent/bamboo-agent/temp
bamboo_planKey=CONTRIB-QA
bamboo_capability_system_builder_command_nvm=nvm
bamboo_planRepository_username=
bamboo_capability_system_jdk_JDK_1_8_0_282=/usr/lib/jvm/java-1.8.0-openjdk-amd64/
bamboo_planRepository_1_branchName=master
bamboo_dockerhub_password=********
bamboo_resultsUrl=https://ci.openmrs.org/browse/CONTRIB-QA-FRAMEWORK-811
bamboo_capability_system_builder_command_transifex=/usr/bin/tx
bamboo_jdbc_password=********
bamboo_build_working_directory=/home/bamboo-agent/bamboo-agent/xml-data/build-dir/CONTRIB-QA-FRAMEWORK
bamboo_planRepository_1_name=OpenMRS QA
bamboo_capability_system_jdk_JDK_1_8_0_292=/usr/lib/jvm/java-1.8.0-openjdk-amd64/
bamboo_preparing_refapp_distro_release=false
bamboo_shortPlanName=OpenMRS QA Framework
bamboo_planRepository_2_username=
bamboo_planRepository_name=OpenMRS QA
bamboo_docs_aws_secret_key=********
bamboo_buildNumber=811
bamboo_repository_178257928_git_branch=master
bamboo_repository_179830785_previous_revision_number=c7f3671641ddaf3dd613e902e5622c3c5320323b
bamboo_planName=Contrib - OpenMRS QA Framework
bamboo_shortPlanKey=QA
bamboo_shortJobKey=FRAMEWORK
bamboo_planRepository_2_name=Distribution
bamboo_buildTimeStamp=2021-09-15T20:18:03.243Z
bamboo_repository_previous_revision_number=b67aa4c1f6111a3e10493c0712a910564feef6a1
bamboo_repository_179830785_name=Distribution
bamboo_refapp_bamboo_build_number=
bamboo_repository_git_branch=master
bamboo_buildResultKey=CONTRIB-QA-FRAMEWORK-811
bamboo_docs_aws_access_key=AKIAI7KMDL5KP2673G7A
bamboo_buildPlanName=Contrib - OpenMRS QA Framework - Run QA Framework
bamboo_openMRSVersion=2.1.3
bamboo_planRepository_1_revision=71d9faa9dbb98d6e669ac2448e67db410e85dde5
bamboo_planRepository_3_username=
bamboo_repository_name=UI Test Framework
bamboo_capability_system_jdk_openjdk_8_jdk=/usr/lib/jvm/java-8-openjdk-amd64
bamboo_planRepository_2_previousRevision=c7f3671641ddaf3dd613e902e5622c3c5320323b
bamboo_transifex_password=********
bamboo_capability_system_jdk_openjdk_11_jdk=/usr/lib/jvm/java-11-openjdk-amd64
bamboo_repository_179830785_git_repositoryUrl=git://github.com/openmrs/openmrs-distro-referenceapplication.git
bamboo_buildFailed=false
bamboo_capability_system_builder_grailsBuilder_Grails_2=/opt/grails
bamboo_planRepository_3_repositoryUrl=git://github.com/openmrs/openmrs-contrib-uitestframework.git
bamboo_repository_178257927_branch_name=master
bamboo_capability_system_docker_executable=/usr/bin/docker
bamboo_repository_178257928_branch_name=master
bamboo_capability_system_builder_command_Bash=/bin/bash
bamboo_agentWorkingDirectory=/home/bamboo-agent/bamboo-agent/xml-data/build-dir
bamboo_planRepository_2_revision=c7f3671641ddaf3dd613e902e5622c3c5320323b
bamboo_capability_system_git_executable=/usr/bin/git
bamboo_repository_git_username=
bamboo_planRepository_1_previousRevision=b67aa4c1f6111a3e10493c0712a910564feef6a1
bamboo_planRepository_branchDisplayName=master
bamboo_planRepository_2_type=gitv2
bamboo_plan_storageTag=plan-177864718
bamboo_planRepository_2_repositoryUrl=git://github.com/openmrs/openmrs-distro-referenceapplication.git
bamboo_repository_git_repositoryUrl=git://github.com/openmrs/openmrs-contrib-qaframework.git
bamboo_transifex_username=api
bamboo_repository_178257928_git_repositoryUrl=git://github.com/openmrs/openmrs-contrib-uitestframework.git
bamboo_planRepository_3_branchDisplayName=master
bamboo_refapp_distro_dev_branch=master
bamboo_working_directory=/home/bamboo-agent/bamboo-agent/xml-data/build-dir/CONTRIB-QA-FRAMEWORK
bamboo_repository_179830785_branch_name=master
bamboo_planRepository_1_repositoryUrl=git://github.com/openmrs/openmrs-contrib-qaframework.git
bamboo_repository_178257928_previous_revision_number=8838c8eeee749c044f9846bcb0a31a7065db1260
bamboo_capability_system_jdk_JDK_1_8=/usr/lib/jvm/java-1.8.0-openjdk-amd64/
bamboo_repository_178257927_previous_revision_number=b67aa4c1f6111a3e10493c0712a910564feef6a1
15-Sep-2021 20:22:29 Finished task 'setting test properties' with result: Success
15-Sep-2021 20:22:29 Starting task 'run selenium tests without initialSetup' of type 'com.atlassian.bamboo.plugins.maven:task.builder.mvn3'
15-Sep-2021 20:22:29
Beginning to execute external process for build 'Contrib - OpenMRS QA Framework - Run QA Framework #811 (CONTRIB-QA-FRAMEWORK-811)'
... running command line:
/usr/share/apache-maven-3.3.9/bin/mvn --batch-mode -Djava.io.tmpdir=/home/bamboo-agent/bamboo-agent/.agent_tmp/CONTRIB-QA-FRAMEWORK test -Dcucumber.filter.tags=@selenium and not @initialSetup
... in: /home/bamboo-agent/bamboo-agent/xml-data/build-dir/CONTRIB-QA-FRAMEWORK
... using extra environment variables:
bamboo_planRepository_1_branch=master
bamboo_capability_system_builder_grailsBuilder_Grails_2_3_7=/opt/grails
bamboo_planRepository_2_branch=master
bamboo_planRepository_1_branchDisplayName=master
bamboo_repository_revision_number=71d9faa9dbb98d6e669ac2448e67db410e85dde5
MAVEN2_HOME=/usr/share/apache-maven-3.3.9
bamboo_saucelabs_username=rkorytkowski
bamboo_planRepository_3_type=gitv2
bamboo_repository_178257928_git_username=
bamboo_planRepository_3_revision=8838c8eeee749c044f9846bcb0a31a7065db1260
bamboo_buildKey=CONTRIB-QA-FRAMEWORK
bamboo_DISPLAY=10
bamboo_maven_release_version=2.8.0
bamboo_planRepository_3_branch=master
bamboo_planRepository_2_branchDisplayName=master
bamboo_shortJobName=Run QA Framework
bamboo_buildResultsUrl=https://ci.openmrs.org/browse/CONTRIB-QA-FRAMEWORK-811
bamboo_planRepository_repositoryUrl=git://github.com/openmrs/openmrs-contrib-qaframework.git
bamboo_agentId=189792258
bamboo_maven_development_version=
bamboo_capability_system_jdk_JDK_8=/usr/lib/jvm/java-8-openjdk-amd64
bamboo_planRepository_revision=71d9faa9dbb98d6e669ac2448e67db410e85dde5
bamboo_planRepository_previousRevision=b67aa4c1f6111a3e10493c0712a910564feef6a1
bamboo_repository_178257927_git_branch=master
bamboo_repository_178257927_revision_number=71d9faa9dbb98d6e669ac2448e67db410e85dde5
bamboo_repository_178257927_name=OpenMRS QA
bamboo_capability_system_jdk_JDK_1_8_0_265=/usr/lib/jvm/java-1.8.0-openjdk-amd64/
bamboo_repository_179830785_revision_number=c7f3671641ddaf3dd613e902e5622c3c5320323b
bamboo_repository_branch_name=master
bamboo_dockerhub_username=openmrsci
bamboo_planRepository_3_previousRevision=8838c8eeee749c044f9846bcb0a31a7065db1260
bamboo_repository_179830785_git_branch=master
bamboo_refapp_distro_scm=git@github.com:openmrs/openmrs-distro-referenceapplication.git
JAVA_HOME=/usr/lib/jvm/java-8-openjdk-amd64
bamboo_planRepository_branch=master
bamboo_repository_178257927_git_username=
bamboo_capability_system_jdk_JDK_1_8_0_275=/usr/lib/jvm/java-1.8.0-openjdk-amd64/
bamboo_planRepository_3_branchName=master
bamboo_repository_179830785_git_username=
bamboo_capability_system_jdk_JDK_1_8_0_272=/usr/lib/jvm/java-1.8.0-openjdk-amd64/
bamboo_capability_system_jdk_JDK_11=/usr/lib/jvm/java-11-openjdk-amd64
bamboo_planRepository_1_type=gitv2
bamboo_planRepository_branchName=master
bamboo_repository_178257928_revision_number=8838c8eeee749c044f9846bcb0a31a7065db1260
bamboo_saucelabs_password=********
bamboo_repository_178257928_name=UI Test Framework
bamboo_capability_system_jdk_JDK=/usr/lib/jvm/java-1.8.0-openjdk-amd64/
bamboo_planRepository_3_name=UI Test Framework
bamboo_mavenBuildGoals=clean install
bamboo_hg_cache_directory=/home/bamboo-agent/bamboo-agent/xml-data/build-dir/_hg-repositories-cache
bamboo_planRepository_1_username=
bamboo_planRepository_type=gitv2
bamboo_git_cache_directory=/home/bamboo-agent/bamboo-agent/xml-data/build-dir/_git-repositories-cache
bamboo_planRepository_2_branchName=master
useMavenReturnCode=false
bamboo_capability_system_builder_node_Node_js=/usr/bin/node
bamboo_build_commandline_com_atlassian_bamboo_plugins_maven_task_builder_mvn3_2=/usr/share/apache-maven-3.3.9/bin/mvn --batch-mode -Djava.io.tmpdir=/home/bamboo-agent/bamboo-agent/.agent_tmp/CONTRIB-QA-FRAMEWORK clean install
bamboo_travis_password=********
bamboo_repository_178257927_git_repositoryUrl=git://github.com/openmrs/openmrs-contrib-qaframework.git
bamboo_build_commandline_com_atlassian_bamboo_plugins_maven_task_builder_mvn3_4=/usr/share/apache-maven-3.3.9/bin/mvn --batch-mode -Djava.io.tmpdir=/home/bamboo-agent/bamboo-agent/.agent_tmp/CONTRIB-QA-FRAMEWORK clean install
bamboo_capability_system_builder_mvn3_Maven_3=/usr/share/apache-maven-3.3.9
bamboo_tmp_directory=/home/bamboo-agent/bamboo-agent/temp
bamboo_planKey=CONTRIB-QA
bamboo_capability_system_builder_command_nvm=nvm
bamboo_planRepository_username=
bamboo_capability_system_jdk_JDK_1_8_0_282=/usr/lib/jvm/java-1.8.0-openjdk-amd64/
bamboo_planRepository_1_branchName=master
bamboo_dockerhub_password=********
bamboo_resultsUrl=https://ci.openmrs.org/browse/CONTRIB-QA-FRAMEWORK-811
bamboo_capability_system_builder_command_transifex=/usr/bin/tx
bamboo_jdbc_password=********
bamboo_build_working_directory=/home/bamboo-agent/bamboo-agent/xml-data/build-dir/CONTRIB-QA-FRAMEWORK
bamboo_planRepository_1_name=OpenMRS QA
bamboo_capability_system_jdk_JDK_1_8_0_292=/usr/lib/jvm/java-1.8.0-openjdk-amd64/
bamboo_preparing_refapp_distro_release=false
bamboo_shortPlanName=OpenMRS QA Framework
bamboo_planRepository_2_username=
bamboo_planRepository_name=OpenMRS QA
bamboo_docs_aws_secret_key=********
bamboo_buildNumber=811
bamboo_repository_178257928_git_branch=master
bamboo_repository_179830785_previous_revision_number=c7f3671641ddaf3dd613e902e5622c3c5320323b
bamboo_planName=Contrib - OpenMRS QA Framework
bamboo_shortPlanKey=QA
bamboo_build_commandline_com_atlassian_bamboo_plugins_scripttask_task_builder_script_8=/home/bamboo-agent/bamboo-agent/temp/CONTRIB-QA-FRAMEWORK-811-ScriptBuildTask-553888557291974355.sh
bamboo_shortJobKey=FRAMEWORK
bamboo_planRepository_2_name=Distribution
bamboo_buildTimeStamp=2021-09-15T20:18:03.243Z
bamboo_repository_previous_revision_number=b67aa4c1f6111a3e10493c0712a910564feef6a1
bamboo_repository_179830785_name=Distribution
M2_HOME=/usr/share/apache-maven-3.3.9
bamboo_refapp_bamboo_build_number=
bamboo_repository_git_branch=master
bamboo_buildResultKey=CONTRIB-QA-FRAMEWORK-811
bamboo_docs_aws_access_key=AKIAI7KMDL5KP2673G7A
bamboo_buildPlanName=Contrib - OpenMRS QA Framework - Run QA Framework
bamboo_openMRSVersion=2.1.3
bamboo_planRepository_1_revision=71d9faa9dbb98d6e669ac2448e67db410e85dde5
bamboo_planRepository_3_username=
bamboo_repository_name=UI Test Framework
bamboo_capability_system_jdk_openjdk_8_jdk=/usr/lib/jvm/java-8-openjdk-amd64
bamboo_planRepository_2_previousRevision=c7f3671641ddaf3dd613e902e5622c3c5320323b
bamboo_transifex_password=********
bamboo_capability_system_jdk_openjdk_11_jdk=/usr/lib/jvm/java-11-openjdk-amd64
bamboo_repository_179830785_git_repositoryUrl=git://github.com/openmrs/openmrs-distro-referenceapplication.git
bamboo_buildFailed=false
bamboo_capability_system_builder_grailsBuilder_Grails_2=/opt/grails
bamboo_planRepository_3_repositoryUrl=git://github.com/openmrs/openmrs-contrib-uitestframework.git
bamboo_repository_178257927_branch_name=master
bamboo_capability_system_docker_executable=/usr/bin/docker
bamboo_repository_178257928_branch_name=master
bamboo_capability_system_builder_command_Bash=/bin/bash
bamboo_agentWorkingDirectory=/home/bamboo-agent/bamboo-agent/xml-data/build-dir
bamboo_planRepository_2_revision=c7f3671641ddaf3dd613e902e5622c3c5320323b
bamboo_capability_system_git_executable=/usr/bin/git
bamboo_repository_git_username=
bamboo_planRepository_1_previousRevision=b67aa4c1f6111a3e10493c0712a910564feef6a1
bamboo_planRepository_branchDisplayName=master
bamboo_planRepository_2_type=gitv2
bamboo_plan_storageTag=plan-177864718
bamboo_planRepository_2_repositoryUrl=git://github.com/openmrs/openmrs-distro-referenceapplication.git
bamboo_repository_git_repositoryUrl=git://github.com/openmrs/openmrs-contrib-qaframework.git
bamboo_transifex_username=api
bamboo_repository_178257928_git_repositoryUrl=git://github.com/openmrs/openmrs-contrib-uitestframework.git
bamboo_planRepository_3_branchDisplayName=master
bamboo_refapp_distro_dev_branch=master
bamboo_working_directory=/home/bamboo-agent/bamboo-agent/xml-data/build-dir/CONTRIB-QA-FRAMEWORK
bamboo_repository_179830785_branch_name=master
bamboo_planRepository_1_repositoryUrl=git://github.com/openmrs/openmrs-contrib-qaframework.git
bamboo_repository_178257928_previous_revision_number=8838c8eeee749c044f9846bcb0a31a7065db1260
bamboo_capability_system_jdk_JDK_1_8=/usr/lib/jvm/java-1.8.0-openjdk-amd64/
bamboo_repository_178257927_previous_revision_number=b67aa4c1f6111a3e10493c0712a910564feef6a1
PATH=/usr/lib/jvm/java-8-openjdk-amd64/bin:/home/bamboo-agent/.nvm/versions/node/v10.22.1/bin:/home/bamboo-agent/bin:/home/bamboo-agent/.local/bin:/usr/local/sbin:/usr/local/bin:/usr/sbin:/usr/bin:/sbin:/bin:/usr/games:/usr/local/games:/snap/bin:/opt/puppetlabs/bin
15-Sep-2021 20:22:31 [INFO] Scanning for projects...
15-Sep-2021 20:22:31 [WARNING]
15-Sep-2021 20:22:31 [WARNING] Some problems were encountered while building the effective model for org.openmrs.contrib:qaframework:jar:1.0-SNAPSHOT
15-Sep-2021 20:22:31 [WARNING] 'build.plugins.plugin.version' for org.apache.maven.plugins:maven-compiler-plugin is missing. @ line 169, column 21
15-Sep-2021 20:22:31 [WARNING]
15-Sep-2021 20:22:31 [WARNING] It is highly recommended to fix these problems because they threaten the stability of your build.
15-Sep-2021 20:22:31 [WARNING]
15-Sep-2021 20:22:31 [WARNING] For this reason, future Maven versions might no longer support building such malformed projects.
15-Sep-2021 20:22:31 [WARNING]
15-Sep-2021 20:22:31 [INFO]                                                                         
15-Sep-2021 20:22:31 [INFO] ------------------------------------------------------------------------
15-Sep-2021 20:22:31 [INFO] Building OpenMRS QA Framework 1.0-SNAPSHOT
15-Sep-2021 20:22:31 [INFO] ------------------------------------------------------------------------
15-Sep-2021 20:22:32 [INFO] Downloading: http://mavenrepo.openmrs.org/nexus/content/repositories/public/io/cucumber/messages/maven-metadata.xml
15-Sep-2021 20:22:33 [INFO] Downloaded: http://mavenrepo.openmrs.org/nexus/content/repositories/public/io/cucumber/messages/maven-metadata.xml (3 KB at 1.3 KB/sec)
15-Sep-2021 20:22:33 [INFO] Downloading: http://mavenrepo.openmrs.org/nexus/content/repositories/public/org/openmrs/contrib/uitestframework/2.5.0-SNAPSHOT/maven-metadata.xml
15-Sep-2021 20:22:34 [INFO] Downloaded: http://mavenrepo.openmrs.org/nexus/content/repositories/public/org/openmrs/contrib/uitestframework/2.5.0-SNAPSHOT/maven-metadata.xml (784 B at 2.7 KB/sec)
15-Sep-2021 20:22:34 [INFO] Downloading: http://mavenrepo.openmrs.org/nexus/content/repositories/public/org/openmrs/distro/referenceapplication-ui-tests/2.12.0-SNAPSHOT/maven-metadata.xml
15-Sep-2021 20:22:34 [INFO] Downloading: http://mavenrepo.openmrs.org/nexus/content/repositories/public/org/openmrs/distro/referenceapplication/2.12.0-SNAPSHOT/maven-metadata.xml
15-Sep-2021 20:22:35 [INFO] Downloaded: http://mavenrepo.openmrs.org/nexus/content/repositories/public/org/openmrs/distro/referenceapplication/2.12.0-SNAPSHOT/maven-metadata.xml (623 B at 1.0 KB/sec)
15-Sep-2021 20:22:35 [INFO]
15-Sep-2021 20:22:35 [INFO] --- maven-java-formatter-plugin:0.4:format (default) @ qaframework ---
15-Sep-2021 20:22:36 [INFO] Using 'UTF-8' encoding to format source files.
15-Sep-2021 20:22:36 [INFO] Number of files to be formatted: 18
15-Sep-2021 20:22:36 [INFO] Successfully formatted: 0 file(s)
15-Sep-2021 20:22:36 [INFO] Fail to format        : 0 file(s)
15-Sep-2021 20:22:36 [INFO] Skipped               : 18 file(s)
15-Sep-2021 20:22:36 [INFO] Approximate time taken: 0s
15-Sep-2021 20:22:36 [INFO]
15-Sep-2021 20:22:36 [INFO] --- frontend-maven-plugin:1.11.3:install-node-and-npm (install node and npm) @ qaframework ---
15-Sep-2021 20:22:37 [INFO] Installing node version v15.8.0
15-Sep-2021 20:22:37 [INFO] Unpacking /home/bamboo-agent/.m2/repository/com/github/eirslett/node/15.8.0/node-15.8.0-linux-x64.tar.gz into /home/bamboo-agent/bamboo-agent/xml-data/build-dir/CONTRIB-QA-FRAMEWORK/node/tmp
15-Sep-2021 20:22:41 [INFO] Copying node binary from /home/bamboo-agent/bamboo-agent/xml-data/build-dir/CONTRIB-QA-FRAMEWORK/node/tmp/node-v15.8.0-linux-x64/bin/node to /home/bamboo-agent/bamboo-agent/xml-data/build-dir/CONTRIB-QA-FRAMEWORK/node/node
15-Sep-2021 20:22:42 [INFO] Extracting NPM
15-Sep-2021 20:22:42 [INFO] Installed node locally.
15-Sep-2021 20:22:42 [INFO]
15-Sep-2021 20:22:42 [INFO] --- maven-resources-plugin:2.6:resources (default-resources) @ qaframework ---
15-Sep-2021 20:22:42 [INFO] Using 'UTF-8' encoding to copy filtered resources.
15-Sep-2021 20:22:42 [INFO] skip non existing resourceDirectory /home/bamboo-agent/bamboo-agent/xml-data/build-dir/CONTRIB-QA-FRAMEWORK/src/main/resources
15-Sep-2021 20:22:42 [INFO]
15-Sep-2021 20:22:42 [INFO] --- maven-compiler-plugin:3.1:compile (default-compile) @ qaframework ---
15-Sep-2021 20:22:42 [INFO] No sources to compile
15-Sep-2021 20:22:42 [INFO]
15-Sep-2021 20:22:42 [INFO] --- maven-resources-plugin:2.6:testResources (default-testResources) @ qaframework ---
15-Sep-2021 20:22:42 [INFO] Using 'UTF-8' encoding to copy filtered resources.
15-Sep-2021 20:22:42 [INFO] Copying 42 resources
15-Sep-2021 20:22:42 [INFO]
15-Sep-2021 20:22:42 [INFO] --- maven-compiler-plugin:3.1:testCompile (default-testCompile) @ qaframework ---
15-Sep-2021 20:22:42 [INFO] Changes detected - recompiling the module!
15-Sep-2021 20:22:42 [INFO] Compiling 18 source files to /home/bamboo-agent/bamboo-agent/xml-data/build-dir/CONTRIB-QA-FRAMEWORK/target/test-classes
15-Sep-2021 20:22:45 [INFO]
15-Sep-2021 20:22:45 [INFO] --- maven-antrun-plugin:1.8:run (make-mac-chromedriver-executable) @ qaframework ---
15-Sep-2021 20:22:46 [INFO] Executing tasks
15-Sep-2021 20:22:46
15-Sep-2021 20:22:46 main:
15-Sep-2021 20:22:46 [INFO] Executed tasks
15-Sep-2021 20:22:46 [INFO]
15-Sep-2021 20:22:46 [INFO] --- maven-antrun-plugin:1.8:run (make-linux-chromedriver-executable) @ qaframework ---
15-Sep-2021 20:22:46 [INFO] Executing tasks
15-Sep-2021 20:22:46
15-Sep-2021 20:22:46 main:
15-Sep-2021 20:22:46 [INFO] Executed tasks
15-Sep-2021 20:22:46 [INFO]
15-Sep-2021 20:22:46 [INFO] --- maven-antrun-plugin:1.8:run (make-windows-chromedriver-executable) @ qaframework ---
15-Sep-2021 20:22:46 [INFO] Executing tasks
15-Sep-2021 20:22:46
15-Sep-2021 20:22:46 main:
15-Sep-2021 20:22:46 [INFO] Executed tasks
15-Sep-2021 20:22:46 [INFO]
15-Sep-2021 20:22:46 [INFO] --- maven-antrun-plugin:1.8:run (make-mac-firefoxdriver-executable) @ qaframework ---
15-Sep-2021 20:22:46 [INFO] Executing tasks
15-Sep-2021 20:22:46
15-Sep-2021 20:22:46 main:
15-Sep-2021 20:22:46 [INFO] Executed tasks
15-Sep-2021 20:22:46 [INFO]
15-Sep-2021 20:22:46 [INFO] --- maven-antrun-plugin:1.8:run (make-linux-firefoxdriver-executable) @ qaframework ---
15-Sep-2021 20:22:46 [INFO] Executing tasks
15-Sep-2021 20:22:46
15-Sep-2021 20:22:46 main:
15-Sep-2021 20:22:47 [INFO] Executed tasks
15-Sep-2021 20:22:47 [INFO]
15-Sep-2021 20:22:47 [INFO] --- maven-antrun-plugin:1.8:run (make-windows-firefoxdriver-executable) @ qaframework ---
15-Sep-2021 20:22:47 [INFO] Executing tasks
15-Sep-2021 20:22:47
15-Sep-2021 20:22:47 main:
15-Sep-2021 20:22:47 [INFO] Executed tasks
15-Sep-2021 20:22:47 [INFO]
15-Sep-2021 20:22:47 [INFO] --- maven-surefire-plugin:2.12.4:test (default-test) @ qaframework ---
15-Sep-2021 20:22:47 [INFO] Surefire report directory: /home/bamboo-agent/bamboo-agent/xml-data/build-dir/CONTRIB-QA-FRAMEWORK/target/surefire-reports
15-Sep-2021 20:22:48
15-Sep-2021 20:22:48 -------------------------------------------------------
15-Sep-2021 20:22:48 T E S T S
15-Sep-2021 20:22:48 -------------------------------------------------------
15-Sep-2021 20:22:48 Running org.openmrs.contrib.qaframework.RunTest
15-Sep-2021 20:22:51 Running locally...
15-Sep-2021 20:22:52 log4j:WARN No appenders could be found for logger (io.netty.util.internal.logging.InternalLoggerFactory).
15-Sep-2021 20:22:52 log4j:WARN Please initialize the log4j system properly.
15-Sep-2021 20:22:52 log4j:WARN See http://logging.apache.org/log4j/1.2/faq.html#noconfig for more info.
15-Sep-2021 20:22:52 Starting ChromeDriver 89.0.4389.23 (61b08ee2c50024bab004e48d2b1b083cdbdac579-refs/branch-heads/4389@{#294}) on port 29500
15-Sep-2021 20:22:52 Only local connections are allowed.
15-Sep-2021 20:22:52 Please see https://chromedriver.chromium.org/security-considerations for suggestions on keeping ChromeDriver safe.
15-Sep-2021 20:22:52 ChromeDriver was started successfully.
15-Sep-2021 20:23:04 Sep 15, 2021 8:23:04 PM org.openqa.selenium.remote.ProtocolHandshake createSession
15-Sep-2021 20:23:04 INFO: Detected dialect: W3C
15-Sep-2021 20:23:10 Running locally...
15-Sep-2021 20:23:10 Starting ChromeDriver 89.0.4389.23 (61b08ee2c50024bab004e48d2b1b083cdbdac579-refs/branch-heads/4389@{#294}) on port 28336
15-Sep-2021 20:23:10 Only local connections are allowed.
15-Sep-2021 20:23:10 Please see https://chromedriver.chromium.org/security-considerations for suggestions on keeping ChromeDriver safe.
15-Sep-2021 20:23:10 ChromeDriver was started successfully.
15-Sep-2021 20:23:10 Sep 15, 2021 8:23:10 PM org.openqa.selenium.remote.ProtocolHandshake createSession
15-Sep-2021 20:23:10 INFO: Detected dialect: W3C
15-Sep-2021 20:23:12 Running locally...
15-Sep-2021 20:23:12 Starting ChromeDriver 89.0.4389.23 (61b08ee2c50024bab004e48d2b1b083cdbdac579-refs/branch-heads/4389@{#294}) on port 16873
15-Sep-2021 20:23:12 Only local connections are allowed.
15-Sep-2021 20:23:12 Please see https://chromedriver.chromium.org/security-considerations for suggestions on keeping ChromeDriver safe.
15-Sep-2021 20:23:12 ChromeDriver was started successfully.
15-Sep-2021 20:23:12 Sep 15, 2021 8:23:12 PM org.openqa.selenium.remote.ProtocolHandshake createSession
15-Sep-2021 20:23:12 INFO: Detected dialect: W3C
15-Sep-2021 20:23:14 Running locally...
15-Sep-2021 20:23:14 Starting ChromeDriver 89.0.4389.23 (61b08ee2c50024bab004e48d2b1b083cdbdac579-refs/branch-heads/4389@{#294}) on port 9752
15-Sep-2021 20:23:14 Only local connections are allowed.
15-Sep-2021 20:23:14 Please see https://chromedriver.chromium.org/security-considerations for suggestions on keeping ChromeDriver safe.
15-Sep-2021 20:23:14 ChromeDriver was started successfully.
15-Sep-2021 20:23:15 Sep 15, 2021 8:23:15 PM org.openqa.selenium.remote.ProtocolHandshake createSession
15-Sep-2021 20:23:15 INFO: Detected dialect: W3C
15-Sep-2021 20:23:16 Running locally...
15-Sep-2021 20:23:16 Starting ChromeDriver 89.0.4389.23 (61b08ee2c50024bab004e48d2b1b083cdbdac579-refs/branch-heads/4389@{#294}) on port 31998
15-Sep-2021 20:23:16 Only local connections are allowed.
15-Sep-2021 20:23:16 Please see https://chromedriver.chromium.org/security-considerations for suggestions on keeping ChromeDriver safe.
15-Sep-2021 20:23:16 ChromeDriver was started successfully.
15-Sep-2021 20:23:17 Sep 15, 2021 8:23:17 PM org.openqa.selenium.remote.ProtocolHandshake createSession
15-Sep-2021 20:23:17 INFO: Detected dialect: W3C
15-Sep-2021 20:23:18 Running locally...
15-Sep-2021 20:23:18 Starting ChromeDriver 89.0.4389.23 (61b08ee2c50024bab004e48d2b1b083cdbdac579-refs/branch-heads/4389@{#294}) on port 9429
15-Sep-2021 20:23:18 Only local connections are allowed.
15-Sep-2021 20:23:18 Please see https://chromedriver.chromium.org/security-considerations for suggestions on keeping ChromeDriver safe.
15-Sep-2021 20:23:18 ChromeDriver was started successfully.
15-Sep-2021 20:23:19 Sep 15, 2021 8:23:19 PM org.openqa.selenium.remote.ProtocolHandshake createSession
15-Sep-2021 20:23:19 INFO: Detected dialect: W3C
15-Sep-2021 20:23:26 Running locally...
15-Sep-2021 20:23:26 Starting ChromeDriver 89.0.4389.23 (61b08ee2c50024bab004e48d2b1b083cdbdac579-refs/branch-heads/4389@{#294}) on port 9831
15-Sep-2021 20:23:26 Only local connections are allowed.
15-Sep-2021 20:23:26 Please see https://chromedriver.chromium.org/security-considerations for suggestions on keeping ChromeDriver safe.
15-Sep-2021 20:23:26 ChromeDriver was started successfully.
15-Sep-2021 20:23:27 Sep 15, 2021 8:23:27 PM org.openqa.selenium.remote.ProtocolHandshake createSession
15-Sep-2021 20:23:27 INFO: Detected dialect: W3C
15-Sep-2021 20:23:27 Running locally...
15-Sep-2021 20:23:27 Starting ChromeDriver 89.0.4389.23 (61b08ee2c50024bab004e48d2b1b083cdbdac579-refs/branch-heads/4389@{#294}) on port 27176
15-Sep-2021 20:23:27 Only local connections are allowed.
15-Sep-2021 20:23:27 Please see https://chromedriver.chromium.org/security-considerations for suggestions on keeping ChromeDriver safe.
15-Sep-2021 20:23:27 ChromeDriver was started successfully.
15-Sep-2021 20:23:27 Sep 15, 2021 8:23:27 PM org.openqa.selenium.remote.ProtocolHandshake createSession
15-Sep-2021 20:23:27 INFO: Detected dialect: W3C
15-Sep-2021 20:23:32 Running locally...
15-Sep-2021 20:23:32 Starting ChromeDriver 89.0.4389.23 (61b08ee2c50024bab004e48d2b1b083cdbdac579-refs/branch-heads/4389@{#294}) on port 22700
15-Sep-2021 20:23:32 Only local connections are allowed.
15-Sep-2021 20:23:32 Please see https://chromedriver.chromium.org/security-considerations for suggestions on keeping ChromeDriver safe.
15-Sep-2021 20:23:32 ChromeDriver was started successfully.
15-Sep-2021 20:23:33 Sep 15, 2021 8:23:33 PM org.openqa.selenium.remote.ProtocolHandshake createSession
15-Sep-2021 20:23:33 INFO: Detected dialect: W3C
15-Sep-2021 20:23:33 Running locally...
15-Sep-2021 20:23:33 Starting ChromeDriver 89.0.4389.23 (61b08ee2c50024bab004e48d2b1b083cdbdac579-refs/branch-heads/4389@{#294}) on port 32459
15-Sep-2021 20:23:33 Only local connections are allowed.
15-Sep-2021 20:23:33 Please see https://chromedriver.chromium.org/security-considerations for suggestions on keeping ChromeDriver safe.
15-Sep-2021 20:23:33 ChromeDriver was started successfully.
15-Sep-2021 20:23:33 Sep 15, 2021 8:23:33 PM org.openqa.selenium.remote.ProtocolHandshake createSession
15-Sep-2021 20:23:33 INFO: Detected dialect: W3C
15-Sep-2021 20:23:35 Running locally...
15-Sep-2021 20:23:35 Starting ChromeDriver 89.0.4389.23 (61b08ee2c50024bab004e48d2b1b083cdbdac579-refs/branch-heads/4389@{#294}) on port 31272
15-Sep-2021 20:23:35 Only local connections are allowed.
15-Sep-2021 20:23:35 Please see https://chromedriver.chromium.org/security-considerations for suggestions on keeping ChromeDriver safe.
15-Sep-2021 20:23:35 ChromeDriver was started successfully.
15-Sep-2021 20:23:36 Sep 15, 2021 8:23:36 PM org.openqa.selenium.remote.ProtocolHandshake createSession
15-Sep-2021 20:23:36 INFO: Detected dialect: W3C
15-Sep-2021 20:23:36 Running locally...
15-Sep-2021 20:23:36 Starting ChromeDriver 89.0.4389.23 (61b08ee2c50024bab004e48d2b1b083cdbdac579-refs/branch-heads/4389@{#294}) on port 16723
15-Sep-2021 20:23:36 Only local connections are allowed.
15-Sep-2021 20:23:36 Please see https://chromedriver.chromium.org/security-considerations for suggestions on keeping ChromeDriver safe.
15-Sep-2021 20:23:36 ChromeDriver was started successfully.
15-Sep-2021 20:23:36 Sep 15, 2021 8:23:36 PM org.openqa.selenium.remote.ProtocolHandshake createSession
15-Sep-2021 20:23:36 INFO: Detected dialect: W3C
15-Sep-2021 20:23:38 Running locally...
15-Sep-2021 20:23:38 Starting ChromeDriver 89.0.4389.23 (61b08ee2c50024bab004e48d2b1b083cdbdac579-refs/branch-heads/4389@{#294}) on port 4786
15-Sep-2021 20:23:38 Only local connections are allowed.
15-Sep-2021 20:23:38 Please see https://chromedriver.chromium.org/security-considerations for suggestions on keeping ChromeDriver safe.
15-Sep-2021 20:23:38 ChromeDriver was started successfully.
15-Sep-2021 20:23:38 Sep 15, 2021 8:23:38 PM org.openqa.selenium.remote.ProtocolHandshake createSession
15-Sep-2021 20:23:38 INFO: Detected dialect: W3C
15-Sep-2021 20:23:41 Running locally...
15-Sep-2021 20:23:41 Starting ChromeDriver 89.0.4389.23 (61b08ee2c50024bab004e48d2b1b083cdbdac579-refs/branch-heads/4389@{#294}) on port 6390
15-Sep-2021 20:23:41 Only local connections are allowed.
15-Sep-2021 20:23:41 Please see https://chromedriver.chromium.org/security-considerations for suggestions on keeping ChromeDriver safe.
15-Sep-2021 20:23:41 ChromeDriver was started successfully.
15-Sep-2021 20:23:41 Sep 15, 2021 8:23:41 PM org.openqa.selenium.remote.ProtocolHandshake createSession
15-Sep-2021 20:23:41 INFO: Detected dialect: W3C
15-Sep-2021 20:23:42 Running locally...
15-Sep-2021 20:23:42 Starting ChromeDriver 89.0.4389.23 (61b08ee2c50024bab004e48d2b1b083cdbdac579-refs/branch-heads/4389@{#294}) on port 30776
15-Sep-2021 20:23:42 Only local connections are allowed.
15-Sep-2021 20:23:42 Please see https://chromedriver.chromium.org/security-considerations for suggestions on keeping ChromeDriver safe.
15-Sep-2021 20:23:42 ChromeDriver was started successfully.
15-Sep-2021 20:23:42 Sep 15, 2021 8:23:42 PM org.openqa.selenium.remote.ProtocolHandshake createSession
15-Sep-2021 20:23:42 INFO: Detected dialect: W3C
15-Sep-2021 20:23:44 Running locally...
15-Sep-2021 20:23:44 Starting ChromeDriver 89.0.4389.23 (61b08ee2c50024bab004e48d2b1b083cdbdac579-refs/branch-heads/4389@{#294}) on port 23344
15-Sep-2021 20:23:44 Only local connections are allowed.
15-Sep-2021 20:23:44 Please see https://chromedriver.chromium.org/security-considerations for suggestions on keeping ChromeDriver safe.
15-Sep-2021 20:23:44 ChromeDriver was started successfully.
15-Sep-2021 20:23:44 Sep 15, 2021 8:23:44 PM org.openqa.selenium.remote.ProtocolHandshake createSession
15-Sep-2021 20:23:44 INFO: Detected dialect: W3C
15-Sep-2021 20:23:48 Running locally...
15-Sep-2021 20:23:48 Starting ChromeDriver 89.0.4389.23 (61b08ee2c50024bab004e48d2b1b083cdbdac579-refs/branch-heads/4389@{#294}) on port 9654
15-Sep-2021 20:23:48 Only local connections are allowed.
15-Sep-2021 20:23:48 Please see https://chromedriver.chromium.org/security-considerations for suggestions on keeping ChromeDriver safe.
15-Sep-2021 20:23:48 ChromeDriver was started successfully.
15-Sep-2021 20:23:49 Sep 15, 2021 8:23:49 PM org.openqa.selenium.remote.ProtocolHandshake createSession
15-Sep-2021 20:23:49 INFO: Detected dialect: W3C
15-Sep-2021 20:23:49 Running locally...
15-Sep-2021 20:23:49 Starting ChromeDriver 89.0.4389.23 (61b08ee2c50024bab004e48d2b1b083cdbdac579-refs/branch-heads/4389@{#294}) on port 12066
15-Sep-2021 20:23:49 Only local connections are allowed.
15-Sep-2021 20:23:49 Please see https://chromedriver.chromium.org/security-considerations for suggestions on keeping ChromeDriver safe.
15-Sep-2021 20:23:49 ChromeDriver was started successfully.
15-Sep-2021 20:23:49 Sep 15, 2021 8:23:49 PM org.openqa.selenium.remote.ProtocolHandshake createSession
15-Sep-2021 20:23:49 INFO: Detected dialect: W3C
15-Sep-2021 20:24:01 Running locally...
15-Sep-2021 20:24:01 Starting ChromeDriver 89.0.4389.23 (61b08ee2c50024bab004e48d2b1b083cdbdac579-refs/branch-heads/4389@{#294}) on port 7835
15-Sep-2021 20:24:01 Only local connections are allowed.
15-Sep-2021 20:24:01 Please see https://chromedriver.chromium.org/security-considerations for suggestions on keeping ChromeDriver safe.
15-Sep-2021 20:24:01 ChromeDriver was started successfully.
15-Sep-2021 20:24:01 Sep 15, 2021 8:24:01 PM org.openqa.selenium.remote.ProtocolHandshake createSession
15-Sep-2021 20:24:01 INFO: Detected dialect: W3C
15-Sep-2021 20:24:02 Running locally...
15-Sep-2021 20:24:02 Starting ChromeDriver 89.0.4389.23 (61b08ee2c50024bab004e48d2b1b083cdbdac579-refs/branch-heads/4389@{#294}) on port 13041
15-Sep-2021 20:24:02 Only local connections are allowed.
15-Sep-2021 20:24:02 Please see https://chromedriver.chromium.org/security-considerations for suggestions on keeping ChromeDriver safe.
15-Sep-2021 20:24:02 ChromeDriver was started successfully.
15-Sep-2021 20:24:02 Sep 15, 2021 8:24:02 PM org.openqa.selenium.remote.ProtocolHandshake createSession
15-Sep-2021 20:24:02 INFO: Detected dialect: W3C
15-Sep-2021 20:24:16 Running locally...
15-Sep-2021 20:24:16 Starting ChromeDriver 89.0.4389.23 (61b08ee2c50024bab004e48d2b1b083cdbdac579-refs/branch-heads/4389@{#294}) on port 18486
15-Sep-2021 20:24:16 Only local connections are allowed.
15-Sep-2021 20:24:16 Please see https://chromedriver.chromium.org/security-considerations for suggestions on keeping ChromeDriver safe.
15-Sep-2021 20:24:16 ChromeDriver was started successfully.
15-Sep-2021 20:24:16 Sep 15, 2021 8:24:16 PM org.openqa.selenium.remote.ProtocolHandshake createSession
15-Sep-2021 20:24:16 INFO: Detected dialect: W3C
15-Sep-2021 20:24:16 Running locally...
15-Sep-2021 20:24:16 Starting ChromeDriver 89.0.4389.23 (61b08ee2c50024bab004e48d2b1b083cdbdac579-refs/branch-heads/4389@{#294}) on port 12300
15-Sep-2021 20:24:16 Only local connections are allowed.
15-Sep-2021 20:24:16 Please see https://chromedriver.chromium.org/security-considerations for suggestions on keeping ChromeDriver safe.
15-Sep-2021 20:24:16 ChromeDriver was started successfully.
15-Sep-2021 20:24:17 Sep 15, 2021 8:24:17 PM org.openqa.selenium.remote.ProtocolHandshake createSession
15-Sep-2021 20:24:17 INFO: Detected dialect: W3C
15-Sep-2021 20:24:29 Running locally...
15-Sep-2021 20:24:29 Starting ChromeDriver 89.0.4389.23 (61b08ee2c50024bab004e48d2b1b083cdbdac579-refs/branch-heads/4389@{#294}) on port 3643
15-Sep-2021 20:24:29 Only local connections are allowed.
15-Sep-2021 20:24:29 Please see https://chromedriver.chromium.org/security-considerations for suggestions on keeping ChromeDriver safe.
15-Sep-2021 20:24:29 ChromeDriver was started successfully.
15-Sep-2021 20:24:29 Sep 15, 2021 8:24:29 PM org.openqa.selenium.remote.ProtocolHandshake createSession
15-Sep-2021 20:24:29 INFO: Detected dialect: W3C
15-Sep-2021 20:24:30 Running locally...
15-Sep-2021 20:24:30 Starting ChromeDriver 89.0.4389.23 (61b08ee2c50024bab004e48d2b1b083cdbdac579-refs/branch-heads/4389@{#294}) on port 20476
15-Sep-2021 20:24:30 Only local connections are allowed.
15-Sep-2021 20:24:30 Please see https://chromedriver.chromium.org/security-considerations for suggestions on keeping ChromeDriver safe.
15-Sep-2021 20:24:30 ChromeDriver was started successfully.
15-Sep-2021 20:24:30 Sep 15, 2021 8:24:30 PM org.openqa.selenium.remote.ProtocolHandshake createSession
15-Sep-2021 20:24:30 INFO: Detected dialect: W3C
15-Sep-2021 20:26:37 Running locally...
15-Sep-2021 20:26:37 Starting ChromeDriver 89.0.4389.23 (61b08ee2c50024bab004e48d2b1b083cdbdac579-refs/branch-heads/4389@{#294}) on port 14838
15-Sep-2021 20:26:37 Only local connections are allowed.
15-Sep-2021 20:26:37 Please see https://chromedriver.chromium.org/security-considerations for suggestions on keeping ChromeDriver safe.
15-Sep-2021 20:26:37 ChromeDriver was started successfully.
15-Sep-2021 20:26:38 Sep 15, 2021 8:26:38 PM org.openqa.selenium.remote.ProtocolHandshake createSession
15-Sep-2021 20:26:38 INFO: Detected dialect: W3C
15-Sep-2021 20:26:38 Running locally...
15-Sep-2021 20:26:38 Starting ChromeDriver 89.0.4389.23 (61b08ee2c50024bab004e48d2b1b083cdbdac579-refs/branch-heads/4389@{#294}) on port 15965
15-Sep-2021 20:26:38 Only local connections are allowed.
15-Sep-2021 20:26:38 Please see https://chromedriver.chromium.org/security-considerations for suggestions on keeping ChromeDriver safe.
15-Sep-2021 20:26:38 ChromeDriver was started successfully.
15-Sep-2021 20:26:38 Sep 15, 2021 8:26:38 PM org.openqa.selenium.remote.ProtocolHandshake createSession
15-Sep-2021 20:26:38 INFO: Detected dialect: W3C
15-Sep-2021 20:28:45 Running locally...
15-Sep-2021 20:28:45 Starting ChromeDriver 89.0.4389.23 (61b08ee2c50024bab004e48d2b1b083cdbdac579-refs/branch-heads/4389@{#294}) on port 20238
15-Sep-2021 20:28:45 Only local connections are allowed.
15-Sep-2021 20:28:45 Please see https://chromedriver.chromium.org/security-considerations for suggestions on keeping ChromeDriver safe.
15-Sep-2021 20:28:45 ChromeDriver was started successfully.
15-Sep-2021 20:28:46 Sep 15, 2021 8:28:46 PM org.openqa.selenium.remote.ProtocolHandshake createSession
15-Sep-2021 20:28:46 INFO: Detected dialect: W3C
15-Sep-2021 20:28:46 Running locally...
15-Sep-2021 20:28:46 Starting ChromeDriver 89.0.4389.23 (61b08ee2c50024bab004e48d2b1b083cdbdac579-refs/branch-heads/4389@{#294}) on port 4896
15-Sep-2021 20:28:46 Only local connections are allowed.
15-Sep-2021 20:28:46 Please see https://chromedriver.chromium.org/security-considerations for suggestions on keeping ChromeDriver safe.
15-Sep-2021 20:28:46 ChromeDriver was started successfully.
15-Sep-2021 20:28:46 Sep 15, 2021 8:28:46 PM org.openqa.selenium.remote.ProtocolHandshake createSession
15-Sep-2021 20:28:46 INFO: Detected dialect: W3C
15-Sep-2021 20:30:53 Running locally...
15-Sep-2021 20:30:53 Starting ChromeDriver 89.0.4389.23 (61b08ee2c50024bab004e48d2b1b083cdbdac579-refs/branch-heads/4389@{#294}) on port 30002
15-Sep-2021 20:30:53 Only local connections are allowed.
15-Sep-2021 20:30:53 Please see https://chromedriver.chromium.org/security-considerations for suggestions on keeping ChromeDriver safe.
15-Sep-2021 20:30:53 ChromeDriver was started successfully.
15-Sep-2021 20:30:53 Sep 15, 2021 8:30:53 PM org.openqa.selenium.remote.ProtocolHandshake createSession
15-Sep-2021 20:30:53 INFO: Detected dialect: W3C
15-Sep-2021 20:30:54 Running locally...
15-Sep-2021 20:30:54 Starting ChromeDriver 89.0.4389.23 (61b08ee2c50024bab004e48d2b1b083cdbdac579-refs/branch-heads/4389@{#294}) on port 4487
15-Sep-2021 20:30:54 Only local connections are allowed.
15-Sep-2021 20:30:54 Please see https://chromedriver.chromium.org/security-considerations for suggestions on keeping ChromeDriver safe.
15-Sep-2021 20:30:54 ChromeDriver was started successfully.
15-Sep-2021 20:30:54 Sep 15, 2021 8:30:54 PM org.openqa.selenium.remote.ProtocolHandshake createSession
15-Sep-2021 20:30:54 INFO: Detected dialect: W3C
15-Sep-2021 20:31:13 Running locally...
15-Sep-2021 20:31:14 Starting ChromeDriver 89.0.4389.23 (61b08ee2c50024bab004e48d2b1b083cdbdac579-refs/branch-heads/4389@{#294}) on port 15714
15-Sep-2021 20:31:14 Only local connections are allowed.
15-Sep-2021 20:31:14 Please see https://chromedriver.chromium.org/security-considerations for suggestions on keeping ChromeDriver safe.
15-Sep-2021 20:31:14 ChromeDriver was started successfully.
15-Sep-2021 20:31:14 Sep 15, 2021 8:31:14 PM org.openqa.selenium.remote.ProtocolHandshake createSession
15-Sep-2021 20:31:14 INFO: Detected dialect: W3C
15-Sep-2021 20:31:14 Running locally...
15-Sep-2021 20:31:14 Starting ChromeDriver 89.0.4389.23 (61b08ee2c50024bab004e48d2b1b083cdbdac579-refs/branch-heads/4389@{#294}) on port 20617
15-Sep-2021 20:31:14 Only local connections are allowed.
15-Sep-2021 20:31:14 Please see https://chromedriver.chromium.org/security-considerations for suggestions on keeping ChromeDriver safe.
15-Sep-2021 20:31:14 ChromeDriver was started successfully.
15-Sep-2021 20:31:15 Sep 15, 2021 8:31:15 PM org.openqa.selenium.remote.ProtocolHandshake createSession
15-Sep-2021 20:31:15 INFO: Detected dialect: W3C
15-Sep-2021 20:31:19 Running locally...
15-Sep-2021 20:31:19 Starting ChromeDriver 89.0.4389.23 (61b08ee2c50024bab004e48d2b1b083cdbdac579-refs/branch-heads/4389@{#294}) on port 27119
15-Sep-2021 20:31:19 Only local connections are allowed.
15-Sep-2021 20:31:19 Please see https://chromedriver.chromium.org/security-considerations for suggestions on keeping ChromeDriver safe.
15-Sep-2021 20:31:19 ChromeDriver was started successfully.
15-Sep-2021 20:31:19 Sep 15, 2021 8:31:19 PM org.openqa.selenium.remote.ProtocolHandshake createSession
15-Sep-2021 20:31:19 INFO: Detected dialect: W3C
15-Sep-2021 20:31:25 Running locally...
15-Sep-2021 20:31:25 Starting ChromeDriver 89.0.4389.23 (61b08ee2c50024bab004e48d2b1b083cdbdac579-refs/branch-heads/4389@{#294}) on port 1779
15-Sep-2021 20:31:25 Only local connections are allowed.
15-Sep-2021 20:31:25 Please see https://chromedriver.chromium.org/security-considerations for suggestions on keeping ChromeDriver safe.
15-Sep-2021 20:31:25 ChromeDriver was started successfully.
15-Sep-2021 20:31:25 Sep 15, 2021 8:31:25 PM org.openqa.selenium.remote.ProtocolHandshake createSession
15-Sep-2021 20:31:25 INFO: Detected dialect: W3C
15-Sep-2021 20:31:26 Running locally...
15-Sep-2021 20:31:26 Starting ChromeDriver 89.0.4389.23 (61b08ee2c50024bab004e48d2b1b083cdbdac579-refs/branch-heads/4389@{#294}) on port 9924
15-Sep-2021 20:31:26 Only local connections are allowed.
15-Sep-2021 20:31:26 Please see https://chromedriver.chromium.org/security-considerations for suggestions on keeping ChromeDriver safe.
15-Sep-2021 20:31:26 ChromeDriver was started successfully.
15-Sep-2021 20:31:26 Sep 15, 2021 8:31:26 PM org.openqa.selenium.remote.ProtocolHandshake createSession
15-Sep-2021 20:31:26 INFO: Detected dialect: W3C
15-Sep-2021 20:31:31 Running locally...
15-Sep-2021 20:31:31 Starting ChromeDriver 89.0.4389.23 (61b08ee2c50024bab004e48d2b1b083cdbdac579-refs/branch-heads/4389@{#294}) on port 8069
15-Sep-2021 20:31:31 Only local connections are allowed.
15-Sep-2021 20:31:31 Please see https://chromedriver.chromium.org/security-considerations for suggestions on keeping ChromeDriver safe.
15-Sep-2021 20:31:31 ChromeDriver was started successfully.
15-Sep-2021 20:31:31 Sep 15, 2021 8:31:31 PM org.openqa.selenium.remote.ProtocolHandshake createSession
15-Sep-2021 20:31:31 INFO: Detected dialect: W3C
15-Sep-2021 20:31:36 Running locally...
15-Sep-2021 20:31:36 Starting ChromeDriver 89.0.4389.23 (61b08ee2c50024bab004e48d2b1b083cdbdac579-refs/branch-heads/4389@{#294}) on port 24810
15-Sep-2021 20:31:36 Only local connections are allowed.
15-Sep-2021 20:31:36 Please see https://chromedriver.chromium.org/security-considerations for suggestions on keeping ChromeDriver safe.
15-Sep-2021 20:31:36 ChromeDriver was started successfully.
15-Sep-2021 20:31:37 Sep 15, 2021 8:31:37 PM org.openqa.selenium.remote.ProtocolHandshake createSession
15-Sep-2021 20:31:37 INFO: Detected dialect: W3C
15-Sep-2021 20:31:37 Running locally...
15-Sep-2021 20:31:37 Starting ChromeDriver 89.0.4389.23 (61b08ee2c50024bab004e48d2b1b083cdbdac579-refs/branch-heads/4389@{#294}) on port 8390
15-Sep-2021 20:31:37 Only local connections are allowed.
15-Sep-2021 20:31:37 Please see https://chromedriver.chromium.org/security-considerations for suggestions on keeping ChromeDriver safe.
15-Sep-2021 20:31:37 ChromeDriver was started successfully.
15-Sep-2021 20:31:38 Sep 15, 2021 8:31:38 PM org.openqa.selenium.remote.ProtocolHandshake createSession
15-Sep-2021 20:31:38 INFO: Detected dialect: W3C
15-Sep-2021 20:31:42 Running locally...
15-Sep-2021 20:31:42 Starting ChromeDriver 89.0.4389.23 (61b08ee2c50024bab004e48d2b1b083cdbdac579-refs/branch-heads/4389@{#294}) on port 22989
15-Sep-2021 20:31:42 Only local connections are allowed.
15-Sep-2021 20:31:42 Please see https://chromedriver.chromium.org/security-considerations for suggestions on keeping ChromeDriver safe.
15-Sep-2021 20:31:42 ChromeDriver was started successfully.
15-Sep-2021 20:31:42 Sep 15, 2021 8:31:42 PM org.openqa.selenium.remote.ProtocolHandshake createSession
15-Sep-2021 20:31:42 INFO: Detected dialect: W3C
15-Sep-2021 20:31:49 Running locally...
15-Sep-2021 20:31:49 Starting ChromeDriver 89.0.4389.23 (61b08ee2c50024bab004e48d2b1b083cdbdac579-refs/branch-heads/4389@{#294}) on port 24511
15-Sep-2021 20:31:49 Only local connections are allowed.
15-Sep-2021 20:31:49 Please see https://chromedriver.chromium.org/security-considerations for suggestions on keeping ChromeDriver safe.
15-Sep-2021 20:31:49 ChromeDriver was started successfully.
15-Sep-2021 20:31:50 Sep 15, 2021 8:31:50 PM org.openqa.selenium.remote.ProtocolHandshake createSession
15-Sep-2021 20:31:50 INFO: Detected dialect: W3C
15-Sep-2021 20:31:50 Running locally...
15-Sep-2021 20:31:50 Starting ChromeDriver 89.0.4389.23 (61b08ee2c50024bab004e48d2b1b083cdbdac579-refs/branch-heads/4389@{#294}) on port 3230
15-Sep-2021 20:31:50 Only local connections are allowed.
15-Sep-2021 20:31:50 Please see https://chromedriver.chromium.org/security-considerations for suggestions on keeping ChromeDriver safe.
15-Sep-2021 20:31:50 ChromeDriver was started successfully.
15-Sep-2021 20:31:50 Sep 15, 2021 8:31:50 PM org.openqa.selenium.remote.ProtocolHandshake createSession
15-Sep-2021 20:31:50 INFO: Detected dialect: W3C
15-Sep-2021 20:31:55 Running locally...
15-Sep-2021 20:31:55 Starting ChromeDriver 89.0.4389.23 (61b08ee2c50024bab004e48d2b1b083cdbdac579-refs/branch-heads/4389@{#294}) on port 22122
15-Sep-2021 20:31:55 Only local connections are allowed.
15-Sep-2021 20:31:55 Please see https://chromedriver.chromium.org/security-considerations for suggestions on keeping ChromeDriver safe.
15-Sep-2021 20:31:55 ChromeDriver was started successfully.
15-Sep-2021 20:31:55 Sep 15, 2021 8:31:55 PM org.openqa.selenium.remote.ProtocolHandshake createSession
15-Sep-2021 20:31:55 INFO: Detected dialect: W3C
15-Sep-2021 20:32:02 Running locally...
15-Sep-2021 20:32:02 Starting ChromeDriver 89.0.4389.23 (61b08ee2c50024bab004e48d2b1b083cdbdac579-refs/branch-heads/4389@{#294}) on port 26549
15-Sep-2021 20:32:02 Only local connections are allowed.
15-Sep-2021 20:32:02 Please see https://chromedriver.chromium.org/security-considerations for suggestions on keeping ChromeDriver safe.
15-Sep-2021 20:32:02 ChromeDriver was started successfully.
15-Sep-2021 20:32:02 Sep 15, 2021 8:32:02 PM org.openqa.selenium.remote.ProtocolHandshake createSession
15-Sep-2021 20:32:02 INFO: Detected dialect: W3C
15-Sep-2021 20:32:03 Running locally...
15-Sep-2021 20:32:03 Starting ChromeDriver 89.0.4389.23 (61b08ee2c50024bab004e48d2b1b083cdbdac579-refs/branch-heads/4389@{#294}) on port 4237
15-Sep-2021 20:32:03 Only local connections are allowed.
15-Sep-2021 20:32:03 Please see https://chromedriver.chromium.org/security-considerations for suggestions on keeping ChromeDriver safe.
15-Sep-2021 20:32:03 ChromeDriver was started successfully.
15-Sep-2021 20:32:03 Sep 15, 2021 8:32:03 PM org.openqa.selenium.remote.ProtocolHandshake createSession
15-Sep-2021 20:32:03 INFO: Detected dialect: W3C
15-Sep-2021 20:32:32 Running locally...
15-Sep-2021 20:32:32 Starting ChromeDriver 89.0.4389.23 (61b08ee2c50024bab004e48d2b1b083cdbdac579-refs/branch-heads/4389@{#294}) on port 29159
15-Sep-2021 20:32:32 Only local connections are allowed.
15-Sep-2021 20:32:32 Please see https://chromedriver.chromium.org/security-considerations for suggestions on keeping ChromeDriver safe.
15-Sep-2021 20:32:32 ChromeDriver was started successfully.
15-Sep-2021 20:32:33 Sep 15, 2021 8:32:33 PM org.openqa.selenium.remote.ProtocolHandshake createSession
15-Sep-2021 20:32:33 INFO: Detected dialect: W3C
15-Sep-2021 20:32:33 Running locally...
15-Sep-2021 20:32:33 Starting ChromeDriver 89.0.4389.23 (61b08ee2c50024bab004e48d2b1b083cdbdac579-refs/branch-heads/4389@{#294}) on port 29008
15-Sep-2021 20:32:33 Only local connections are allowed.
15-Sep-2021 20:32:33 Please see https://chromedriver.chromium.org/security-considerations for suggestions on keeping ChromeDriver safe.
15-Sep-2021 20:32:33 ChromeDriver was started successfully.
15-Sep-2021 20:32:33 Sep 15, 2021 8:32:33 PM org.openqa.selenium.remote.ProtocolHandshake createSession
15-Sep-2021 20:32:33 INFO: Detected dialect: W3C
15-Sep-2021 20:32:35 Running locally...
15-Sep-2021 20:32:35 Starting ChromeDriver 89.0.4389.23 (61b08ee2c50024bab004e48d2b1b083cdbdac579-refs/branch-heads/4389@{#294}) on port 5020
15-Sep-2021 20:32:35 Only local connections are allowed.
15-Sep-2021 20:32:35 Please see https://chromedriver.chromium.org/security-considerations for suggestions on keeping ChromeDriver safe.
15-Sep-2021 20:32:35 ChromeDriver was started successfully.
15-Sep-2021 20:32:35 Sep 15, 2021 8:32:35 PM org.openqa.selenium.remote.ProtocolHandshake createSession
15-Sep-2021 20:32:35 INFO: Detected dialect: W3C
15-Sep-2021 20:32:38 Running locally...
15-Sep-2021 20:32:38 Starting ChromeDriver 89.0.4389.23 (61b08ee2c50024bab004e48d2b1b083cdbdac579-refs/branch-heads/4389@{#294}) on port 19572
15-Sep-2021 20:32:38 Only local connections are allowed.
15-Sep-2021 20:32:38 Please see https://chromedriver.chromium.org/security-considerations for suggestions on keeping ChromeDriver safe.
15-Sep-2021 20:32:38 ChromeDriver was started successfully.
15-Sep-2021 20:32:38 Sep 15, 2021 8:32:38 PM org.openqa.selenium.remote.ProtocolHandshake createSession
15-Sep-2021 20:32:38 INFO: Detected dialect: W3C
15-Sep-2021 20:32:40 ┌──────────────────────────────────────────────────────────────────────────┐
15-Sep-2021 20:32:40 │ View your Cucumber Report at:                                            │
15-Sep-2021 20:32:40 │ https://reports.cucumber.io/reports/de5cb966-0b4e-44e1-bdd1-239bc4f8df39 │
15-Sep-2021 20:32:40 │                                                                          │
15-Sep-2021 20:32:40 │ This report will self-destruct in 24h unless it is claimed or deleted.   │
15-Sep-2021 20:32:40 └──────────────────────────────────────────────────────────────────────────┘
15-Sep-2021 20:32:40 Tests run: 23, Failures: 1, Errors: 3, Skipped: 0, Time elapsed: 592.041 sec <<< FAILURE!
15-Sep-2021 20:32:40 Vitals over maximum value(Vitals Management)  Time elapsed: 13.132 sec  <<< FAILURE!
15-Sep-2021 20:32:40 java.lang.AssertionError:
15-Sep-2021 20:32:40 Expected: a collection containing "Maximum: 999"
15-Sep-2021 20:32:40      but: was "Maximum: 99", was "Maximum: 99"
15-Sep-2021 20:32:40         at org.hamcrest.MatcherAssert.assertThat(MatcherAssert.java:20)
15-Sep-2021 20:32:40         at org.hamcrest.MatcherAssert.assertThat(MatcherAssert.java:8)
15-Sep-2021 20:32:40         at org.openmrs.contrib.qaframework.automation.VitalsAndTriagingSteps.crossCheckMaximumVitalsValidity(VitalsAndTriagingSteps.java:122)
15-Sep-2021 20:32:40         at ✽.a user enters a vital above maximum value and the system alerts until valid(file:///home/bamboo-agent/bamboo-agent/xml-data/build-dir/CONTRIB-QA-FRAMEWORK/src/test/resources/features/refapp-2.x/03-trackPatient/vitalsAndTriaging.feature:24)
15-Sep-2021 20:32:40
15-Sep-2021 20:32:40 Creating user account for Nurse #1(User Account Management)  Time elapsed: 128.164 sec  <<< ERROR!
15-Sep-2021 20:32:40 org.openqa.selenium.TimeoutException: Expected condition failed: waiting for org.openmrs.uitestframework.page.Page$1@243f7677 (tried for 120 second(s) with 500 milliseconds interval)
15-Sep-2021 20:32:40 Build info: version: '4.0.0-alpha-6', revision: '5f43a29cfc'
15-Sep-2021 20:32:40 System info: host: 'yue', ip: '127.0.0.1', os.name: 'Linux', os.arch: 'amd64', os.version: '4.4.0-210-generic', java.version: '1.8.0_292'
15-Sep-2021 20:32:40 Driver info: org.openqa.selenium.chrome.ChromeDriver
15-Sep-2021 20:32:40 Capabilities {acceptInsecureCerts: false, browserName: chrome, browserVersion: 90.0.4430.72, chrome: {chromedriverVersion: 89.0.4389.23 (61b08ee2c5002..., userDataDir: /tmp/.com.google.Chrome.7BLRve}, goog:chromeOptions: {debuggerAddress: localhost:45532}, javascriptEnabled: true, networkConnectionEnabled: false, pageLoadStrategy: normal, platform: LINUX, platformName: LINUX, proxy: Proxy(), setWindowRect: true, strictFileInteractability: false, timeouts: {implicit: 0, pageLoad: 300000, script: 30000}, unhandledPromptBehavior: dismiss and notify, webauthn:extension:largeBlob: true, webauthn:virtualAuthenticators: true}
15-Sep-2021 20:32:40 Session ID: 79dfe7396b216449247aa6baaae14dad
15-Sep-2021 20:32:40         at org.openqa.selenium.support.ui.WebDriverWait.timeoutException(WebDriverWait.java:138)
15-Sep-2021 20:32:40         at org.openqa.selenium.support.ui.FluentWait.lambda$checkConditionInLoop$2(FluentWait.java:255)
15-Sep-2021 20:32:40         at java.util.concurrent.CompletableFuture$AsyncSupply.run(CompletableFuture.java:1604)
15-Sep-2021 20:32:40         at java.lang.Thread.run(Thread.java:748)
15-Sep-2021 20:32:40         at ✽.a user clicks on save account button(file:///home/bamboo-agent/bamboo-agent/xml-data/build-dir/CONTRIB-QA-FRAMEWORK/src/test/resources/features/refapp-2.x/06-user/users.feature:15)
15-Sep-2021 20:32:40
15-Sep-2021 20:32:40 Creating user account for Nurse #2(User Account Management)  Time elapsed: 128.15 sec  <<< ERROR!
15-Sep-2021 20:32:40 org.openqa.selenium.TimeoutException: Expected condition failed: waiting for org.openmrs.uitestframework.page.Page$1@3b4c2020 (tried for 120 second(s) with 500 milliseconds interval)
15-Sep-2021 20:32:40 Build info: version: '4.0.0-alpha-6', revision: '5f43a29cfc'
15-Sep-2021 20:32:40 System info: host: 'yue', ip: '127.0.0.1', os.name: 'Linux', os.arch: 'amd64', os.version: '4.4.0-210-generic', java.version: '1.8.0_292'
15-Sep-2021 20:32:40 Driver info: org.openqa.selenium.chrome.ChromeDriver
15-Sep-2021 20:32:40 Capabilities {acceptInsecureCerts: false, browserName: chrome, browserVersion: 90.0.4430.72, chrome: {chromedriverVersion: 89.0.4389.23 (61b08ee2c5002..., userDataDir: /tmp/.com.google.Chrome.VlZXSX}, goog:chromeOptions: {debuggerAddress: localhost:38195}, javascriptEnabled: true, networkConnectionEnabled: false, pageLoadStrategy: normal, platform: LINUX, platformName: LINUX, proxy: Proxy(), setWindowRect: true, strictFileInteractability: false, timeouts: {implicit: 0, pageLoad: 300000, script: 30000}, unhandledPromptBehavior: dismiss and notify, webauthn:extension:largeBlob: true, webauthn:virtualAuthenticators: true}
15-Sep-2021 20:32:40 Session ID: 1d514ed01c06b1def0e40d8d5a9f18bf
15-Sep-2021 20:32:40         at org.openqa.selenium.support.ui.WebDriverWait.timeoutException(WebDriverWait.java:138)
15-Sep-2021 20:32:40         at org.openqa.selenium.support.ui.FluentWait.lambda$checkConditionInLoop$2(FluentWait.java:255)
15-Sep-2021 20:32:40         at java.util.concurrent.CompletableFuture$AsyncSupply.run(CompletableFuture.java:1604)
15-Sep-2021 20:32:40         at java.lang.Thread.run(Thread.java:748)
15-Sep-2021 20:32:40         at ✽.a user clicks on save account button(file:///home/bamboo-agent/bamboo-agent/xml-data/build-dir/CONTRIB-QA-FRAMEWORK/src/test/resources/features/refapp-2.x/06-user/users.feature:22)
15-Sep-2021 20:32:40
15-Sep-2021 20:32:40 Creating user account for Doctor(User Account Management)  Time elapsed: 127.843 sec  <<< ERROR!
15-Sep-2021 20:32:40 org.openqa.selenium.TimeoutException: Expected condition failed: waiting for org.openmrs.uitestframework.page.Page$1@3f888abb (tried for 120 second(s) with 500 milliseconds interval)
15-Sep-2021 20:32:40 Build info: version: '4.0.0-alpha-6', revision: '5f43a29cfc'
15-Sep-2021 20:32:40 System info: host: 'yue', ip: '127.0.0.1', os.name: 'Linux', os.arch: 'amd64', os.version: '4.4.0-210-generic', java.version: '1.8.0_292'
15-Sep-2021 20:32:40 Driver info: org.openqa.selenium.chrome.ChromeDriver
15-Sep-2021 20:32:40 Capabilities {acceptInsecureCerts: false, browserName: chrome, browserVersion: 90.0.4430.72, chrome: {chromedriverVersion: 89.0.4389.23 (61b08ee2c5002..., userDataDir: /tmp/.com.google.Chrome.jpxnfN}, goog:chromeOptions: {debuggerAddress: localhost:43228}, javascriptEnabled: true, networkConnectionEnabled: false, pageLoadStrategy: normal, platform: LINUX, platformName: LINUX, proxy: Proxy(), setWindowRect: true, strictFileInteractability: false, timeouts: {implicit: 0, pageLoad: 300000, script: 30000}, unhandledPromptBehavior: dismiss and notify, webauthn:extension:largeBlob: true, webauthn:virtualAuthenticators: true}
15-Sep-2021 20:32:40 Session ID: 398e2e26f5d095457ecb85711fb11096
15-Sep-2021 20:32:40         at org.openqa.selenium.support.ui.WebDriverWait.timeoutException(WebDriverWait.java:138)
15-Sep-2021 20:32:40         at org.openqa.selenium.support.ui.FluentWait.lambda$checkConditionInLoop$2(FluentWait.java:255)
15-Sep-2021 20:32:40         at java.util.concurrent.CompletableFuture$AsyncSupply.run(CompletableFuture.java:1604)
15-Sep-2021 20:32:40         at java.lang.Thread.run(Thread.java:748)
15-Sep-2021 20:32:40         at ✽.a user clicks on save account button(file:///home/bamboo-agent/bamboo-agent/xml-data/build-dir/CONTRIB-QA-FRAMEWORK/src/test/resources/features/refapp-2.x/06-user/users.feature:29)
15-Sep-2021 20:32:40
15-Sep-2021 20:32:41
15-Sep-2021 20:32:41 Results :
15-Sep-2021 20:32:41
15-Sep-2021 20:32:41 Failed tests:   Vitals over maximum value(Vitals Management): (..)
15-Sep-2021 20:32:41
15-Sep-2021 20:32:41 Tests in error:
15-Sep-2021 20:32:41   Creating user account for Nurse #1(User Account Management): Expected condition failed: waiting for org.openmrs.uitestframework.page.Page$1@243f7677 (tried for 120 second(s) with 500 milliseconds interval)(..)
15-Sep-2021 20:32:41   Creating user account for Nurse #2(User Account Management): Expected condition failed: waiting for org.openmrs.uitestframework.page.Page$1@3b4c2020 (tried for 120 second(s) with 500 milliseconds interval)(..)
15-Sep-2021 20:32:41   Creating user account for Doctor(User Account Management): Expected condition failed: waiting for org.openmrs.uitestframework.page.Page$1@3f888abb (tried for 120 second(s) with 500 milliseconds interval)(..)
15-Sep-2021 20:32:41
15-Sep-2021 20:32:41 Tests run: 23, Failures: 1, Errors: 3, Skipped: 0
15-Sep-2021 20:32:41
15-Sep-2021 20:32:41 [INFO] ------------------------------------------------------------------------
15-Sep-2021 20:32:41 [INFO] BUILD FAILURE
15-Sep-2021 20:32:41 [INFO] ------------------------------------------------------------------------
15-Sep-2021 20:32:41 [INFO] Total time: 10:10 min
15-Sep-2021 20:32:41 [INFO] Finished at: 2021-09-15T20:32:41+00:00
15-Sep-2021 20:32:41 [INFO] Final Memory: 39M/285M
15-Sep-2021 20:32:41 [INFO] ------------------------------------------------------------------------
15-Sep-2021 20:32:41 [ERROR] Failed to execute goal org.apache.maven.plugins:maven-surefire-plugin:2.12.4:test (default-test) on project qaframework: There are test failures.
15-Sep-2021 20:32:41 [ERROR]
15-Sep-2021 20:32:41 [ERROR] Please refer to /home/bamboo-agent/bamboo-agent/xml-data/build-dir/CONTRIB-QA-FRAMEWORK/target/surefire-reports for the individual test results.
15-Sep-2021 20:32:41 [ERROR] -> [Help 1]
15-Sep-2021 20:32:41 [ERROR]
15-Sep-2021 20:32:41 [ERROR] To see the full stack trace of the errors, re-run Maven with the -e switch.
15-Sep-2021 20:32:41 [ERROR] Re-run Maven using the -X switch to enable full debug logging.
15-Sep-2021 20:32:41 [ERROR]
15-Sep-2021 20:32:41 [ERROR] For more information about the errors and possible solutions, please read the following articles:
15-Sep-2021 20:32:41 [ERROR] [Help 1] http://cwiki.apache.org/confluence/display/MAVEN/MojoFailureException
15-Sep-2021 20:32:41 Failing task since return code of [/usr/share/apache-maven-3.3.9/bin/mvn --batch-mode -Djava.io.tmpdir=/home/bamboo-agent/bamboo-agent/.agent_tmp/CONTRIB-QA-FRAMEWORK test -Dcucumber.filter.tags=@selenium and not @initialSetup] was 1 while expected 0
15-Sep-2021 20:32:41 Finished task 'run selenium tests without initialSetup' with result: Failed
15-Sep-2021 20:32:41 Running post build plugin 'Docker Container Cleanup'
15-Sep-2021 20:32:41 Running post build plugin 'NCover Results Collector'
15-Sep-2021 20:32:41 Running post build plugin 'Clover Results Collector'
15-Sep-2021 20:32:41 Running post build plugin 'Sauce OnDemand Post Runner'
15-Sep-2021 20:32:41 Running post build plugin 'npm Cache Cleanup'
15-Sep-2021 20:32:41 Running post build plugin 'Artifact Copier'
15-Sep-2021 20:32:41 Finalising the build...
15-Sep-2021 20:32:41 Stopping timer.
15-Sep-2021 20:32:41 Build CONTRIB-QA-FRAMEWORK-811 completed.
15-Sep-2021 20:32:41 Running on server: post build plugin 'NCover Results Collector'
15-Sep-2021 20:32:41 Running on server: post build plugin 'Build Hanging Detection Configuration'
15-Sep-2021 20:32:41 Running on server: post build plugin 'Clover Delta Calculator'
15-Sep-2021 20:32:41 Running on server: post build plugin 'Maven Dependencies Postprocessor'
15-Sep-2021 20:32:41 All post build plugins have finished
15-Sep-2021 20:32:41 Generating build results summary...
15-Sep-2021 20:32:41 Saving build results to disk...
15-Sep-2021 20:32:41 Logging substituted variables...
15-Sep-2021 20:32:41 Indexing build results...
15-Sep-2021 20:32:41 Finished building CONTRIB-QA-FRAMEWORK-811.