Build: #27 failed Changes by Wyclif Luyima

Logs

The following logs have been generated by the jobs in this plan.
  • Expand all
  • Collapse all
Job Logs
Collapse Default Job Default Stage Download or View
02-Mar-2021 04:48:02 [INFO] OpenMRS EIP OpenMRS API component .................. SUCCESS [ 47.395 s]
02-Mar-2021 04:48:02 [INFO] OpenMRS EIP Common ................................. SUCCESS [ 35.492 s]
02-Mar-2021 04:48:02 [INFO] OpenMRS EIP Watcher ................................ SUCCESS [03:29 min]
02-Mar-2021 04:48:02 [INFO] OpenMRS EIP DB Sync Receiver App ................... SUCCESS [ 29.523 s]
02-Mar-2021 04:48:02 [INFO] OpenMRS EIP DB Sync Sender App ..................... SUCCESS [ 52.815 s]
02-Mar-2021 04:48:02 [INFO] OpenMRS EIP Example App ............................ FAILURE [  5.994 s]
02-Mar-2021 04:48:02 [INFO] OpenMRS EIP Distribution ........................... SKIPPED
02-Mar-2021 04:48:02 [INFO] OpenMRS EIP Odoo Integration ....................... SKIPPED
02-Mar-2021 04:48:02 [INFO] ------------------------------------------------------------------------
02-Mar-2021 04:48:02 [INFO] BUILD FAILURE
02-Mar-2021 04:48:02 [INFO] ------------------------------------------------------------------------
02-Mar-2021 04:48:02 [INFO] Total time: 07:04 min
02-Mar-2021 04:48:02 [INFO] Finished at: 2021-03-02T04:48:02+00:00
02-Mar-2021 04:48:03 [INFO] Final Memory: 115M/410M
02-Mar-2021 04:48:03 [INFO] ------------------------------------------------------------------------
02-Mar-2021 04:48:03 [ERROR] Failed to execute goal org.apache.maven.plugins:maven-deploy-plugin:2.7:deploy (default-deploy) on project example-app: Deployment failed: repository element was not specified in the POM inside distributionManagement element or in -DaltDeploymentRepository=id::layout::url parameter -> [Help 1]
02-Mar-2021 04:48:03 [ERROR]
02-Mar-2021 04:48:03 [ERROR] To see the full stack trace of the errors, re-run Maven with the -e switch.
02-Mar-2021 04:48:03 [ERROR] Re-run Maven using the -X switch to enable full debug logging.
02-Mar-2021 04:48:03 [ERROR]
02-Mar-2021 04:48:03 [ERROR] For more information about the errors and possible solutions, please read the following articles:
02-Mar-2021 04:48:03 [ERROR] [Help 1] http://cwiki.apache.org/confluence/display/MAVEN/MojoExecutionException
02-Mar-2021 04:48:03 [ERROR]
02-Mar-2021 04:48:03 [ERROR] After correcting the problems, you can resume the build with the command
02-Mar-2021 04:48:03 [ERROR]   mvn <goals> -rf :example-app