Automated build for testing and creating the Name Phonetics Module

Build: #163 failed

Job: Default Job failed

Stages & jobs

  1. Default Stage

Build log

The build generated 81 lines of output. Download or view full build log

14-Mar-2019 22:06:06 Build Name Phonetics - Name Phonetics - Default Job #163 (NP-NP-JOB1-163) started building on agent yokobue.openmrs.org (2)
14-Mar-2019 22:06:06 Remote agent on host yokobue.openmrs.org
14-Mar-2019 22:06:06 Build working directory is /home/bamboo-agent/bamboo-agent/xml-data/build-dir/NP-NP-JOB1
14-Mar-2019 22:06:06 Executing build Name Phonetics - Name Phonetics - Default Job #163 (NP-NP-JOB1-163)
14-Mar-2019 22:06:06 Starting task 'Checkout Default Repository' of type 'com.atlassian.bamboo.plugins.vcs:task.vcs.checkout'
14-Mar-2019 22:06:06 Checking out into /home/bamboo-agent/bamboo-agent/xml-data/build-dir/NP-NP-JOB1
14-Mar-2019 22:06:06 Updating source code to revision: 403a53d2bb2964d4eee4a8d94901e1d220ed0c02
14-Mar-2019 22:06:06 Creating local git repository in '/home/bamboo-agent/bamboo-agent/xml-data/build-dir/NP-NP-JOB1/.git'.
14-Mar-2019 22:06:06 Initialized empty Git repository in /home/bamboo-agent/bamboo-agent/xml-data/build-dir/NP-NP-JOB1/.git/
14-Mar-2019 22:06:07 Fetching 'refs/heads/master' from 'https://github.com/openmrs/openmrs-module-namephonetics.git'. Will try to do a shallow fetch.
14-Mar-2019 22:06:08 From https://github.com/openmrs/openmrs-module-namephonetics
14-Mar-2019 22:06:08 * [new branch]      master     -> master
14-Mar-2019 22:06:08 Checking out revision 403a53d2bb2964d4eee4a8d94901e1d220ed0c02.
14-Mar-2019 22:06:08 Already on 'master'
14-Mar-2019 22:06:08 Updated source code to revision: 403a53d2bb2964d4eee4a8d94901e1d220ed0c02
14-Mar-2019 22:06:08 Finished task 'Checkout Default Repository' with result: Success
14-Mar-2019 22:06:08 Running pre-build action: VCS Version Collector
14-Mar-2019 22:06:08 Running pre-build action: Sauce OnDemand Build Configurator
14-Mar-2019 22:06:08 Running pre-build action: Hung Build Killer PreBuildAction
14-Mar-2019 22:06:08 Running pre-build action: Run Predator
14-Mar-2019 22:06:08 [PredatorPreBuildAction] Starting predator plugin, pre build agent cleaner
14-Mar-2019 22:06:08 [PredatorPreBuildAction] Running these commands: docker system prune -af; docker kill $(docker ps -q); docker rm -f $(docker ps -qa)
14-Mar-2019 22:06:08 [PredatorPreBuildAction] Running command 'docker system prune -af'
14-Mar-2019 22:06:08 [PredatorPreBuildAction] Command 'docker system prune -af' completed with exit code 0
14-Mar-2019 22:06:08 [PredatorPreBuildAction] Running command 'docker kill $(docker ps -q)'
14-Mar-2019 22:06:08 [PredatorPreBuildAction] Command 'docker kill $(docker ps -q)' completed with exit code 125
14-Mar-2019 22:06:08 [PredatorPreBuildAction] Running command 'docker rm -f $(docker ps -qa)'
14-Mar-2019 22:06:08 [PredatorPreBuildAction] Command 'docker rm -f $(docker ps -qa)' completed with exit code 125
14-Mar-2019 22:06:08 [PredatorPreBuildAction] Identifying Bamboo agent process (or parent):  2346 java        2344 bamboo-age 3059Mb  402Mb 00:26:01 /usr/lib/jvm/java-8-ope
14-Mar-2019 22:06:08 [PredatorPreBuildAction] Identifying Bamboo agent process (or parent):  2344 wrapper        1 bamboo-age   17Mb    1Mb 00:05:28 /home/bamboo-agent/bamb
14-Mar-2019 22:06:08 [PredatorPreBuildAction] Identifying Bamboo agent process (or parent):     1 systemd        0 root        181Mb    4Mb 00:00:14 /sbin/init             
14-Mar-2019 22:06:08 [PredatorPreBuildAction] No processes found for (chromium|chrome|webdriver|mysql|java |mvn )
14-Mar-2019 22:06:08 [PredatorPreBuildAction] Initial free space: 8.538429 GB
14-Mar-2019 22:06:08 [PredatorPreBuildAction] Deleting folder /home/bamboo-agent/bamboo-agent/xml-data/build-dir/JAVADOC-BRANCH110X-JOB1
14-Mar-2019 22:06:08 [PredatorPreBuildAction] Deleting 0 snapshot folders from /home/bamboo-agent/.m2/repository
14-Mar-2019 22:06:08 [PredatorPreBuildAction] Maven snapshot disk freed: 0 GB
14-Mar-2019 22:06:08 [PredatorPreBuildAction] 0 empty artifacts were found and deleted by Predator
14-Mar-2019 22:06:09 [PredatorPreBuildAction] Maven stable disk freed: 0.0027918648 GB, deleted 79 files
14-Mar-2019 22:06:09 [PredatorPreBuildAction] File /home/bamboo-agent/.npmrc does not exist.
14-Mar-2019 22:06:09 [PredatorPreBuildAction] File /home/bamboo-agent/.docker/config.json does not exist.
14-Mar-2019 22:06:09 [PredatorPreBuildAction] Final free space: 8.541454 GB
14-Mar-2019 22:06:09 [PredatorPreBuildAction] Done
14-Mar-2019 22:06:09 Skipping execution of task 'Compile and Test' as it is disabled
14-Mar-2019 22:06:09 Starting task 'Test and deploy' of type 'com.atlassian.bamboo.plugins.maven:task.builder.mvn3'
14-Mar-2019 22:06:09
Beginning to execute external process for build 'Name Phonetics - Name Phonetics - Default Job #163 (NP-NP-JOB1-163)'
... running command line:
/usr/share/apache-maven-3.2.5/bin/mvn --batch-mode -Djava.io.tmpdir=/home/bamboo-agent/bamboo-agent/.agent_tmp/NP-NP-JOB1 clean deploy
... in: /home/bamboo-agent/bamboo-agent/xml-data/build-dir/NP-NP-JOB1
... using extra environment variables:
bamboo_planRepository_1_branch=master
bamboo_capability_system_builder_grailsBuilder_Grails_2_3_7=/opt/grails
bamboo_dockerhub_password=********
bamboo_planRepository_1_branchDisplayName=master
bamboo_repository_revision_number=403a53d2bb2964d4eee4a8d94901e1d220ed0c02
MAVEN2_HOME=/usr/share/apache-maven-3.2.5
bamboo_capability_system_builder_command_transifex=/usr/bin/tx
bamboo_resultsUrl=https://ci.openmrs.org/browse/NP-NP-JOB1-163
bamboo_build_working_directory=/home/bamboo-agent/bamboo-agent/xml-data/build-dir/NP-NP-JOB1
bamboo_planRepository_1_name=Git
bamboo_buildKey=NP-NP-JOB1
bamboo_preparing_refapp_distro_release=true
bamboo_shortPlanName=Name Phonetics
bamboo_planRepository_name=Git
bamboo_docs_aws_secret_key=********
bamboo_buildNumber=163
bamboo_shortJobName=Default Job
bamboo_buildResultsUrl=https://ci.openmrs.org/browse/NP-NP-JOB1-163
bamboo_planRepository_repositoryUrl=https://github.com/openmrs/openmrs-module-namephonetics.git
bamboo_agentId=132120578
bamboo_repository_8552449_previous_revision_number=62a2a4e4034bc0d45ffcd8dfd68cda72ff4b402c
bamboo_planName=Name Phonetics - Name Phonetics
bamboo_shortPlanKey=NP
bamboo_shortJobKey=JOB1
bamboo_planRepository_revision=403a53d2bb2964d4eee4a8d94901e1d220ed0c02
bamboo_buildTimeStamp=2019-03-14T22:06:06.366Z
bamboo_repository_previous_revision_number=62a2a4e4034bc0d45ffcd8dfd68cda72ff4b402c
bamboo_capability_system_jdk_JDK_1_8_0_181=/usr/lib/jvm/java-8-openjdk-amd64
bamboo_repository_8552449_git_repositoryUrl=https://github.com/openmrs/openmrs-module-namephonetics.git
bamboo_planRepository_previousRevision=62a2a4e4034bc0d45ffcd8dfd68cda72ff4b402c
M2_HOME=/usr/share/apache-maven-3.2.5
bamboo_refapp_bamboo_build_number=
bamboo_repository_git_branch=master
bamboo_buildResultKey=NP-NP-JOB1-163
bamboo_repository_branch_name=master
bamboo_docs_aws_access_key=AKIAI7KMDL5KP2673G7A
bamboo_buildPlanName=Name Phonetics - Name Phonetics - Default Job
bamboo_dockerhub_username=openmrsci
bamboo_planRepository_1_revision=403a53d2bb2964d4eee4a8d94901e1d220ed0c02
bamboo_repository_name=Git
bamboo_capability_system_jdk_openjdk_7_jdk=/usr/lib/jvm/java-7-openjdk-amd64
bamboo_capability_system_jdk_openjdk_8_jdk=/usr/lib/jvm/java-8-openjdk-amd64
bamboo_refapp_distro_scm=git@github.com:openmrs/openmrs-distro-referenceapplication.git
JAVA_HOME=/usr/lib/jvm/java-7-openjdk-amd64
bamboo_repository_8552449_revision_number=403a53d2bb2964d4eee4a8d94901e1d220ed0c02
bamboo_transifex_password=********
bamboo_capability_system_builder_grailsBuilder_Grails_2=/opt/grails
bamboo_buildFailed=false
bamboo_capability_system_docker_executable=/usr/bin/docker
bamboo_capability_system_jdk_JDK_1_8_0_191=/usr/lib/jvm/java-8-openjdk-amd64
bamboo_planRepository_branch=master
bamboo_capability_system_builder_command_Bash=/bin/bash
bamboo_agentWorkingDirectory=/home/bamboo-agent/bamboo-agent/xml-data/build-dir
bamboo_capability_system_git_executable=/usr/bin/git
bamboo_repository_git_username=
bamboo_planRepository_1_previousRevision=62a2a4e4034bc0d45ffcd8dfd68cda72ff4b402c
bamboo_repository_8552449_branch_name=master
bamboo_planRepository_branchDisplayName=master
bamboo_planRepository_1_type=gitv2
bamboo_planRepository_branchName=master
bamboo_repository_8552449_git_branch=master
bamboo_capability_system_jdk_JDK=/usr/lib/jvm/java-8-openjdk-amd64
bamboo_test_db_bamboo_admin_password=********
bamboo_repository_8552449_name=Git
bamboo_mavenBuildGoals=clean install
bamboo_plan_storageTag=NP-NP
bamboo_hg_cache_directory=/home/bamboo-agent/bamboo-agent/xml-data/build-dir/_hg-repositories-cache
bamboo_planRepository_1_username=
bamboo_planRepository_type=gitv2
bamboo_git_cache_directory=/home/bamboo-agent/bamboo-agent/xml-data/build-dir/_git-repositories-cache
bamboo_repository_git_repositoryUrl=https://github.com/openmrs/openmrs-module-namephonetics.git
bamboo_transifex_username=infrastructure@openmrs.org
useMavenReturnCode=false
bamboo_capability_system_builder_node_Node_js=/usr/bin/node
bamboo_repository_8552449_git_username=
bamboo_refapp_distro_dev_branch=master
bamboo_capability_system_builder_ant_Ant=/usr/share/ant
bamboo_capability_system_builder_mvn3_Maven_3=/usr/share/apache-maven-3.2.5
bamboo_tmp_directory=/home/bamboo-agent/bamboo-agent/temp
bamboo_working_directory=/home/bamboo-agent/bamboo-agent/xml-data/build-dir/NP-NP-JOB1
bamboo_planKey=NP-NP
bamboo_planRepository_1_repositoryUrl=https://github.com/openmrs/openmrs-module-namephonetics.git
bamboo_planRepository_username=
bamboo_capability_system_jdk_JDK_1_8=/usr/lib/jvm/java-8-openjdk-amd64
bamboo_capability_system_jdk_JDK_1_7=/usr/lib/jvm/java-7-openjdk-amd64
bamboo_planRepository_1_branchName=master
PATH=/usr/lib/jvm/java-7-openjdk-amd64/bin:/usr/lib/jvm/java-1.8.0-openjdk-amd64//bin:/home/bamboo-agent/bin:/home/bamboo-agent/.local/bin:/usr/local/bin:/usr/bin:/bin:/usr/local/games:/usr/games:/snap/bin:/opt/puppetlabs/bin
14-Mar-2019 22:06:13 [INFO] Scanning for projects...
14-Mar-2019 22:06:15 [INFO] Downloading: http://mavenrepo.openmrs.org/nexus/content/repositories/public/org/apache/maven/maven-project/2.0/maven-project-2.0.pom
14-Mar-2019 22:06:17 [INFO] Downloading: https://repo.maven.apache.org/maven2/org/apache/maven/maven-project/2.0/maven-project-2.0.pom
14-Mar-2019 22:06:17 [ERROR] The build could not read 1 project -> [Help 1]
14-Mar-2019 22:06:17 [ERROR]   
14-Mar-2019 22:06:17 [ERROR]   The project org.openmrs.module:namephonetics-omod:1.7.0-SNAPSHOT (/home/bamboo-agent/bamboo-agent/xml-data/build-dir/NP-NP-JOB1/omod/pom.xml) has 1 error
14-Mar-2019 22:06:17 [ERROR]     Unresolveable build extension: Plugin org.openmrs.maven.plugins:maven-openmrs-plugin:1.0.1 or one of its dependencies could not be resolved: Failed to collect dependencies at org.openmrs.maven.plugins:maven-openmrs-plugin:jar:1.0.1 -> org.apache.maven:maven-archiver:jar:2.2 -> org.apache.maven:maven-project:jar:2.0: Failed to read artifact descriptor for org.apache.maven:maven-project:jar:2.0: Could not transfer artifact org.apache.maven:maven-project:pom:2.0 from/to openmrs-repo (http://mavenrepo.openmrs.org/nexus/content/repositories/public): Remote host closed connection during handshake: SSL peer shut down incorrectly -> [Help 2]
14-Mar-2019 22:06:17 [ERROR]
14-Mar-2019 22:06:17 [ERROR] To see the full stack trace of the errors, re-run Maven with the -e switch.
14-Mar-2019 22:06:17 [ERROR] Re-run Maven using the -X switch to enable full debug logging.
14-Mar-2019 22:06:17 [ERROR]
14-Mar-2019 22:06:17 [ERROR] For more information about the errors and possible solutions, please read the following articles:
14-Mar-2019 22:06:17 [ERROR] [Help 1] http://cwiki.apache.org/confluence/display/MAVEN/ProjectBuildingException
14-Mar-2019 22:06:17 [ERROR] [Help 2] http://cwiki.apache.org/confluence/display/MAVEN/PluginResolutionException
14-Mar-2019 22:06:17 Failing task since return code of [/usr/share/apache-maven-3.2.5/bin/mvn --batch-mode -Djava.io.tmpdir=/home/bamboo-agent/bamboo-agent/.agent_tmp/NP-NP-JOB1 clean deploy] was 1 while expected 0
14-Mar-2019 22:06:17 Parsing test results under /home/bamboo-agent/bamboo-agent/xml-data/build-dir/NP-NP-JOB1...
14-Mar-2019 22:06:17 Finished task 'Test and deploy' with result: Failed
14-Mar-2019 22:06:17 Running post build plugin 'Docker Container Cleanup'
14-Mar-2019 22:06:17 Running post build plugin 'NCover Results Collector'
14-Mar-2019 22:06:17 Running post build plugin 'Clover Results Collector'
14-Mar-2019 22:06:17 Running post build plugin 'Sauce OnDemand Post Runner'
14-Mar-2019 22:06:17 Running post build plugin 'npm Cache Cleanup'
14-Mar-2019 22:06:17 Running post build plugin 'Artifact Copier'
14-Mar-2019 22:06:17 Finalising the build...
14-Mar-2019 22:06:17 Stopping timer.
14-Mar-2019 22:06:17 Build NP-NP-JOB1-163 completed.
14-Mar-2019 22:06:17 Running on server: post build plugin 'NCover Results Collector'
14-Mar-2019 22:06:17 Running on server: post build plugin 'Build Hanging Detection Configuration'
14-Mar-2019 22:06:17 Running on server: post build plugin 'Clover Delta Calculator'
14-Mar-2019 22:06:17 Running on server: post build plugin 'Maven Dependencies Postprocessor'
14-Mar-2019 22:06:17 All post build plugins have finished
14-Mar-2019 22:06:18 Generating build results summary...
14-Mar-2019 22:06:18 Saving build results to disk...
14-Mar-2019 22:06:18 Logging substituted variables...
14-Mar-2019 22:06:18 Indexing build results...
14-Mar-2019 22:06:18 Finished building NP-NP-JOB1-163.