Build: #335 failed

Job: Default Job failed

Stages & jobs

  1. Default Stage

  2. QA

Job result summary

Completed
Duration
39 seconds
Agent
yokobue.openmrs.org
Revision
312cb158000f729089c54ab76c3f40b4698a7675 312cb158000f729089c54ab76c3f40b4698a7675
Failing since
#330 (Code changes detected – )
Fixed in
#340 (Manual run by Rafal Korytkowski)
No failed test found. A possible compilation error occurred.

Error summary

The build generated some errors. See the full build log for more details.

npm WARN deprecated browserslist@2.11.3: Browserslist 2 could fail on reading Browserslist >3.0 config used in other tools.
npm WARN deprecated browserslist@1.7.7: Browserslist 2 could fail on reading Browserslist >3.0 config used in other tools.
npm ERR! code ETARGET
npm ERR! notarget No matching version found for react-router@^4.4.0
npm ERR! notarget In most cases you or one of your dependencies are requesting
npm ERR! notarget a package version that doesn't exist.
npm ERR! notarget
npm ERR! notarget It was specified as a dependency of 'openmrs-ocl-client'
npm ERR! notarget

npm ERR! A complete log of this run can be found in:
npm ERR!     /home/bamboo-agent/.npm/_logs/2019-03-19T08_21_54_272Z-debug.log
sh: 1: react-scripts: not found
npm ERR! file sh
npm ERR! code ELIFECYCLE
npm ERR! errno ENOENT
npm ERR! syscall spawn
npm ERR! openmrs-ocl-client@0.1.0 test:bamboo: `react-scripts test --env=jsdom -u --ci --coverage --testResultsProcessor ./node_modules/jest-junit`
npm ERR! spawn ENOENT
npm ERR!
npm ERR! Failed at the openmrs-ocl-client@0.1.0 test:bamboo script.
npm ERR! This is probably not a problem with npm. There is likely additional logging output above.
npm WARN Local package.json exists, but node_modules missing, did you mean to install?

npm ERR! A complete log of this run can be found in:
npm ERR!     /home/bamboo-agent/.npm/_logs/2019-03-19T08_21_55_224Z-debug.log