Build #274

Build: #274 failed Changes by Michael Seaton <mseaton@pih.org>

Stages & jobs

  1. Update versions

  2. Build

  3. Push docker image

  4. Validate

  5. Release

    Requires a user to start manually
  6. Release 2nd stage

  7. Release 3rd stage

Logs

The following logs have been generated by the jobs in this branch.
  • Expand all
  • Collapse all
Job Logs
Collapse Build Build Download or View
20-May-2022 12:15:36 [INFO]                                                                         
20-May-2022 12:15:36 [INFO] ------------------------------------------------------------------------
20-May-2022 12:15:36 [INFO] Building OpenMRS Platform 1.12.2-SNAPSHOT
20-May-2022 12:15:36 [INFO] ------------------------------------------------------------------------
20-May-2022 12:15:37 [INFO] Downloading: http://mavenrepo.openmrs.org/nexus/content/repositories/public/org/openmrs/maven/plugins/openmrs-sdk-maven-plugin/3.12.4/openmrs-sdk-maven-plugin-3.12.4.pom
20-May-2022 12:15:37 [INFO] Downloading: https://repo.maven.apache.org/maven2/org/openmrs/maven/plugins/openmrs-sdk-maven-plugin/3.12.4/openmrs-sdk-maven-plugin-3.12.4.pom
20-May-2022 12:15:38 [WARNING] The POM for org.openmrs.maven.plugins:openmrs-sdk-maven-plugin:jar:3.12.4 is missing, no dependency information available
20-May-2022 12:15:38 [INFO] Downloading: http://mavenrepo.openmrs.org/nexus/content/repositories/public/org/openmrs/maven/plugins/openmrs-sdk-maven-plugin/3.12.4/openmrs-sdk-maven-plugin-3.12.4.jar
20-May-2022 12:15:38 [INFO] Downloading: https://repo.maven.apache.org/maven2/org/openmrs/maven/plugins/openmrs-sdk-maven-plugin/3.12.4/openmrs-sdk-maven-plugin-3.12.4.jar
20-May-2022 12:15:38 [INFO] ------------------------------------------------------------------------
20-May-2022 12:15:38 [INFO] BUILD FAILURE
20-May-2022 12:15:38 [INFO] ------------------------------------------------------------------------
20-May-2022 12:15:38 [INFO] Total time: 2.006 s
20-May-2022 12:15:38 [INFO] Finished at: 2022-05-20T12:15:38+00:00
20-May-2022 12:15:38 [INFO] Final Memory: 8M/128M
20-May-2022 12:15:38 [INFO] ------------------------------------------------------------------------
20-May-2022 12:15:38 [ERROR] Plugin org.openmrs.maven.plugins:openmrs-sdk-maven-plugin:3.12.4 or one of its dependencies could not be resolved: Could not find artifact org.openmrs.maven.plugins:openmrs-sdk-maven-plugin:jar:3.12.4 in openmrs-repo (http://mavenrepo.openmrs.org/nexus/content/repositories/public) -> [Help 1]
20-May-2022 12:15:38 [ERROR]
20-May-2022 12:15:38 [ERROR] To see the full stack trace of the errors, re-run Maven with the -e switch.
20-May-2022 12:15:38 [ERROR] Re-run Maven using the -X switch to enable full debug logging.
20-May-2022 12:15:38 [ERROR]
20-May-2022 12:15:38 [ERROR] For more information about the errors and possible solutions, please read the following articles:
20-May-2022 12:15:38 [ERROR] [Help 1] http://cwiki.apache.org/confluence/display/MAVEN/PluginResolutionException
20-May-2022 12:15:38 Unable to publish artifact [docker-compose-snapshot]: the source directory /home/bamboo-agent/bamboo-agent/xml-data/build-dir/OP-OPM2-JOB1/target/distro does not exist.
20-May-2022 12:15:38 The artifact is required for down stream Stages and Jobs, build will now fail.