Build #10,634

Deploys Reference Application SNAPSHOT to maven

Build: #10634 failed Rebuilt by Daniel Kayiwa

Stages & jobs

  1. Deploy Reference Application

  2. Deploy docker image

  3. Deploy to qa-refapp

  4. Validate

  5. Release

    Requires a user to start manually
  6. Set variables

  7. Release others

Logs

The following logs have been generated by the jobs in this plan.
  • Expand all
  • Collapse all
Job Logs
Collapse Release addons Release others Download or View
25-Nov-2020 08:38:48 sending incremental file list
25-Nov-2020 08:38:48 rsync: failed to set permissions on "/home/frs/project/o/op/openmrs/.": Invalid argument (22)
25-Nov-2020 08:38:48 ./
25-Nov-2020 08:38:48 releases/
25-Nov-2020 08:38:48 releases/OpenMRS_Reference_Application_2.11.0/
25-Nov-2020 08:38:48 releases/OpenMRS_Reference_Application_2.11.0/referenceapplication-addons-2.11.0.zip
25-Nov-2020 08:38:48
25-Nov-2020 08:38:49          32,768   0%    0.00kB/s    0:00:00 
25-Nov-2020 08:38:50      10,158,080   8%    9.64MB/s    0:00:11 
25-Nov-2020 08:38:51      21,495,808  17%   10.16MB/s    0:00:10 
25-Nov-2020 08:38:52      34,045,952  27%   10.72MB/s    0:00:08 
25-Nov-2020 08:38:53      45,711,360  36%   10.79MB/s    0:00:07 
25-Nov-2020 08:38:54      47,874,048  38%    8.90MB/s    0:00:08 
25-Nov-2020 08:38:55      58,884,096  46%    8.80MB/s    0:00:07 
25-Nov-2020 08:38:56      69,009,408  54%    8.23MB/s    0:00:06 
25-Nov-2020 08:38:57      79,462,400  63%    7.92MB/s    0:00:05 
25-Nov-2020 08:38:58      91,783,168  72%   10.32MB/s    0:00:03 
25-Nov-2020 08:38:59     105,316,352  83%   10.91MB/s    0:00:01 
25-Nov-2020 08:39:00     113,704,960  90%   10.54MB/s    0:00:01 
25-Nov-2020 08:39:00     124,420,096  98%   10.67MB/s    0:00:00 
25-Nov-2020 08:39:00     125,787,135 100%    9.80MB/s    0:00:12 (xfr#1, to-chk=0/4)
25-Nov-2020 08:39:01
25-Nov-2020 08:39:01 rsync error: some files/attrs were not transferred (see previous errors) (code 23) at main.c(1183) [sender=3.1.1]
25-Nov-2020 08:39:01 sent 125,818,096 bytes  received 144 bytes  8,677,120.00 bytes/sec
25-Nov-2020 08:39:01 total size is 125,787,135  speedup is 1.00
Collapse Release readme Release others Download or View
24-Nov-2020 18:59:29 rsync: failed to set permissions on "/home/frs/project/o/op/openmrs/.": Invalid argument (22)
24-Nov-2020 18:59:29 ./
24-Nov-2020 18:59:29 releases/
24-Nov-2020 18:59:29 releases/OpenMRS_Reference_Application_2.11.0/
24-Nov-2020 18:59:29 releases/OpenMRS_Reference_Application_2.11.0/readme.txt
24-Nov-2020 18:59:29
24-Nov-2020 18:59:29           2,256 100%    0.00kB/s    0:00:00 
24-Nov-2020 18:59:29           2,256 100%    0.00kB/s    0:00:00 (xfr#1, to-chk=0/4)
24-Nov-2020 18:59:29 rsync error: some files/attrs were not transferred (see previous errors) (code 23) at main.c(1183) [sender=3.1.1]
24-Nov-2020 18:59:29
24-Nov-2020 18:59:29 sent 2,491 bytes  received 144 bytes  1,054.00 bytes/sec
24-Nov-2020 18:59:29 total size is 2,256  speedup is 0.86
25-Nov-2020 08:39:06 sending incremental file list
25-Nov-2020 08:39:06 rsync: failed to set permissions on "/home/frs/project/o/op/openmrs/.": Invalid argument (22)
25-Nov-2020 08:39:06 ./
25-Nov-2020 08:39:06 releases/
25-Nov-2020 08:39:06 releases/OpenMRS_Reference_Application_2.11.0/
25-Nov-2020 08:39:06 releases/OpenMRS_Reference_Application_2.11.0/readme.txt
25-Nov-2020 08:39:06
25-Nov-2020 08:39:06           2,256 100%    0.00kB/s    0:00:00 
25-Nov-2020 08:39:06           2,256 100%    0.00kB/s    0:00:00 (xfr#1, to-chk=0/4)
25-Nov-2020 08:39:06 rsync error: some files/attrs were not transferred (see previous errors) (code 23) at main.c(1183) [sender=3.1.1]
25-Nov-2020 08:39:06
25-Nov-2020 08:39:06 sent 2,491 bytes  received 144 bytes  1,054.00 bytes/sec
25-Nov-2020 08:39:06 total size is 2,256  speedup is 0.86
Collapse Release standalone Release others Download or View
25-Nov-2020 08:36:55 [INFO] Final Memory: 48M/1307M
25-Nov-2020 08:36:55 [INFO] ------------------------------------------------------------------------
25-Nov-2020 08:36:57 [INFO] Scanning for projects...
25-Nov-2020 08:36:57 [INFO]                                                                         
25-Nov-2020 08:36:57 [INFO] ------------------------------------------------------------------------
25-Nov-2020 08:36:57 [INFO] Building Maven Stub Project (No POM) 1
25-Nov-2020 08:36:57 [INFO] ------------------------------------------------------------------------
25-Nov-2020 08:36:57 [INFO]
25-Nov-2020 08:36:57 [INFO] --- maven-deploy-plugin:2.7:deploy-file (default-cli) @ standalone-pom ---
25-Nov-2020 08:36:58 [INFO] Uploading: https://mavenrepo.openmrs.org/nexus/content/repositories/releases/org/openmrs/distro/referenceapplication-standalone/2.11.0/referenceapplication-standalone-2.11.0.zip
25-Nov-2020 08:37:33 [INFO] Uploading: https://mavenrepo.openmrs.org/nexus/content/repositories/releases/org/openmrs/distro/referenceapplication-standalone/2.11.0/referenceapplication-standalone-2.11.0.pom
25-Nov-2020 08:37:33 [INFO] ------------------------------------------------------------------------
25-Nov-2020 08:37:33 [INFO] BUILD FAILURE
25-Nov-2020 08:37:33 [INFO] ------------------------------------------------------------------------
25-Nov-2020 08:37:33 [INFO] Total time: 36.634 s
25-Nov-2020 08:37:33 [INFO] Finished at: 2020-11-25T08:37:33+00:00
25-Nov-2020 08:37:33 [INFO] Final Memory: 10M/184M
25-Nov-2020 08:37:33 [INFO] ------------------------------------------------------------------------
25-Nov-2020 08:37:33 [ERROR] Failed to execute goal org.apache.maven.plugins:maven-deploy-plugin:2.7:deploy-file (default-cli) on project standalone-pom: Failed to deploy artifacts: Could not find artifact org.openmrs.distro:referenceapplication-standalone:zip:2.11.0 in openmrs-repo-releases (https://mavenrepo.openmrs.org/nexus/content/repositories/releases) -> [Help 1]
25-Nov-2020 08:37:33 [ERROR]
25-Nov-2020 08:37:33 [ERROR] To see the full stack trace of the errors, re-run Maven with the -e switch.
25-Nov-2020 08:37:33 [ERROR] Re-run Maven using the -X switch to enable full debug logging.
25-Nov-2020 08:37:33 [ERROR]
25-Nov-2020 08:37:33 [ERROR] For more information about the errors and possible solutions, please read the following articles:
25-Nov-2020 08:37:33 [ERROR] [Help 1] http://cwiki.apache.org/confluence/display/MAVEN/MojoExecutionException
Collapse Release war Release others Download or View
25-Nov-2020 08:38:05 releases/OpenMRS_Reference_Application_2.11.0/openmrs.war
25-Nov-2020 08:38:05
25-Nov-2020 08:38:06          32,768   0%    0.00kB/s    0:00:00 
25-Nov-2020 08:38:07       3,342,336   1%    3.12MB/s    0:00:57 
25-Nov-2020 08:38:08      14,385,152   7%    6.78MB/s    0:00:24 
25-Nov-2020 08:38:09      27,262,976  14%    8.60MB/s    0:00:17 
25-Nov-2020 08:38:10      47,349,760  25%   11.04MB/s    0:00:12 
25-Nov-2020 08:38:11      53,116,928  28%   11.65MB/s    0:00:11 
25-Nov-2020 08:38:12      73,695,232  39%   13.90MB/s    0:00:07 
25-Nov-2020 08:38:13      78,512,128  42%   11.92MB/s    0:00:08 
25-Nov-2020 08:38:14      90,341,376  48%   10.17MB/s    0:00:09 
25-Nov-2020 08:38:15      96,731,136  52%   10.31MB/s    0:00:08 
25-Nov-2020 08:38:16     107,380,736  57%    7.97MB/s    0:00:09 
25-Nov-2020 08:38:17     119,537,664  64%    9.74MB/s    0:00:06 
25-Nov-2020 08:38:18     131,268,608  70%    9.72MB/s    0:00:05 
25-Nov-2020 08:38:20     142,934,016  77%   10.85MB/s    0:00:03 
25-Nov-2020 08:38:21     152,076,288  82%   10.44MB/s    0:00:03 
25-Nov-2020 08:38:22     163,217,408  88%   10.24MB/s    0:00:02 
25-Nov-2020 08:38:23     173,047,808  93%    9.75MB/s    0:00:01 
25-Nov-2020 08:38:23     184,614,912  99%    9.83MB/s    0:00:00 
25-Nov-2020 08:38:23     185,379,429 100%   10.23MB/s    0:00:17 (xfr#1, to-chk=0/4)
25-Nov-2020 08:38:23
25-Nov-2020 08:38:23 sent 185,424,915 bytes  received 144 bytes  9,045,124.83 bytes/sec
25-Nov-2020 08:38:23 total size is 185,379,429  speedup is 1.00
25-Nov-2020 08:38:23 rsync error: some files/attrs were not transferred (see previous errors) (code 23) at main.c(1183) [sender=3.1.1]