Build #11,854

Deploys Reference Application SNAPSHOT to maven

Build: #11854 failed Manual run from the stage: Release by Herbert Yiga

Stages & jobs

  1. Deploy Reference Application

  2. Deploy docker image

  3. Deploy to qa-refapp

  4. Validate

  5. Release

    Requires a user to start manually
  6. Set variables

  7. Release others

Logs

The following logs have been generated by the jobs in this plan.
  • Expand all
  • Collapse all
Job Logs
Collapse Release to maven Release Download or View
28-Sep-2021 10:28:23 [INFO] ------------------------------------------------------------------------
28-Sep-2021 10:28:23 [INFO] BUILD FAILURE
28-Sep-2021 10:28:23 [INFO] ------------------------------------------------------------------------
28-Sep-2021 10:28:23 [INFO] Total time: 2.745 s
28-Sep-2021 10:28:23 [INFO] Finished at: 2021-09-28T10:28:23+00:00
28-Sep-2021 10:28:23 [INFO] Final Memory: 12M/111M
28-Sep-2021 10:28:23 [INFO] ------------------------------------------------------------------------
28-Sep-2021 10:28:23 [ERROR] Failed to execute goal org.apache.maven.plugins:maven-release-plugin:2.5.1:rollback (default-cli) on project referenceapplication: An error is occurred in the checkin process: Exception while executing SCM command. Detecting the current branch failed: fatal: ref HEAD is not a symbolic ref -> [Help 1]
28-Sep-2021 10:28:23 [ERROR]
28-Sep-2021 10:28:23 [ERROR] To see the full stack trace of the errors, re-run Maven with the -e switch.
28-Sep-2021 10:28:23 [ERROR] Re-run Maven using the -X switch to enable full debug logging.
28-Sep-2021 10:28:23 [ERROR]
28-Sep-2021 10:28:23 [ERROR] For more information about the errors and possible solutions, please read the following articles:
28-Sep-2021 10:28:23 [ERROR] [Help 1] http://cwiki.apache.org/confluence/display/MAVEN/MojoExecutionException
28-Sep-2021 10:28:23 [ERROR] mvn release:prepare failed, scroll up the logs to see the error. release:rollback was attempted. Delete the tag from the repository (if it exists), check if the SCM tag is a ssh and not http and try again.
28-Sep-2021 10:28:23 Unable to publish artifact [referenceapplication-addons]: the source directory /home/bamboo-agent/bamboo-agent/xml-data/build-dir/REFAPP-OMODDISTRO-RTM/target/checkout/package/target does not exist.
28-Sep-2021 10:28:23 The artifact is required for down stream Stages and Jobs, build will now fail.
28-Sep-2021 10:28:23 Unable to publish artifact [ referenceapplication-war]: the source directory /home/bamboo-agent/bamboo-agent/xml-data/build-dir/REFAPP-OMODDISTRO-RTM/target/checkout/package/target/bundled-distro/web does not exist.
28-Sep-2021 10:28:23 The artifact is required for down stream Stages and Jobs, build will now fail.
28-Sep-2021 10:28:23 Unable to publish artifact [ referenceapplication-properties]: the source directory /home/bamboo-agent/bamboo-agent/xml-data/build-dir/REFAPP-OMODDISTRO-RTM/target/checkout/package/target/distro/web does not exist.
28-Sep-2021 10:28:23 The artifact is required for down stream Stages and Jobs, build will now fail.
28-Sep-2021 10:28:23 Unable to publish artifact [referenceapplication-docker]: the source directory /home/bamboo-agent/bamboo-agent/xml-data/build-dir/REFAPP-OMODDISTRO-RTM/target/checkout/package/target/bundled-distro/web does not exist.
28-Sep-2021 10:28:23 The artifact is required for down stream Stages and Jobs, build will now fail.
28-Sep-2021 10:28:23 Unable to publish artifact [referenceapplication-readme]: the source directory /home/bamboo-agent/bamboo-agent/xml-data/build-dir/REFAPP-OMODDISTRO-RTM/target/checkout/package/target/classes does not exist.
28-Sep-2021 10:28:23 The artifact is required for down stream Stages and Jobs, build will now fail.