Build #1,932

Deploys Reference Application SNAPSHOT to maven

Build: #1932 failed Child of DIS-DIS-198

Stages & jobs

  1. Create Reference Application packages

  2. Deploy to Automated Functional Test Server

  3. Create Standalone and Run UI Tests

  4. Deploy to Manual Test Server

Build result summary

Details

Completed
Duration
11 minutes
Labels
None
Revisions
Distribution
e5b62a161a520fdd022168f74afc77dd856422a5 e5b62a161a520fdd022168f74afc77dd856422a5
Standalone RA
e079223a12d083467bfdf179d69959b8befcecdf e079223a12d083467bfdf179d69959b8befcecdf
Total tests
7
Fixed in
#1933 (Child of RDD-RDD-552)

Tests

Responsible

No one has taken responsibility for this failure

Configuration changes

Some of the jobs or stages referenced by this result no longer exist.

Restarting failed/incomplete builds only is not possible as some of the affected jobs no longer exist.

Tests

New test failures 3
Status Test View job Duration
Collapse Failed CheckModules org.openmrs.reference.CheckModules History
Run UI tests on Travis 1 min
org.openqa.selenium.WebDriverException: chrome not reachable   (Driver info: chromedriver=2.8.240825,platform=Linux 3.11.0-15-generic x86_64) (WARNING: The server did not provide any stacktrace information) Command duration or timeout: 74.81 seconds Build info: version: '2.37.0', revision: 'a7c61cbd68657e133ae96672cf995890bad2ee42', time: '2013-10-18 09:51:02' System info: host: 'gw108', ip: '149.165.228.106', os.name: 'Linux', os.arch: 'amd64', os.version: '3.11.0-15-generic', java.version: '1.6.0_30' Driver info: org.openqa.selenium.chrome.ChromeDriver
org.openqa.selenium.WebDriverException: chrome not reachable
  (Driver info: chromedriver=2.8.240825,platform=Linux 3.11.0-15-generic x86_64) (WARNING: The server did not provide any stacktrace information)
Command duration or timeout: 74.81 seconds
Build info: version: '2.37.0', revision: 'a7c61cbd68657e133ae96672cf995890bad2ee42', time: '2013-10-18 09:51:02'
System info: host: 'gw108', ip: '149.165.228.106', os.name: 'Linux', os.arch: 'amd64', os.version: '3.11.0-15-generic', java.version: '1.6.0_30'
Driver info: org.openqa.selenium.chrome.ChromeDriver
	at sun.reflect.NativeConstructorAccessorImpl.newInstance0(Native Method)
(36 more lines...)
Collapse Failed RegistrationAppTest org.openmrs.reference.RegistrationAppTest History
Run UI tests on Travis 21 secs
org.openqa.selenium.WebDriverException: chrome not reachable   (Driver info: chromedriver=2.8.240825,platform=Linux 3.11.0-15-generic x86_64) (WARNING: The server did not provide any stacktrace information) Command duration or timeout: 21.04 seconds Build info: version: '2.37.0', revision: 'a7c61cbd68657e133ae96672cf995890bad2ee42', time: '2013-10-18 09:51:02' System info: host: 'gw108', ip: '149.165.228.106', os.name: 'Linux', os.arch: 'amd64', os.version: '3.11.0-15-generic', java.version: '1.6.0_30' Driver info: org.openqa.selenium.chrome.ChromeDriver
org.openqa.selenium.WebDriverException: chrome not reachable
  (Driver info: chromedriver=2.8.240825,platform=Linux 3.11.0-15-generic x86_64) (WARNING: The server did not provide any stacktrace information)
Command duration or timeout: 21.04 seconds
Build info: version: '2.37.0', revision: 'a7c61cbd68657e133ae96672cf995890bad2ee42', time: '2013-10-18 09:51:02'
System info: host: 'gw108', ip: '149.165.228.106', os.name: 'Linux', os.arch: 'amd64', os.version: '3.11.0-15-generic', java.version: '1.6.0_30'
Driver info: org.openqa.selenium.chrome.ChromeDriver
	at sun.reflect.NativeConstructorAccessorImpl.newInstance0(Native Method)
(36 more lines...)
Collapse Failed VisitTest testStartVisit History
Run UI tests on Travis 23 secs
org.openqa.selenium.TimeoutException: Timed out after 8 seconds waiting for presence of element located by: By.className: active-visit-started-at-message Build info: version: '2.37.0', revision: 'a7c61cbd68657e133ae96672cf995890bad2ee42', time: '2013-10-18 09:51:02' System info: host: 'gw108', ip: '149.165.228.106', os.name: 'Linux', os.arch: 'amd64', os.version: '3.11.0-15-generic', java.version: '1.6.0_30' Driver info: driver.version: unknown
org.openqa.selenium.TimeoutException: Timed out after 8 seconds waiting for presence of element located by: By.className: active-visit-started-at-message
Build info: version: '2.37.0', revision: 'a7c61cbd68657e133ae96672cf995890bad2ee42', time: '2013-10-18 09:51:02'
System info: host: 'gw108', ip: '149.165.228.106', os.name: 'Linux', os.arch: 'amd64', os.version: '3.11.0-15-generic', java.version: '1.6.0_30'
Driver info: driver.version: unknown
	at org.openqa.selenium.support.ui.FluentWait.timeoutException(FluentWait.java:259)
	at org.openqa.selenium.support.ui.FluentWait.until(FluentWait.java:228)
	at org.openmrs.uitestframework.page.AbstractBasePage.findElement(AbstractBasePage.java:51)
(65 more lines...)