Build #1,954

Deploys Reference Application SNAPSHOT to maven

Build: #1954 failed Child of RDD-RDD-567

Stages & jobs

  1. Create Reference Application packages

  2. Deploy to Automated Functional Test Server

  3. Create Standalone and Run UI Tests

  4. Deploy to Manual Test Server

Build result summary

Details

Completed
Duration
8 minutes
Labels
None
Revisions
Distribution
e5b62a161a520fdd022168f74afc77dd856422a5 e5b62a161a520fdd022168f74afc77dd856422a5
Standalone RA
e079223a12d083467bfdf179d69959b8befcecdf e079223a12d083467bfdf179d69959b8befcecdf
Total tests
7
Fixed in
#1967 (Changes by Wyclif Luyima)

Tests

Responsible

No one has taken responsibility for this failure

Configuration changes

Some of the jobs or stages referenced by this result no longer exist.

Restarting failed/incomplete builds only is not possible as some of the affected jobs no longer exist.

Tests

New test failures 6
Status Test View job Duration
Collapse Failed LoginTest verifyClerkModulesAvailableOnHomePage History
Run UI tests on Travis < 1 sec
org.junit.ComparisonFailure: expected:</openmrs/[login.htm]> but was:</openmrs/[referenceapplication/home.page]>
	at org.junit.Assert.assertEquals(Assert.java:115)
	at org.junit.Assert.assertEquals(Assert.java:144)
	at org.openmrs.uitestframework.test.TestBase.assertPage(TestBase.java:310)
	at org.openmrs.reference.LoginTest.verifyClerkModulesAvailableOnHomePage(LoginTest.java:39)
	at sun.reflect.NativeMethodAccessorImpl.invoke0(Native Method)
	at sun.reflect.NativeMethodAccessorImpl.invoke(NativeMethodAccessorImpl.java:57)
	at sun.reflect.DelegatingMethodAccessorImpl.invoke(DelegatingMethodAccessorImpl.java:43)
(32 more lines...)
Collapse Failed LoginTest verifyModulesAvailableOnHomePage History
Run UI tests on Travis < 1 sec
org.junit.ComparisonFailure: expected:</openmrs/[login.htm]> but was:</openmrs/[referenceapplication/home.page]>
	at org.junit.Assert.assertEquals(Assert.java:115)
	at org.junit.Assert.assertEquals(Assert.java:144)
	at org.openmrs.uitestframework.test.TestBase.assertPage(TestBase.java:310)
	at org.openmrs.uitestframework.test.TestBase.login(TestBase.java:116)
	at org.openmrs.reference.LoginTest.verifyModulesAvailableOnHomePage(LoginTest.java:24)
	at sun.reflect.NativeMethodAccessorImpl.invoke0(Native Method)
	at sun.reflect.NativeMethodAccessorImpl.invoke(NativeMethodAccessorImpl.java:57)
(33 more lines...)
Collapse Failed LoginTest verifyNurseModulesAvailableOnHomePage History
Run UI tests on Travis 4 secs
java.lang.AssertionError
	at org.junit.Assert.fail(Assert.java:86)
	at org.junit.Assert.assertTrue(Assert.java:41)
	at org.junit.Assert.assertTrue(Assert.java:52)
	at org.openmrs.reference.LoginTest.verifyNurseModulesAvailableOnHomePage(LoginTest.java:74)
	at sun.reflect.NativeMethodAccessorImpl.invoke0(Native Method)
	at sun.reflect.NativeMethodAccessorImpl.invoke(NativeMethodAccessorImpl.java:57)
	at sun.reflect.DelegatingMethodAccessorImpl.invoke(DelegatingMethodAccessorImpl.java:43)
(32 more lines...)
Collapse Failed LoginTest verifyDoctorModulesAvailableOnHomePage History
Run UI tests on Travis < 1 sec
org.junit.ComparisonFailure: expected:</openmrs/[login.htm]> but was:</openmrs/[referenceapplication/home.page]>
	at org.junit.Assert.assertEquals(Assert.java:115)
	at org.junit.Assert.assertEquals(Assert.java:144)
	at org.openmrs.uitestframework.test.TestBase.assertPage(TestBase.java:310)
	at org.openmrs.reference.LoginTest.verifyDoctorModulesAvailableOnHomePage(LoginTest.java:55)
	at sun.reflect.NativeMethodAccessorImpl.invoke0(Native Method)
	at sun.reflect.NativeMethodAccessorImpl.invoke(NativeMethodAccessorImpl.java:57)
	at sun.reflect.DelegatingMethodAccessorImpl.invoke(DelegatingMethodAccessorImpl.java:43)
(32 more lines...)
Collapse Failed RegistrationAppTest registerAPatient History
Run UI tests on Travis 28 secs
org.openqa.selenium.TimeoutException: Timed out after 8 seconds waiting for visibility of element located by By.className: patient-header Build info: version: '2.37.0', revision: 'a7c61cbd68657e133ae96672cf995890bad2ee42', time: '2013-10-18 09:51:02' System info: host: 'gw108', ip: '149.165.228.106', os.name: 'Linux', os.arch: 'amd64', os.version: '3.11.0-15-generic', java.version: '1.6.0_30' Driver info: driver.version: unknown
org.openqa.selenium.TimeoutException: Timed out after 8 seconds waiting for visibility of element located by By.className: patient-header
Build info: version: '2.37.0', revision: 'a7c61cbd68657e133ae96672cf995890bad2ee42', time: '2013-10-18 09:51:02'
System info: host: 'gw108', ip: '149.165.228.106', os.name: 'Linux', os.arch: 'amd64', os.version: '3.11.0-15-generic', java.version: '1.6.0_30'
Driver info: driver.version: unknown
	at org.openqa.selenium.support.ui.FluentWait.timeoutException(FluentWait.java:259)
	at org.openqa.selenium.support.ui.FluentWait.until(FluentWait.java:228)
	at org.openmrs.uitestframework.page.AbstractBasePage.waitForElement(AbstractBasePage.java:191)
(65 more lines...)
Collapse Failed VisitTest testStartVisit History
Run UI tests on Travis 15 secs
org.openqa.selenium.TimeoutException: Timed out after 8 seconds waiting for presence of element located by: By.id: org.openmrs.module.coreapps.createVisit Build info: version: '2.37.0', revision: 'a7c61cbd68657e133ae96672cf995890bad2ee42', time: '2013-10-18 09:51:02' System info: host: 'gw108', ip: '149.165.228.106', os.name: 'Linux', os.arch: 'amd64', os.version: '3.11.0-15-generic', java.version: '1.6.0_30' Driver info: driver.version: unknown
org.openqa.selenium.TimeoutException: Timed out after 8 seconds waiting for presence of element located by: By.id: org.openmrs.module.coreapps.createVisit
Build info: version: '2.37.0', revision: 'a7c61cbd68657e133ae96672cf995890bad2ee42', time: '2013-10-18 09:51:02'
System info: host: 'gw108', ip: '149.165.228.106', os.name: 'Linux', os.arch: 'amd64', os.version: '3.11.0-15-generic', java.version: '1.6.0_30'
Driver info: driver.version: unknown
	at org.openqa.selenium.support.ui.FluentWait.timeoutException(FluentWait.java:259)
	at org.openqa.selenium.support.ui.FluentWait.until(FluentWait.java:228)
	at org.openmrs.uitestframework.page.AbstractBasePage.findElement(AbstractBasePage.java:51)
(66 more lines...)