Build #1,955

Deploys Reference Application SNAPSHOT to maven

Build: #1955 failed Child of RDD-RDD-568

Stages & jobs

  1. Create Reference Application packages

  2. Deploy to Automated Functional Test Server

  3. Create Standalone and Run UI Tests

  4. Deploy to Manual Test Server

Test results

  • 7 tests in total
  • 6 tests failed
  • 1 minute taken in total.
Existing test failures 6
Status Test Failing since View job Duration
org.junit.ComparisonFailure: expected:</openmrs/[login.htm]> but was:</openmrs/[referenceapplication/home.page]>
	at org.junit.Assert.assertEquals(Assert.java:115)
	at org.junit.Assert.assertEquals(Assert.java:144)
	at org.openmrs.uitestframework.test.TestBase.assertPage(TestBase.java:310)
	at org.openmrs.reference.LoginTest.verifyClerkModulesAvailableOnHomePage(LoginTest.java:39)
	at sun.reflect.NativeMethodAccessorImpl.invoke0(Native Method)
	at sun.reflect.NativeMethodAccessorImpl.invoke(NativeMethodAccessorImpl.java:57)
	at sun.reflect.DelegatingMethodAccessorImpl.invoke(DelegatingMethodAccessorImpl.java:43)
(32 more lines...)
org.junit.ComparisonFailure: expected:</openmrs/[login.htm]> but was:</openmrs/[referenceapplication/home.page]>
	at org.junit.Assert.assertEquals(Assert.java:115)
	at org.junit.Assert.assertEquals(Assert.java:144)
	at org.openmrs.uitestframework.test.TestBase.assertPage(TestBase.java:310)
	at org.openmrs.uitestframework.test.TestBase.login(TestBase.java:116)
	at org.openmrs.reference.LoginTest.verifyModulesAvailableOnHomePage(LoginTest.java:24)
	at sun.reflect.NativeMethodAccessorImpl.invoke0(Native Method)
	at sun.reflect.NativeMethodAccessorImpl.invoke(NativeMethodAccessorImpl.java:57)
(33 more lines...)
java.lang.AssertionError
	at org.junit.Assert.fail(Assert.java:86)
	at org.junit.Assert.assertTrue(Assert.java:41)
	at org.junit.Assert.assertTrue(Assert.java:52)
	at org.openmrs.reference.LoginTest.verifyNurseModulesAvailableOnHomePage(LoginTest.java:74)
	at sun.reflect.NativeMethodAccessorImpl.invoke0(Native Method)
	at sun.reflect.NativeMethodAccessorImpl.invoke(NativeMethodAccessorImpl.java:57)
	at sun.reflect.DelegatingMethodAccessorImpl.invoke(DelegatingMethodAccessorImpl.java:43)
(32 more lines...)
org.junit.ComparisonFailure: expected:</openmrs/[login.htm]> but was:</openmrs/[referenceapplication/home.page]>
	at org.junit.Assert.assertEquals(Assert.java:115)
	at org.junit.Assert.assertEquals(Assert.java:144)
	at org.openmrs.uitestframework.test.TestBase.assertPage(TestBase.java:310)
	at org.openmrs.reference.LoginTest.verifyDoctorModulesAvailableOnHomePage(LoginTest.java:55)
	at sun.reflect.NativeMethodAccessorImpl.invoke0(Native Method)
	at sun.reflect.NativeMethodAccessorImpl.invoke(NativeMethodAccessorImpl.java:57)
	at sun.reflect.DelegatingMethodAccessorImpl.invoke(DelegatingMethodAccessorImpl.java:43)
(32 more lines...)
org.openqa.selenium.TimeoutException: Timed out after 8 seconds waiting for visibility of element located by By.className: patient-header Build info: version: '2.37.0', revision: 'a7c61cbd68657e133ae96672cf995890bad2ee42', time: '2013-10-18 09:51:02' System info: host: 'gw108', ip: '149.165.228.106', os.name: 'Linux', os.arch: 'amd64', os.version: '3.11.0-15-generic', java.version: '1.6.0_30' Driver info: driver.version: unknown
org.openqa.selenium.TimeoutException: Timed out after 8 seconds waiting for visibility of element located by By.className: patient-header
Build info: version: '2.37.0', revision: 'a7c61cbd68657e133ae96672cf995890bad2ee42', time: '2013-10-18 09:51:02'
System info: host: 'gw108', ip: '149.165.228.106', os.name: 'Linux', os.arch: 'amd64', os.version: '3.11.0-15-generic', java.version: '1.6.0_30'
Driver info: driver.version: unknown
	at org.openqa.selenium.support.ui.FluentWait.timeoutException(FluentWait.java:259)
	at org.openqa.selenium.support.ui.FluentWait.until(FluentWait.java:228)
	at org.openmrs.uitestframework.page.AbstractBasePage.waitForElement(AbstractBasePage.java:191)
(65 more lines...)
org.openqa.selenium.TimeoutException: Timed out after 8 seconds waiting for presence of element located by: By.id: org.openmrs.module.coreapps.createVisit Build info: version: '2.37.0', revision: 'a7c61cbd68657e133ae96672cf995890bad2ee42', time: '2013-10-18 09:51:02' System info: host: 'gw108', ip: '149.165.228.106', os.name: 'Linux', os.arch: 'amd64', os.version: '3.11.0-15-generic', java.version: '1.6.0_30' Driver info: driver.version: unknown
org.openqa.selenium.TimeoutException: Timed out after 8 seconds waiting for presence of element located by: By.id: org.openmrs.module.coreapps.createVisit
Build info: version: '2.37.0', revision: 'a7c61cbd68657e133ae96672cf995890bad2ee42', time: '2013-10-18 09:51:02'
System info: host: 'gw108', ip: '149.165.228.106', os.name: 'Linux', os.arch: 'amd64', os.version: '3.11.0-15-generic', java.version: '1.6.0_30'
Driver info: driver.version: unknown
	at org.openqa.selenium.support.ui.FluentWait.timeoutException(FluentWait.java:259)
	at org.openqa.selenium.support.ui.FluentWait.until(FluentWait.java:228)
	at org.openmrs.uitestframework.page.AbstractBasePage.findElement(AbstractBasePage.java:51)
(66 more lines...)