Deploys Reference Application SNAPSHOT to maven

Build: #2932 failed Child of RA-RA-1244

Stages & jobs

  1. Create Reference Application packages

  2. Upload parent pom to maven

  3. Deploy to Automated Functional Test Server

  4. Create Standalone and Run UI Tests

  5. Deploy to Manual Test Server

  6. Release

    Requires a user to start manually
  7. Create Standalone

Build result summary

Details

Completed
Queue duration
2 seconds
Duration
187 minutes
Labels
None
Revisions
Distribution
c98c8658e3a7ecd769656a23f6193e8d0967d0cb c98c8658e3a7ecd769656a23f6193e8d0967d0cb
Standalone RA
ab5a0e94e60123910c177b59b1ee8dc717467623 ab5a0e94e60123910c177b59b1ee8dc717467623
Release scripts
bfe50f219321d47d8ff2aed75038d0eb0dc9e014 bfe50f219321d47d8ff2aed75038d0eb0dc9e014
Total tests
8
Fixed in
#2934 (Child of RA-RA-1245)

Tests

Responsible

No one has taken responsibility for this failure

Configuration changes

Some of the jobs or stages referenced by this result no longer exist.

Restarting failed/incomplete builds only is not possible as some of the affected jobs no longer exist.

Tests

New test failures 2
Status Test View job Duration
Collapse Failed RegistrationAppTest org.openmrs.reference.RegistrationAppTest History
Run UI tests on Travis 22 secs
org.openqa.selenium.WebDriverException: unknown error: Chrome failed to start: crashed   (Driver info: chromedriver=2.8.240825,platform=Linux 3.13.0-40-generic x86_64) (WARNING: The server did not provide any stacktrace information) Command duration or timeout: 22.23 seconds Build info: version: '2.37.0', revision: 'a7c61cbd68657e133ae96672cf995890bad2ee42', time: '2013-10-18 09:51:02' System info: host: 'gw108', ip: '149.165.228.106', os.name: 'Linux', os.arch: 'amd64', os.version: '3.13.0-40-generic', java.version: '1.6.0_33' Driver info: org.openqa.selenium.chrome.ChromeDriver
org.openqa.selenium.WebDriverException: unknown error: Chrome failed to start: crashed
  (Driver info: chromedriver=2.8.240825,platform=Linux 3.13.0-40-generic x86_64) (WARNING: The server did not provide any stacktrace information)
Command duration or timeout: 22.23 seconds
Build info: version: '2.37.0', revision: 'a7c61cbd68657e133ae96672cf995890bad2ee42', time: '2013-10-18 09:51:02'
System info: host: 'gw108', ip: '149.165.228.106', os.name: 'Linux', os.arch: 'amd64', os.version: '3.13.0-40-generic', java.version: '1.6.0_33'
Driver info: org.openqa.selenium.chrome.ChromeDriver
	at sun.reflect.NativeConstructorAccessorImpl.newInstance0(Native Method)
(36 more lines...)
Collapse Failed VisitTest org.openmrs.reference.VisitTest History
Run UI tests on Travis < 1 sec
org.openqa.selenium.remote.UnreachableBrowserException: Could not start a new session. Possible causes are invalid address of the remote server or browser start-up failure. Build info: version: '2.37.0', revision: 'a7c61cbd68657e133ae96672cf995890bad2ee42', time: '2013-10-18 09:51:02' System info: host: 'gw108', ip: '149.165.228.106', os.name: 'Linux', os.arch: 'amd64', os.version: '3.13.0-40-generic', java.version: '1.6.0_33' Driver info: driver.version: ChromeDriver
org.openqa.selenium.remote.UnreachableBrowserException: Could not start a new session. Possible causes are invalid address of the remote server or browser start-up failure.
Build info: version: '2.37.0', revision: 'a7c61cbd68657e133ae96672cf995890bad2ee42', time: '2013-10-18 09:51:02'
System info: host: 'gw108', ip: '149.165.228.106', os.name: 'Linux', os.arch: 'amd64', os.version: '3.13.0-40-generic', java.version: '1.6.0_33'
Driver info: driver.version: ChromeDriver
	at org.openqa.selenium.remote.RemoteWebDriver.execute(RemoteWebDriver.java:548)
	at org.openqa.selenium.remote.RemoteWebDriver.startSession(RemoteWebDriver.java:216)
	at org.openqa.selenium.remote.RemoteWebDriver.<init>(RemoteWebDriver.java:111)
(59 more lines...)