Deploys Reference Application SNAPSHOT to maven

Build: #3072 failed Child of ASU-ASUML-10

Stages & jobs

  1. Create Reference Application packages

  2. Upload parent pom to maven

  3. Deploy to Automated Functional Test Server

  4. Create Standalone and Run UI Tests

  5. Deploy to Manual Test Server

  6. Release

    Requires a user to start manually
  7. Create Standalone

Build result summary

Details

Completed
Queue duration
4 seconds
Duration
11 minutes
Labels
None
Revisions
Distribution
d90e591fa9768cb501f6bb0ba444f7506a108ed9 d90e591fa9768cb501f6bb0ba444f7506a108ed9
Standalone RA
ab5a0e94e60123910c177b59b1ee8dc717467623 ab5a0e94e60123910c177b59b1ee8dc717467623
Release scripts
e9a4608772fb6866768ccaef599cd2b9e5580f0a e9a4608772fb6866768ccaef599cd2b9e5580f0a
Total tests
9
Failing since
#3060 (Rebuilt by Daniel Kayiwa)
Fixed in
#3102 (Manual run by Daniel Kayiwa)

Tests

Responsible

Configuration changes

Some of the jobs or stages referenced by this result no longer exist.

Restarting failed/incomplete builds only is not possible as some of the affected jobs no longer exist.

Tests

New test failures 8
Status Test View job Duration
Collapse Failed CheckModules checkModules History
Run UI tests on Travis 17 secs
org.openqa.selenium.TimeoutException: Timed out after 16 seconds waiting for presence of element located by: By.id: username Build info: version: '2.37.0', revision: 'a7c61cbd68657e133ae96672cf995890bad2ee42', time: '2013-10-18 09:51:02' System info: host: 'gw107', ip: '149.165.228.105', os.name: 'Linux', os.arch: 'amd64', os.version: '3.13.0-40-generic', java.version: '1.6.0_33' Driver info: driver.version: unknown
org.openqa.selenium.TimeoutException: Timed out after 16 seconds waiting for presence of element located by: By.id: username
Build info: version: '2.37.0', revision: 'a7c61cbd68657e133ae96672cf995890bad2ee42', time: '2013-10-18 09:51:02'
System info: host: 'gw107', ip: '149.165.228.105', os.name: 'Linux', os.arch: 'amd64', os.version: '3.13.0-40-generic', java.version: '1.6.0_33'
Driver info: driver.version: unknown
	at org.openqa.selenium.support.ui.FluentWait.timeoutException(FluentWait.java:259)
	at org.openqa.selenium.support.ui.FluentWait.until(FluentWait.java:228)
	at org.openmrs.uitestframework.page.AbstractBasePage.findElement(AbstractBasePage.java:51)
(68 more lines...)
Collapse Failed LoginTest verifyClerkModulesAvailableOnHomePage History
Run UI tests on Travis 34 secs
org.openqa.selenium.TimeoutException: Timed out after 16 seconds waiting for presence of element located by: By.id: username Build info: version: '2.37.0', revision: 'a7c61cbd68657e133ae96672cf995890bad2ee42', time: '2013-10-18 09:51:02' System info: host: 'gw107', ip: '149.165.228.105', os.name: 'Linux', os.arch: 'amd64', os.version: '3.13.0-40-generic', java.version: '1.6.0_33' Driver info: driver.version: unknown
org.openqa.selenium.TimeoutException: Timed out after 16 seconds waiting for presence of element located by: By.id: username
Build info: version: '2.37.0', revision: 'a7c61cbd68657e133ae96672cf995890bad2ee42', time: '2013-10-18 09:51:02'
System info: host: 'gw107', ip: '149.165.228.105', os.name: 'Linux', os.arch: 'amd64', os.version: '3.13.0-40-generic', java.version: '1.6.0_33'
Driver info: driver.version: unknown
	at org.openqa.selenium.support.ui.FluentWait.timeoutException(FluentWait.java:259)
	at org.openqa.selenium.support.ui.FluentWait.until(FluentWait.java:228)
	at org.openmrs.uitestframework.page.AbstractBasePage.findElement(AbstractBasePage.java:51)
(67 more lines...)
Collapse Failed LoginTest verifyModulesAvailableOnHomePage History
Run UI tests on Travis 34 secs
org.openqa.selenium.TimeoutException: Timed out after 16 seconds waiting for presence of element located by: By.id: username Build info: version: '2.37.0', revision: 'a7c61cbd68657e133ae96672cf995890bad2ee42', time: '2013-10-18 09:51:02' System info: host: 'gw107', ip: '149.165.228.105', os.name: 'Linux', os.arch: 'amd64', os.version: '3.13.0-40-generic', java.version: '1.6.0_33' Driver info: driver.version: unknown
org.openqa.selenium.TimeoutException: Timed out after 16 seconds waiting for presence of element located by: By.id: username
Build info: version: '2.37.0', revision: 'a7c61cbd68657e133ae96672cf995890bad2ee42', time: '2013-10-18 09:51:02'
System info: host: 'gw107', ip: '149.165.228.105', os.name: 'Linux', os.arch: 'amd64', os.version: '3.13.0-40-generic', java.version: '1.6.0_33'
Driver info: driver.version: unknown
	at org.openqa.selenium.support.ui.FluentWait.timeoutException(FluentWait.java:259)
	at org.openqa.selenium.support.ui.FluentWait.until(FluentWait.java:228)
	at org.openmrs.uitestframework.page.AbstractBasePage.findElement(AbstractBasePage.java:51)
(68 more lines...)
Collapse Failed LoginTest verifySysadminModulesAvailableOnHomePage History
Run UI tests on Travis 34 secs
org.openqa.selenium.TimeoutException: Timed out after 16 seconds waiting for presence of element located by: By.id: username Build info: version: '2.37.0', revision: 'a7c61cbd68657e133ae96672cf995890bad2ee42', time: '2013-10-18 09:51:02' System info: host: 'gw107', ip: '149.165.228.105', os.name: 'Linux', os.arch: 'amd64', os.version: '3.13.0-40-generic', java.version: '1.6.0_33' Driver info: driver.version: unknown
org.openqa.selenium.TimeoutException: Timed out after 16 seconds waiting for presence of element located by: By.id: username
Build info: version: '2.37.0', revision: 'a7c61cbd68657e133ae96672cf995890bad2ee42', time: '2013-10-18 09:51:02'
System info: host: 'gw107', ip: '149.165.228.105', os.name: 'Linux', os.arch: 'amd64', os.version: '3.13.0-40-generic', java.version: '1.6.0_33'
Driver info: driver.version: unknown
	at org.openqa.selenium.support.ui.FluentWait.timeoutException(FluentWait.java:259)
	at org.openqa.selenium.support.ui.FluentWait.until(FluentWait.java:228)
	at org.openmrs.uitestframework.page.AbstractBasePage.findElement(AbstractBasePage.java:51)
(67 more lines...)
Collapse Failed LoginTest verifyNurseModulesAvailableOnHomePage History
Run UI tests on Travis 34 secs
org.openqa.selenium.TimeoutException: Timed out after 16 seconds waiting for presence of element located by: By.id: username Build info: version: '2.37.0', revision: 'a7c61cbd68657e133ae96672cf995890bad2ee42', time: '2013-10-18 09:51:02' System info: host: 'gw107', ip: '149.165.228.105', os.name: 'Linux', os.arch: 'amd64', os.version: '3.13.0-40-generic', java.version: '1.6.0_33' Driver info: driver.version: unknown
org.openqa.selenium.TimeoutException: Timed out after 16 seconds waiting for presence of element located by: By.id: username
Build info: version: '2.37.0', revision: 'a7c61cbd68657e133ae96672cf995890bad2ee42', time: '2013-10-18 09:51:02'
System info: host: 'gw107', ip: '149.165.228.105', os.name: 'Linux', os.arch: 'amd64', os.version: '3.13.0-40-generic', java.version: '1.6.0_33'
Driver info: driver.version: unknown
	at org.openqa.selenium.support.ui.FluentWait.timeoutException(FluentWait.java:259)
	at org.openqa.selenium.support.ui.FluentWait.until(FluentWait.java:228)
	at org.openmrs.uitestframework.page.AbstractBasePage.findElement(AbstractBasePage.java:51)
(68 more lines...)
Collapse Failed LoginTest verifyDoctorModulesAvailableOnHomePage History
Run UI tests on Travis 34 secs
org.openqa.selenium.TimeoutException: Timed out after 16 seconds waiting for presence of element located by: By.id: username Build info: version: '2.37.0', revision: 'a7c61cbd68657e133ae96672cf995890bad2ee42', time: '2013-10-18 09:51:02' System info: host: 'gw107', ip: '149.165.228.105', os.name: 'Linux', os.arch: 'amd64', os.version: '3.13.0-40-generic', java.version: '1.6.0_33' Driver info: driver.version: unknown
org.openqa.selenium.TimeoutException: Timed out after 16 seconds waiting for presence of element located by: By.id: username
Build info: version: '2.37.0', revision: 'a7c61cbd68657e133ae96672cf995890bad2ee42', time: '2013-10-18 09:51:02'
System info: host: 'gw107', ip: '149.165.228.105', os.name: 'Linux', os.arch: 'amd64', os.version: '3.13.0-40-generic', java.version: '1.6.0_33'
Driver info: driver.version: unknown
	at org.openqa.selenium.support.ui.FluentWait.timeoutException(FluentWait.java:259)
	at org.openqa.selenium.support.ui.FluentWait.until(FluentWait.java:228)
	at org.openmrs.uitestframework.page.AbstractBasePage.findElement(AbstractBasePage.java:51)
(66 more lines...)
Collapse Failed RegistrationAppTest registerUnidentifiedPatient History
Run UI tests on Travis 40 secs
org.openqa.selenium.TimeoutException: Timed out after 16 seconds waiting for presence of element located by: By.className: logo Build info: version: '2.37.0', revision: 'a7c61cbd68657e133ae96672cf995890bad2ee42', time: '2013-10-18 09:51:02' System info: host: 'gw107', ip: '149.165.228.105', os.name: 'Linux', os.arch: 'amd64', os.version: '3.13.0-40-generic', java.version: '1.6.0_33' Driver info: driver.version: unknown
org.openqa.selenium.TimeoutException: Timed out after 16 seconds waiting for presence of element located by: By.className: logo
Build info: version: '2.37.0', revision: 'a7c61cbd68657e133ae96672cf995890bad2ee42', time: '2013-10-18 09:51:02'
System info: host: 'gw107', ip: '149.165.228.105', os.name: 'Linux', os.arch: 'amd64', os.version: '3.13.0-40-generic', java.version: '1.6.0_33'
Driver info: driver.version: unknown
	at org.openqa.selenium.support.ui.FluentWait.timeoutException(FluentWait.java:259)
	at org.openqa.selenium.support.ui.FluentWait.until(FluentWait.java:228)
	at org.openmrs.uitestframework.page.AbstractBasePage.findElement(AbstractBasePage.java:51)
(64 more lines...)
Collapse Failed RegistrationAppTest registerAPatient History
Run UI tests on Travis 40 secs
org.openqa.selenium.TimeoutException: Timed out after 16 seconds waiting for presence of element located by: By.className: logo Build info: version: '2.37.0', revision: 'a7c61cbd68657e133ae96672cf995890bad2ee42', time: '2013-10-18 09:51:02' System info: host: 'gw107', ip: '149.165.228.105', os.name: 'Linux', os.arch: 'amd64', os.version: '3.13.0-40-generic', java.version: '1.6.0_33' Driver info: driver.version: unknown
org.openqa.selenium.TimeoutException: Timed out after 16 seconds waiting for presence of element located by: By.className: logo
Build info: version: '2.37.0', revision: 'a7c61cbd68657e133ae96672cf995890bad2ee42', time: '2013-10-18 09:51:02'
System info: host: 'gw107', ip: '149.165.228.105', os.name: 'Linux', os.arch: 'amd64', os.version: '3.13.0-40-generic', java.version: '1.6.0_33'
Driver info: driver.version: unknown
	at org.openqa.selenium.support.ui.FluentWait.timeoutException(FluentWait.java:259)
	at org.openqa.selenium.support.ui.FluentWait.until(FluentWait.java:228)
	at org.openmrs.uitestframework.page.AbstractBasePage.findElement(AbstractBasePage.java:51)
(64 more lines...)