Deploys Reference Application SNAPSHOT to maven
Build: #3509 failed Child of REGAPP-REGAPP-2153
Test results
- 11 tests in total
- 5 tests failed
- 1 failure is new
- 2 minutes taken in total.
Status | Test | View job | Duration | |
---|---|---|---|---|
Collapse |
DuplicatePatientRegisterTest
DuplicateRegisterTest
|
Run UI tests on Travis | 19 secs | |
org.openqa.selenium.ElementNotVisibleException: element not visible (Session info: chrome=43.0.2357.81) (Driver info: chromedriver=2.14.313457 (3d645c400edf2e2c500566c9aa096063e707c9cf),platform=Linux 3.13.0-45-generic x86_64) (WARNING: The server did not provide any stacktrace information) Command duration or timeout: 26 milliseconds Build info: version: '2.37.0', revision: 'a7c61cbd68657e133ae96672cf995890bad2ee42', time: '2013-10-18 09:51:02' System info: host: 'gw107', ip: '149.165.228.105', os.name: 'Linux', os.arch: 'amd64', os.version: '3.13.0-45-generic', java.version: '1.7.0_79' Session ID: 243b7526ada3e326b1768daa3217669a Driver info: org.openqa.selenium.chrome.ChromeDriver Capabilities [{platform=LINUX, acceptSslCerts=true, javascriptEnabled=true, browserName=chrome, chrome={userDataDir=/tmp/.com.google.Chrome.UWSgSq}, rotatable=false, locationContextEnabled=true, mobileEmulationEnabled=false, version=43.0.2357.81, takesHeapSnapshot=true, cssSelectorsEnabled=true, databaseEnabled=false, handlesAlerts=true, browserConnectionEnabled=false, webStorageEnabled=true, nativeEvents=true, applicationCacheEnabled=false, takesScreenshot=true}] org.openqa.selenium.ElementNotVisibleException: element not visible (Session info: chrome=43.0.2357.81) (Driver info: chromedriver=2.14.313457 (3d645c400edf2e2c500566c9aa096063e707c9cf),platform=Linux 3.13.0-45-generic x86_64) (WARNING: The server did not provide any stacktrace information) Command duration or timeout: 26 milliseconds Build info: version: '2.37.0', revision: 'a7c61cbd68657e133ae96672cf995890bad2ee42', time: '2013-10-18 09:51:02' System info: host: 'gw107', ip: '149.165.228.105', os.name: 'Linux', os.arch: 'amd64', os.version: '3.13.0-45-generic', java.version: '1.7.0_79' Session ID: 243b7526ada3e326b1768daa3217669a (50 more lines...) |
Status | Test | Failing since | View job | Duration | |
---|---|---|---|---|---|
CaptureVitalsTest
captureVital
|
Failing since build #3496 (Changes by Tomasz Mueller <tmueller@soldevelo.com>) | Run UI tests on Travis | 53 secs | ||
org.dbunit.DatabaseUnitException: Exception processing table name='visit' at org.dbunit.operation.AbstractBatchOperation.execute(AbstractBatchOperation.java:216) at org.dbunit.AbstractDatabaseTester.executeOperation(AbstractDatabaseTester.java:190) at org.dbunit.AbstractDatabaseTester.onTearDown(AbstractDatabaseTester.java:109) at org.openmrs.uitestframework.test.TestBase.dbUnitTearDownStatic(TestBase.java:197) at org.openmrs.uitestframework.test.TestBase.dbUnitTearDown(TestBase.java:180) at org.openmrs.uitestframework.test.TestBase.deletePatient(TestBase.java:394) at org.openmrs.uitestframework.test.TestBase.deletePatient(TestBase.java:360) (54 more lines...) |
|||||
RegistrationAppTest
registerUnidentifiedPatient
|
Failing since build #3506 (Code changes detected) | Run UI tests on Travis | < 1 sec | ||
org.junit.ComparisonFailure: expected:</openmrs/[login.htm]> but was:</openmrs/[referenceapplication/home.page]> at org.junit.Assert.assertEquals(Assert.java:115) at org.junit.Assert.assertEquals(Assert.java:144) at org.openmrs.uitestframework.test.TestBase.assertPage(TestBase.java:321) at org.openmrs.reference.RegistrationAppTest.setUp(RegistrationAppTest.java:33) at sun.reflect.NativeMethodAccessorImpl.invoke0(Native Method) at sun.reflect.NativeMethodAccessorImpl.invoke(NativeMethodAccessorImpl.java:57) at sun.reflect.DelegatingMethodAccessorImpl.invoke(DelegatingMethodAccessorImpl.java:43) (32 more lines...) |
|||||
RegistrationAppTest
registerAPatient
|
Failing since build #3506 (Code changes detected) | Run UI tests on Travis | 42 secs | ||
org.openqa.selenium.TimeoutException: Timed out after 30 seconds waiting for presence of element located by: By.xpath: //div[@id='confirmation']//li[1]/strong Build info: version: '2.37.0', revision: 'a7c61cbd68657e133ae96672cf995890bad2ee42', time: '2013-10-18 09:51:02' System info: host: 'gw107', ip: '149.165.228.105', os.name: 'Linux', os.arch: 'amd64', os.version: '3.13.0-45-generic', java.version: '1.7.0_79' Driver info: driver.version: unknown org.openqa.selenium.TimeoutException: Timed out after 30 seconds waiting for presence of element located by: By.xpath: //div[@id='confirmation']//li[1]/strong Build info: version: '2.37.0', revision: 'a7c61cbd68657e133ae96672cf995890bad2ee42', time: '2013-10-18 09:51:02' System info: host: 'gw107', ip: '149.165.228.105', os.name: 'Linux', os.arch: 'amd64', os.version: '3.13.0-45-generic', java.version: '1.7.0_79' Driver info: driver.version: unknown at org.openqa.selenium.support.ui.FluentWait.timeoutException(FluentWait.java:259) at org.openqa.selenium.support.ui.FluentWait.until(FluentWait.java:228) at org.openmrs.uitestframework.page.AbstractBasePage.findElement(AbstractBasePage.java:51) (65 more lines...) |
|||||
VisitTest
testStartVisit
|
Failing since build #3507 (Code changes detected) | Run UI tests on Travis | 12 secs | ||
org.dbunit.database.AmbiguousTableNameException: OBS at org.dbunit.dataset.OrderedTableNameMap.add(OrderedTableNameMap.java:198) at org.dbunit.database.QueryDataSet.addTable(QueryDataSet.java:93) at org.openmrs.uitestframework.test.TestBase.deletePatient(TestBase.java:378) at org.openmrs.uitestframework.test.TestBase.deletePatient(TestBase.java:360) at org.openmrs.reference.VisitTest.tearDown(VisitTest.java:35) at sun.reflect.NativeMethodAccessorImpl.invoke0(Native Method) at sun.reflect.NativeMethodAccessorImpl.invoke(NativeMethodAccessorImpl.java:57) (32 more lines...) |