Build #3,525

Deploys Reference Application SNAPSHOT to maven

Stages & jobs

  1. Create Reference Application packages

  2. Upload parent pom to maven

  3. Deploy to Automated Functional Test Server

  4. Run UI Tests

  5. Deploy to Manual Test Server

  6. Release

    Requires a user to start manually
  7. Create Standalone

Build result summary

Details

Completed
Duration
12 minutes
Labels
None
Revisions
Distribution
6476166da3f933359b40d8076d266d1f547c5dc3 6476166da3f933359b40d8076d266d1f547c5dc3
Standalone RA
2cc1eedc8952f87a71cc34e7c976f30d82d62c32 2cc1eedc8952f87a71cc34e7c976f30d82d62c32
Release scripts
fd5310f196074c1101fc7f1e2349005e2f083d72 fd5310f196074c1101fc7f1e2349005e2f083d72
Total tests
14
Failing since
#3523 (Changes by Natalia Plonka <nplonka@soldevelo.com> and tomaszmueller <tmueller@soldevelo.com>)
Fixed in
#3526 (Changes by Tomasz Mueller <tmueller@soldevelo.com>)

Tests

Responsible

This build has been failing since #3523
No one has taken responsibility

Code commits

Distribution
Author Commit Message Commit date
Tomasz Mueller <tmueller@soldevelo.com> Tomasz Mueller <tmueller@soldevelo.com> 6476166da3f933359b40d8076d266d1f547c5dc3 6476166da3f933359b40d8076d266d1f547c5dc3 RA-720 build fail fix

Configuration changes

Some of the jobs or stages referenced by this result no longer exist.

Restarting failed/incomplete builds only is not possible as some of the affected jobs no longer exist.

Tests

New test failures 2
Status Test View job Duration
Collapse Failed DuplicatePatientRegisterTest DuplicateRegisterTest History
Run UI tests on Travis 14 secs
org.openqa.selenium.WebDriverException: unknown error: Element is not clickable at point (88, 268). Other element would receive the click: <span>...</span>   (Session info: chrome=43.0.2357.81)   (Driver info: chromedriver=2.14.313457 (3d645c400edf2e2c500566c9aa096063e707c9cf),platform=Linux 3.13.0-45-generic x86_64) (WARNING: The server did not provide any stacktrace information) Command duration or timeout: 65 milliseconds Build info: version: '2.37.0', revision: 'a7c61cbd68657e133ae96672cf995890bad2ee42', time: '2013-10-18 09:51:02' System info: host: 'gw107', ip: '149.165.228.105', os.name: 'Linux', os.arch: 'amd64', os.version: '3.13.0-45-generic', java.version: '1.7.0_79' Session ID: 6751d0f4a10609494cb305ceccfbba43 Driver info: org.openqa.selenium.chrome.ChromeDriver Capabilities [{platform=LINUX, acceptSslCerts=true, javascriptEnabled=true, browserName=chrome, chrome={userDataDir=/tmp/.com.google.Chrome.ETfnny}, rotatable=false, locationContextEnabled=true, mobileEmulationEnabled=false, version=43.0.2357.81, takesHeapSnapshot=true, cssSelectorsEnabled=true, databaseEnabled=false, handlesAlerts=true, browserConnectionEnabled=false, webStorageEnabled=true, nativeEvents=true, applicationCacheEnabled=false, takesScreenshot=true}]
org.openqa.selenium.WebDriverException: unknown error: Element is not clickable at point (88, 268). Other element would receive the click: <span>...</span>
  (Session info: chrome=43.0.2357.81)
  (Driver info: chromedriver=2.14.313457 (3d645c400edf2e2c500566c9aa096063e707c9cf),platform=Linux 3.13.0-45-generic x86_64) (WARNING: The server did not provide any stacktrace information)
Command duration or timeout: 65 milliseconds
Build info: version: '2.37.0', revision: 'a7c61cbd68657e133ae96672cf995890bad2ee42', time: '2013-10-18 09:51:02'
System info: host: 'gw107', ip: '149.165.228.105', os.name: 'Linux', os.arch: 'amd64', os.version: '3.13.0-45-generic', java.version: '1.7.0_79'
Session ID: 6751d0f4a10609494cb305ceccfbba43
(52 more lines...)
Collapse Failed VisitNoteTest testAddVisitNote History
Run UI tests on Travis 1 min
org.openqa.selenium.NoSuchElementException: no such element   (Session info: chrome=43.0.2357.81)   (Driver info: chromedriver=2.14.313457 (3d645c400edf2e2c500566c9aa096063e707c9cf),platform=Linux 3.13.0-45-generic x86_64) (WARNING: The server did not provide any stacktrace information) Command duration or timeout: 2.92 seconds For documentation on this error, please visit: http://seleniumhq.org/exceptions/no_such_element.html Build info: version: '2.37.0', revision: 'a7c61cbd68657e133ae96672cf995890bad2ee42', time: '2013-10-18 09:51:02' System info: host: 'gw107', ip: '149.165.228.105', os.name: 'Linux', os.arch: 'amd64', os.version: '3.13.0-45-generic', java.version: '1.7.0_79' Session ID: 8483a09ce86eba9863445a31ba8288dc Driver info: org.openqa.selenium.chrome.ChromeDriver Capabilities [{platform=LINUX, acceptSslCerts=true, javascriptEnabled=true, browserName=chrome, chrome={userDataDir=/tmp/.com.google.Chrome.mcYl9R}, rotatable=false, locationContextEnabled=true, mobileEmulationEnabled=false, version=43.0.2357.81, takesHeapSnapshot=true, cssSelectorsEnabled=true, databaseEnabled=false, handlesAlerts=true, browserConnectionEnabled=false, webStorageEnabled=true, nativeEvents=true, applicationCacheEnabled=false, takesScreenshot=true}]
org.openqa.selenium.NoSuchElementException: no such element
  (Session info: chrome=43.0.2357.81)
  (Driver info: chromedriver=2.14.313457 (3d645c400edf2e2c500566c9aa096063e707c9cf),platform=Linux 3.13.0-45-generic x86_64) (WARNING: The server did not provide any stacktrace information)
Command duration or timeout: 2.92 seconds
For documentation on this error, please visit: http://seleniumhq.org/exceptions/no_such_element.html
Build info: version: '2.37.0', revision: 'a7c61cbd68657e133ae96672cf995890bad2ee42', time: '2013-10-18 09:51:02'
System info: host: 'gw107', ip: '149.165.228.105', os.name: 'Linux', os.arch: 'amd64', os.version: '3.13.0-45-generic', java.version: '1.7.0_79'
(51 more lines...)
Fixed tests 1
Status Test Failing since View job Duration
Successful CaptureVitalsTest captureVital History
Failing since build #3523 (Changes by Natalia Plonka <nplonka@soldevelo.com> and tomaszmueller <tmueller@soldevelo.com>) Run UI tests on Travis 47 secs

Jira issues

IssueDescriptionStatus
Unknown Issue TypeRA-720Could not obtain issue details from Jira