Build #3,563

Deploys Reference Application SNAPSHOT to maven

Stages & jobs

  1. Create Reference Application packages

  2. Upload parent pom to maven

  3. Deploy to Automated Functional Test Server

  4. Run UI Tests

  5. Deploy to Manual Test Server

  6. Release

    Requires a user to start manually
  7. Create Standalone

Logs

The following logs have been generated by the jobs in this plan.
  • Expand all
  • Collapse all
Job Logs
Collapse Deploy Reference Application Create Reference Application packages Download or View
08-Jul-2015 07:57:09 [INFO] BUILD FAILURE
08-Jul-2015 07:57:09 [INFO] ------------------------------------------------------------------------
08-Jul-2015 07:57:09 [INFO] Total time: 34.257 s
08-Jul-2015 07:57:09 [INFO] Finished at: 2015-07-08T07:57:09+00:00
08-Jul-2015 07:57:09 [INFO] Final Memory: 28M/164M
08-Jul-2015 07:57:09 [INFO] ------------------------------------------------------------------------
08-Jul-2015 07:57:09 [ERROR] Failed to execute goal org.apache.maven.plugins:maven-compiler-plugin:3.1:testCompile (default-testCompile) on project referenceapplication-ui-tests: Compilation failure: Compilation failure:
08-Jul-2015 07:57:09 [ERROR] /home/bamboo-agent-2/bamboo-agent/xml-data/build-dir/REFAPP-OMODDISTRO-JOB1/ui-tests/src/test/java/org/openmrs/reference/RecentlyPatientTest.java:[35,17] cannot find symbol
08-Jul-2015 07:57:09 [ERROR] symbol:   method clickOnFindPatientRecord()
08-Jul-2015 07:57:09 [ERROR] location: variable homePage of type org.openmrs.reference.page.HomePage
08-Jul-2015 07:57:09 [ERROR] /home/bamboo-agent-2/bamboo-agent/xml-data/build-dir/REFAPP-OMODDISTRO-JOB1/ui-tests/src/test/java/org/openmrs/reference/RecentlyPatientTest.java:[38,17] cannot find symbol
08-Jul-2015 07:57:09 [ERROR] symbol:   method clickOnFindPatientRecord()
08-Jul-2015 07:57:09 [ERROR] location: variable homePage of type org.openmrs.reference.page.HomePage
08-Jul-2015 07:57:09 [ERROR] -> [Help 1]
08-Jul-2015 07:57:09 [ERROR]
08-Jul-2015 07:57:09 [ERROR] To see the full stack trace of the errors, re-run Maven with the -e switch.
08-Jul-2015 07:57:09 [ERROR] Re-run Maven using the -X switch to enable full debug logging.
08-Jul-2015 07:57:09 [ERROR]
08-Jul-2015 07:57:09 [ERROR] For more information about the errors and possible solutions, please read the following articles:
08-Jul-2015 07:57:09 [ERROR] [Help 1] http://cwiki.apache.org/confluence/display/MAVEN/MojoFailureException
08-Jul-2015 07:57:09 [ERROR]
08-Jul-2015 07:57:09 [ERROR] After correcting the problems, you can resume the build with the command
08-Jul-2015 07:57:09 [ERROR]   mvn <goals> -rf :referenceapplication-ui-tests
08-Jul-2015 07:57:09 Unable to publish artifact [openmrs-2.x-deb]: null
08-Jul-2015 07:57:09 The artifact is required for down stream Stages and Jobs, build will now fail.