Build #7,076

Deploys Reference Application SNAPSHOT to maven

Build: #7076 failed Manual run from the stage: Release by tendo kiiza Martyn

Stages & jobs

  1. Deploy Reference Application

  2. Deploy docker image

  3. Deploy to qa-refapp

  4. Validate

  5. Release

    Requires a user to start manually
  6. Release to dockerhub

  7. Release others

Logs

The following logs have been generated by the jobs in this plan.
  • Expand all
  • Collapse all
Job Logs
Collapse Release to maven Release Download or View
11-Dec-2017 14:53:55 [INFO] Reactor Summary:
11-Dec-2017 14:53:55 [INFO]
11-Dec-2017 14:53:55 [INFO] Reference Application Distribution ................. FAILURE [  7.666 s]
11-Dec-2017 14:53:55 [INFO] Reference Application Distribution Package ......... SKIPPED
11-Dec-2017 14:53:55 [INFO] Reference Application Distribution UI Tests ........ SKIPPED
11-Dec-2017 14:53:55 [INFO] ------------------------------------------------------------------------
11-Dec-2017 14:53:55 [INFO] BUILD FAILURE
11-Dec-2017 14:53:55 [INFO] ------------------------------------------------------------------------
11-Dec-2017 14:53:55 [INFO] Total time: 7.860 s
11-Dec-2017 14:53:55 [INFO] Finished at: 2017-12-11T14:53:55+00:00
11-Dec-2017 14:53:55 [INFO] Final Memory: 14M/175M
11-Dec-2017 14:53:55 [INFO] ------------------------------------------------------------------------
11-Dec-2017 14:53:55 [ERROR] Failed to execute goal org.apache.maven.plugins:maven-release-plugin:2.5.1:perform (default-cli) on project referenceapplication: Maven execution failed, exit code: '1' -> [Help 1]
11-Dec-2017 14:53:55 [ERROR]
11-Dec-2017 14:53:55 [ERROR] To see the full stack trace of the errors, re-run Maven with the -e switch.
11-Dec-2017 14:53:55 [ERROR] Re-run Maven using the -X switch to enable full debug logging.
11-Dec-2017 14:53:55 [ERROR]
11-Dec-2017 14:53:55 [ERROR] For more information about the errors and possible solutions, please read the following articles:
11-Dec-2017 14:53:55 [ERROR] [Help 1] http://cwiki.apache.org/confluence/display/MAVEN/MojoExecutionException
11-Dec-2017 14:53:55 [ERROR] mvn release:perform failed. Fix the problem and try another release number.
11-Dec-2017 14:53:55 Unable to publish artifact [referenceapplication-modules]: the source directory /home/bamboo-agent/bamboo-agent/xml-data/build-dir/REFAPP-OMODDISTRO-RTM/target/checkout/package/target does not exist.
11-Dec-2017 14:53:55 Unable to publish artifact [ referenceapplication-war]: the source directory /home/bamboo-agent/bamboo-agent/xml-data/build-dir/REFAPP-OMODDISTRO-RTM/target/checkout/package/target/bundled-distro/web does not exist.
11-Dec-2017 14:53:55 Unable to publish artifact [ referenceapplication-properties]: the source directory /home/bamboo-agent/bamboo-agent/xml-data/build-dir/REFAPP-OMODDISTRO-RTM/target/checkout/package/target/distro/web does not exist.
11-Dec-2017 14:53:55 Unable to publish artifact [referenceapplication-docker]: the source directory /home/bamboo-agent/bamboo-agent/xml-data/build-dir/REFAPP-OMODDISTRO-RTM/target/checkout/package/target/bundled-distro/web does not exist.
11-Dec-2017 14:53:55 The artifact is required for down stream Stages and Jobs, build will now fail.