Build #7,090

Deploys Reference Application SNAPSHOT to maven

Build: #7090 did not complete Rebuilt by Rafal Korytkowski

Stages & jobs

  1. Deploy Reference Application

  2. Deploy docker image

  3. Deploy to qa-refapp

  4. Validate

  5. Release

    Requires a user to start manually
  6. Release to dockerhub

  7. Release others

Logs

The following logs have been generated by the jobs in this plan.
  • Expand all
  • Collapse all
Job Logs
Collapse Release to maven Release Download or View
15-Dec-2017 15:08:10 Downloading OWAs...
15-Dec-2017 15:08:10
15-Dec-2017 15:08:11 [INFO] ------------------------------------------------------------------------
15-Dec-2017 15:08:11 [INFO] Reactor Summary:
15-Dec-2017 15:08:11 [INFO]
15-Dec-2017 15:08:11 [INFO] Reference Application Distribution ................. SUCCESS [  3.197 s]
15-Dec-2017 15:08:11 [INFO] Reference Application Distribution Package ......... FAILURE [  9.020 s]
15-Dec-2017 15:08:11 [INFO] Reference Application Distribution UI Tests ........ SKIPPED
15-Dec-2017 15:08:11 [INFO] ------------------------------------------------------------------------
15-Dec-2017 15:08:11 [INFO] BUILD FAILURE
15-Dec-2017 15:08:11 [INFO] ------------------------------------------------------------------------
15-Dec-2017 15:08:11 [INFO] Total time: 12.363 s
15-Dec-2017 15:08:11 [INFO] Finished at: 2017-12-15T15:08:11+00:00
15-Dec-2017 15:08:12 [INFO] Final Memory: 29M/181M
15-Dec-2017 15:08:12 [INFO] ------------------------------------------------------------------------
15-Dec-2017 15:08:12 [ERROR] Failed to execute goal org.openmrs.maven.plugins:openmrs-sdk-maven-plugin:3.12.0:build-distro (build-distro) on project referenceapplication-package: Execution build-distro of goal org.openmrs.maven.plugins:openmrs-sdk-maven-plugin:3.12.0:build-distro failed: Cannot overwrite file: SystemAdministration-1.0.1.zip -> [Help 1]
15-Dec-2017 15:08:12 [ERROR]
15-Dec-2017 15:08:12 [ERROR] To see the full stack trace of the errors, re-run Maven with the -e switch.
15-Dec-2017 15:08:12 [ERROR] Re-run Maven using the -X switch to enable full debug logging.
15-Dec-2017 15:08:12 [ERROR]
15-Dec-2017 15:08:12 [ERROR] For more information about the errors and possible solutions, please read the following articles:
15-Dec-2017 15:08:12 [ERROR] [Help 1] http://cwiki.apache.org/confluence/display/MAVEN/PluginExecutionException
15-Dec-2017 15:08:12 [ERROR]
15-Dec-2017 15:08:12 [ERROR] After correcting the problems, you can resume the build with the command
15-Dec-2017 15:08:12 [ERROR]   mvn <goals> -rf :referenceapplication-package