Build #1,950

Deploys Reference Application SNAPSHOT to maven

Build: #1950 failed

Job: Run UI tests on Travis failed

Stages & jobs

  1. Create Reference Application packages

  2. Deploy to Automated Functional Test Server

  3. Create Standalone and Run UI Tests

  4. Deploy to Manual Test Server

Build log

The build generated 210 lines of output. Download or view full build log

23-Apr-2014 16:33:21 Build Reference Application - Distribution - Run UI Tests #1950 (REFAPP-OMODDISTRO-INTTESTS-1950) started building on agent gw108.iu.xsede.org (2)
23-Apr-2014 16:33:21 Build working directory is /opt/bamboo-agent/agent2-home/xml-data/build-dir/REFAPP-OMODDISTRO-INTTESTS
23-Apr-2014 16:33:21 Executing build Reference Application - Distribution - Run UI Tests #1950 (REFAPP-OMODDISTRO-INTTESTS-1950)
23-Apr-2014 16:33:21 Starting task 'Git' of type 'com.atlassian.bamboo.plugins.vcs:task.vcs.checkout'
23-Apr-2014 16:33:21 Build always requires a clean checkout
23-Apr-2014 16:33:21 Cleaning build directory '/opt/bamboo-agent/agent2-home/xml-data/build-dir/REFAPP-OMODDISTRO-INTTESTS'
23-Apr-2014 16:33:21 Updating source code to revision: e5b62a161a520fdd022168f74afc77dd856422a5
23-Apr-2014 16:33:21 Creating local git repository in '/opt/bamboo-agent/agent2-home/xml-data/build-dir/REFAPP-OMODDISTRO-INTTESTS/.git'.
23-Apr-2014 16:33:21 Initialized empty Git repository in /opt/bamboo-agent/agent2-home/xml-data/build-dir/REFAPP-OMODDISTRO-INTTESTS/.git/
23-Apr-2014 16:33:21 Fetching 'refs/heads/master' from 'git://github.com/openmrs/openmrs-distro-referenceapplication.git'. Will try to do a shallow fetch.
23-Apr-2014 16:33:22 From git://github.com/openmrs/openmrs-distro-referenceapplication
23-Apr-2014 16:33:22 * [new branch]      master     -> master
23-Apr-2014 16:33:22 Checking out revision e5b62a161a520fdd022168f74afc77dd856422a5.
23-Apr-2014 16:33:22 Already on 'master'
23-Apr-2014 16:33:22 Updated source code to revision: e5b62a161a520fdd022168f74afc77dd856422a5
23-Apr-2014 16:33:22 Finished task 'Git'
23-Apr-2014 16:33:22 Running pre-build action: VCS Version Collector
23-Apr-2014 16:33:22 Running pre-build action: Clover Grails PreBuild Action
23-Apr-2014 16:33:22 Starting task 'Clear out Tomcat Logs' of type 'com.atlassian.bamboo.plugins.scripttask:task.builder.command'
23-Apr-2014 16:33:22
Beginning to execute external process for build 'Reference Application - Distribution - Run UI Tests #1950 (REFAPP-OMODDISTRO-INTTESTS-1950)'
... running command line:
/bin/bash tomcatLogCollector.sh cleanTomcatLog
... in: /opt/bamboo-agent/agent2-home/xml-data/build-dir/REFAPP-OMODDISTRO-INTTESTS/utility-scripts
... using extra environment variables:
bamboo_checkVersions=versions:update-properties -Pupdate-to-latest
bamboo_mavenBuildGoals=clean install
bamboo_jdbc_password=********
bamboo_MAJORRELEASE=2.0
bamboo_githubSshKey=/home/bamboo/bamboo-github-key/id_rsa
bamboo_DISPLAY=:99
23-Apr-2014 16:33:25 Finished task 'Clear out Tomcat Logs'
23-Apr-2014 16:33:25 Starting task 'Restart Tomcat' of type 'com.atlassian.bamboo.plugins.scripttask:task.builder.script'
23-Apr-2014 16:33:25
Beginning to execute external process for build 'Reference Application - Distribution - Run UI Tests #1950 (REFAPP-OMODDISTRO-INTTESTS-1950)'
... running command line:
/bin/sh /tmp/REFAPP-OMODDISTRO-INTTESTS-1950-ScriptBuildTask-7379565071514074705.sh
... in: /opt/bamboo-agent/agent2-home/xml-data/build-dir/REFAPP-OMODDISTRO-INTTESTS
... using extra environment variables:
bamboo_checkVersions=versions:update-properties -Pupdate-to-latest
bamboo_mavenBuildGoals=clean install
bamboo_jdbc_password=********
bamboo_MAJORRELEASE=2.0
bamboo_githubSshKey=/home/bamboo/bamboo-github-key/id_rsa
bamboo_DISPLAY=:99
23-Apr-2014 16:33:26 * Stopping Tomcat servlet engine tomcat7
23-Apr-2014 16:33:26    ...done.
23-Apr-2014 16:33:27 * Starting Tomcat servlet engine tomcat7
23-Apr-2014 16:33:32    ...done.
23-Apr-2014 16:33:32 Finished task 'Restart Tomcat'
23-Apr-2014 16:33:32 Starting task 'Wait for App to truly start' of type 'com.atlassian.bamboo.plugins.scripttask:task.builder.command'
23-Apr-2014 16:33:32
Beginning to execute external process for build 'Reference Application - Distribution - Run UI Tests #1950 (REFAPP-OMODDISTRO-INTTESTS-1950)'
... running command line:
/bin/bash appStartupCheck.sh devtest01.openmrs.org
... in: /opt/bamboo-agent/agent2-home/xml-data/build-dir/REFAPP-OMODDISTRO-INTTESTS/utility-scripts
... using extra environment variables:
bamboo_checkVersions=versions:update-properties -Pupdate-to-latest
bamboo_mavenBuildGoals=clean install
bamboo_jdbc_password=********
bamboo_MAJORRELEASE=2.0
bamboo_githubSshKey=/home/bamboo/bamboo-github-key/id_rsa
bamboo_DISPLAY=:99
23-Apr-2014 16:33:32 Waiting for OpenMRS to start.  This could take a few minutes.
23-Apr-2014 16:34:38 Tomcat started in 38 seconds.
23-Apr-2014 16:34:38 OpenMRS Reference Application is ready for use.
23-Apr-2014 16:34:38 Finished task 'Wait for App to truly start'
23-Apr-2014 16:34:38
Substituting password variable: ${bamboo.jdbc_password}
23-Apr-2014 16:34:38 Starting task 'Run UI tests' of type 'com.atlassian.bamboo.plugins.maven:task.builder.mvn2'
23-Apr-2014 16:34:38
Beginning to execute external process for build 'Reference Application - Distribution - Run UI Tests #1950 (REFAPP-OMODDISTRO-INTTESTS-1950)'
... running command line:
/usr/share/maven2/bin/mvn --batch-mode -Djava.io.tmpdir=/tmp/REFAPP-OMODDISTRO-INTTESTS clean integration-test -P ci-headless -Dwebdriver=firefox -Ddatabase.username=root -Ddatabase.password=******** -Djdbc.connectionurl=jdbc:mysql://devtest01.openmrs.org:3306/openmrs -Dwebdriver=chrome
... in: /opt/bamboo-agent/agent2-home/xml-data/build-dir/REFAPP-OMODDISTRO-INTTESTS/ui-tests
... using extra environment variables:
bamboo_checkVersions=versions:update-properties -Pupdate-to-latest
bamboo_mavenBuildGoals=clean install
MAVEN2_HOME=/usr/share/maven2
JAVA_HOME=/usr/lib/jvm/java-6-openjdk-amd64
bamboo_jdbc_password=********
bamboo_MAJORRELEASE=2.0
M2_HOME=/usr/share/maven2
bamboo_githubSshKey=/home/bamboo/bamboo-github-key/id_rsa
bamboo_DISPLAY=:99
PATH=/usr/lib/jvm/java-6-openjdk-amd64/bin:/bin:/usr/local/bin:/usr/bin:/bin:/usr/local/games:/usr/games
23-Apr-2014 16:34:39 [INFO] Scanning for projects...
23-Apr-2014 16:34:39 [INFO] ------------------------------------------------------------------------
23-Apr-2014 16:34:39 [INFO] Building Reference Application Distribution UI Tests
23-Apr-2014 16:34:39 [INFO]    task-segment: [clean, integration-test]
23-Apr-2014 16:34:39 [INFO] ------------------------------------------------------------------------
23-Apr-2014 16:34:41 [INFO] [clean:clean {execution: default-clean}]
23-Apr-2014 16:34:42 [INFO] [resources:resources {execution: default-resources}]
23-Apr-2014 16:34:42 [INFO] Using 'UTF-8' encoding to copy filtered resources.
23-Apr-2014 16:34:42 [INFO] Copying 1 resource
23-Apr-2014 16:34:43 [INFO] [compiler:compile {execution: default-compile}]
23-Apr-2014 16:34:43 [INFO] Compiling 6 source files to /opt/bamboo-agent/agent2-home/xml-data/build-dir/REFAPP-OMODDISTRO-INTTESTS/ui-tests/target/classes
23-Apr-2014 16:34:44 [INFO] [resources:testResources {execution: default-testResources}]
23-Apr-2014 16:34:44 [INFO] Using 'UTF-8' encoding to copy filtered resources.
23-Apr-2014 16:34:44 [INFO] skip non existing resourceDirectory /opt/bamboo-agent/agent2-home/xml-data/build-dir/REFAPP-OMODDISTRO-INTTESTS/ui-tests/src/test/resources
23-Apr-2014 16:34:45 [INFO] [compiler:testCompile {execution: default-testCompile}]
23-Apr-2014 16:34:45 [INFO] Compiling 5 source files to /opt/bamboo-agent/agent2-home/xml-data/build-dir/REFAPP-OMODDISTRO-INTTESTS/ui-tests/target/test-classes
23-Apr-2014 16:34:46 [INFO] [surefire:test {execution: default-test}]
23-Apr-2014 16:34:46 [INFO] Surefire report directory: /opt/bamboo-agent/agent2-home/xml-data/build-dir/REFAPP-OMODDISTRO-INTTESTS/ui-tests/target/surefire-reports
23-Apr-2014 16:34:46
23-Apr-2014 16:34:46 -------------------------------------------------------
23-Apr-2014 16:34:46 T E S T S
23-Apr-2014 16:34:46 -------------------------------------------------------
23-Apr-2014 16:34:47
23-Apr-2014 16:34:47 Results :
23-Apr-2014 16:34:47
23-Apr-2014 16:34:47 Tests run: 0, Failures: 0, Errors: 0, Skipped: 0
23-Apr-2014 16:34:47
23-Apr-2014 16:34:48 [INFO] [jar:jar {execution: default-jar}]
23-Apr-2014 16:34:48 [INFO] Building jar: /opt/bamboo-agent/agent2-home/xml-data/build-dir/REFAPP-OMODDISTRO-INTTESTS/ui-tests/target/referenceapplication-ui-tests-1.0-SNAPSHOT.jar
23-Apr-2014 16:34:53 [INFO] [selenium:xvfb {execution: xvfb}]
23-Apr-2014 16:34:53 [INFO] Starting Xvfb...
23-Apr-2014 16:34:53 [INFO] Using display: :99
23-Apr-2014 16:34:53 [INFO] Using Xauthority file: /tmp/REFAPP-OMODDISTRO-INTTESTS/Xvfb6906204462706938319.Xauthority
23-Apr-2014 16:34:54 Deleting: /tmp/REFAPP-OMODDISTRO-INTTESTS/Xvfb6906204462706938319.Xauthority
23-Apr-2014 16:34:54 xauth:  file /tmp/REFAPP-OMODDISTRO-INTTESTS/Xvfb6906204462706938319.Xauthority does not exist
23-Apr-2014 16:34:54 Created dir: /opt/bamboo-agent/agent2-home/xml-data/build-dir/REFAPP-OMODDISTRO-INTTESTS/ui-tests/target/selenium
23-Apr-2014 16:34:54 Launching Xvfb
23-Apr-2014 16:34:54 [INFO] Redirecting output to: /opt/bamboo-agent/agent2-home/xml-data/build-dir/REFAPP-OMODDISTRO-INTTESTS/ui-tests/target/selenium/xvfb.log
23-Apr-2014 16:34:54 Waiting for Xvfb...
23-Apr-2014 16:34:55 Xvfb started
23-Apr-2014 16:34:55 [INFO] [failsafe:integration-test {execution: default}]
23-Apr-2014 16:34:55 [INFO] Failsafe report directory: /opt/bamboo-agent/agent2-home/xml-data/build-dir/REFAPP-OMODDISTRO-INTTESTS/ui-tests/target/failsafe-reports
23-Apr-2014 16:34:55
23-Apr-2014 16:34:55 -------------------------------------------------------
23-Apr-2014 16:34:55 T E S T S
23-Apr-2014 16:34:55 -------------------------------------------------------
23-Apr-2014 16:34:56 Running org.openmrs.reference.LoginTest
23-Apr-2014 16:34:56 test.properties found: file:/opt/bamboo-agent/agent2-home/xml-data/build-dir/REFAPP-OMODDISTRO-INTTESTS/ui-tests/target/classes/org/openmrs/uitestframework/test.properties
23-Apr-2014 16:34:56 test.properties:
23-Apr-2014 16:34:56 {webapp.url=http://devtest01.openmrs.org:8080/openmrs, login.password=Admin123, login.username=admin, webdriver=chrome}
23-Apr-2014 16:34:56 webapp.url: http://devtest01.openmrs.org:8080/openmrs
23-Apr-2014 16:34:56 login.username: admin
23-Apr-2014 16:34:56 login.password: Admin123
23-Apr-2014 16:34:56 webdriver: chrome
23-Apr-2014 16:34:56 jdbc.connectionurl: jdbc:mysql://devtest01.openmrs.org:3306/openmrs
23-Apr-2014 16:34:56 log4j:WARN No appenders could be found for logger (org.apache.commons.vfs2.impl.StandardFileSystemManager).
23-Apr-2014 16:34:56 log4j:WARN Please initialize the log4j system properly.
23-Apr-2014 16:35:00 Starting ChromeDriver (v2.8.240825) on port 13817
23-Apr-2014 16:35:09 Tests run: 4, Failures: 4, Errors: 0, Skipped: 0, Time elapsed: 13.384 sec <<< FAILURE!
23-Apr-2014 16:35:09 Running org.openmrs.reference.CheckModules
23-Apr-2014 16:35:10 Starting ChromeDriver (v2.8.240825) on port 32510
23-Apr-2014 16:35:13 Tests run: 1, Failures: 1, Errors: 0, Skipped: 0, Time elapsed: 3.745 sec <<< FAILURE!
23-Apr-2014 16:35:13 Running org.openmrs.reference.RegistrationAppTest
23-Apr-2014 16:35:13 Starting ChromeDriver (v2.8.240825) on port 17689
23-Apr-2014 16:35:32 Tests run: 2, Failures: 1, Errors: 1, Skipped: 0, Time elapsed: 18.839 sec <<< FAILURE!
23-Apr-2014 16:35:32 Running org.openmrs.reference.VisitTest
23-Apr-2014 16:35:32 Starting ChromeDriver (v2.8.240825) on port 4329
23-Apr-2014 16:35:36 error during REST post
23-Apr-2014 16:35:36 com.fasterxml.jackson.core.JsonParseException: Unexpected character ('<' (code 60)): expected a valid value (number, String, array, object, 'true', 'false' or 'null')
23-Apr-2014 16:35:36 at [Source: java.io.StringReader@2356cab0; line: 1, column: 2]
23-Apr-2014 16:35:36         at com.fasterxml.jackson.core.JsonParser._constructError(JsonParser.java:1369)
23-Apr-2014 16:35:36         at com.fasterxml.jackson.core.base.ParserMinimalBase._reportError(ParserMinimalBase.java:532)
23-Apr-2014 16:35:36         at com.fasterxml.jackson.core.base.ParserMinimalBase._reportUnexpectedChar(ParserMinimalBase.java:453)
23-Apr-2014 16:35:36         at com.fasterxml.jackson.core.json.ReaderBasedJsonParser._handleUnexpectedValue(ReaderBasedJsonParser.java:1386)
23-Apr-2014 16:35:36         at com.fasterxml.jackson.core.json.ReaderBasedJsonParser.nextToken(ReaderBasedJsonParser.java:669)
23-Apr-2014 16:35:36         at com.fasterxml.jackson.databind.ObjectMapper._initForReading(ObjectMapper.java:2926)
23-Apr-2014 16:35:36         at com.fasterxml.jackson.databind.ObjectMapper._readMapAndClose(ObjectMapper.java:2873)
23-Apr-2014 16:35:36         at com.fasterxml.jackson.databind.ObjectMapper.readValue(ObjectMapper.java:2034)
23-Apr-2014 16:35:36         at org.openmrs.uitestframework.test.RestClient.post(RestClient.java:60)
23-Apr-2014 16:35:36         at org.openmrs.uitestframework.test.TestData$JsonTestClass.create(TestData.java:69)
23-Apr-2014 16:35:36         at org.openmrs.uitestframework.test.TestData$JsonTestClass.create(TestData.java:65)
23-Apr-2014 16:35:36         at org.openmrs.uitestframework.test.TestData.createPerson(TestData.java:484)
23-Apr-2014 16:35:36         at org.openmrs.uitestframework.test.TestBase.createTestPatient(TestBase.java:446)
23-Apr-2014 16:35:36         at org.openmrs.uitestframework.test.TestBase.createTestPatient(TestBase.java:452)
23-Apr-2014 16:35:36         at org.openmrs.reference.VisitTest.before(VisitTest.java:21)
23-Apr-2014 16:35:36         at sun.reflect.NativeMethodAccessorImpl.invoke0(Native Method)
23-Apr-2014 16:35:36         at sun.reflect.NativeMethodAccessorImpl.invoke(NativeMethodAccessorImpl.java:57)
23-Apr-2014 16:35:36         at sun.reflect.DelegatingMethodAccessorImpl.invoke(DelegatingMethodAccessorImpl.java:43)
23-Apr-2014 16:35:36         at java.lang.reflect.Method.invoke(Method.java:622)
23-Apr-2014 16:35:36         at org.junit.runners.model.FrameworkMethod$1.runReflectiveCall(FrameworkMethod.java:47)
23-Apr-2014 16:35:36         at org.junit.internal.runners.model.ReflectiveCallable.run(ReflectiveCallable.java:12)
23-Apr-2014 16:35:36         at org.junit.runners.model.FrameworkMethod.invokeExplosively(FrameworkMethod.java:44)
23-Apr-2014 16:35:36         at org.junit.internal.runners.statements.RunBefores.evaluate(RunBefores.java:24)
23-Apr-2014 16:35:36         at org.junit.internal.runners.statements.RunAfters.evaluate(RunAfters.java:27)
23-Apr-2014 16:35:36         at org.junit.rules.TestWatcher$1.evaluate(TestWatcher.java:55)
23-Apr-2014 16:35:36         at org.junit.rules.RunRules.evaluate(RunRules.java:20)
23-Apr-2014 16:35:36         at org.junit.runners.ParentRunner.runLeaf(ParentRunner.java:271)
23-Apr-2014 16:35:36         at org.junit.runners.BlockJUnit4ClassRunner.runChild(BlockJUnit4ClassRunner.java:70)
23-Apr-2014 16:35:36         at org.junit.runners.BlockJUnit4ClassRunner.runChild(BlockJUnit4ClassRunner.java:50)
23-Apr-2014 16:35:36         at org.junit.runners.ParentRunner$3.run(ParentRunner.java:238)
23-Apr-2014 16:35:36         at org.junit.runners.ParentRunner$1.schedule(ParentRunner.java:63)
23-Apr-2014 16:35:36         at org.junit.runners.ParentRunner.runChildren(ParentRunner.java:236)
23-Apr-2014 16:35:36         at org.junit.runners.ParentRunner.access$000(ParentRunner.java:53)
23-Apr-2014 16:35:36         at org.junit.runners.ParentRunner$2.evaluate(ParentRunner.java:229)
23-Apr-2014 16:35:36         at org.junit.internal.runners.statements.RunBefores.evaluate(RunBefores.java:26)
23-Apr-2014 16:35:36         at org.junit.internal.runners.statements.RunAfters.evaluate(RunAfters.java:27)
23-Apr-2014 16:35:36         at org.junit.rules.RunRules.evaluate(RunRules.java:20)
23-Apr-2014 16:35:36         at org.junit.runners.ParentRunner.run(ParentRunner.java:309)
23-Apr-2014 16:35:36         at org.apache.maven.surefire.junit4.JUnit4Provider.execute(JUnit4Provider.java:236)
23-Apr-2014 16:35:36         at org.apache.maven.surefire.junit4.JUnit4Provider.executeTestSet(JUnit4Provider.java:134)
23-Apr-2014 16:35:36         at org.apache.maven.surefire.junit4.JUnit4Provider.invoke(JUnit4Provider.java:113)
23-Apr-2014 16:35:36         at sun.reflect.NativeMethodAccessorImpl.invoke0(Native Method)
23-Apr-2014 16:35:36         at sun.reflect.NativeMethodAccessorImpl.invoke(NativeMethodAccessorImpl.java:57)
23-Apr-2014 16:35:36         at sun.reflect.DelegatingMethodAccessorImpl.invoke(DelegatingMethodAccessorImpl.java:43)
23-Apr-2014 16:35:36         at java.lang.reflect.Method.invoke(Method.java:622)
23-Apr-2014 16:35:36         at org.apache.maven.surefire.util.ReflectionUtils.invokeMethodWithArray(ReflectionUtils.java:189)
23-Apr-2014 16:35:36         at org.apache.maven.surefire.booter.ProviderFactory$ProviderProxy.invoke(ProviderFactory.java:165)
23-Apr-2014 16:35:36         at org.apache.maven.surefire.booter.ProviderFactory.invokeProvider(ProviderFactory.java:85)
23-Apr-2014 16:35:36         at org.apache.maven.surefire.booter.ForkedBooter.runSuitesInProcess(ForkedBooter.java:103)
23-Apr-2014 16:35:36         at org.apache.maven.surefire.booter.ForkedBooter.main(ForkedBooter.java:74)
23-Apr-2014 16:35:37 Tests run: 2, Failures: 0, Errors: 2, Skipped: 0, Time elapsed: 4.927 sec <<< FAILURE!
23-Apr-2014 16:35:37
23-Apr-2014 16:35:37 Results :
23-Apr-2014 16:35:37
23-Apr-2014 16:35:37 Failed tests:   verifyNurseModulesAvailableOnHomePage(org.openmrs.reference.LoginTest): expected:</openmrs/[login.htm]> but was:</openmrs/[initialsetup]>
23-Apr-2014 16:35:37   verifyModulesAvailableOnHomePage(org.openmrs.reference.LoginTest): expected:</openmrs/[login.htm]> but was:</openmrs/[initialsetup]>
23-Apr-2014 16:35:37   verifyClerkModulesAvailableOnHomePage(org.openmrs.reference.LoginTest): expected:</openmrs/[login.htm]> but was:</openmrs/[initialsetup]>
23-Apr-2014 16:35:37   verifyDoctorModulesAvailableOnHomePage(org.openmrs.reference.LoginTest): expected:</openmrs/[login.htm]> but was:</openmrs/[initialsetup]>
23-Apr-2014 16:35:37   checkModules(org.openmrs.reference.CheckModules): expected:</openmrs/[login.htm]> but was:</openmrs/[initialsetup]>
23-Apr-2014 16:35:37   registerAPatient(org.openmrs.reference.RegistrationAppTest): expected:</openmrs/[login.htm]> but was:</openmrs/[initialsetup]>
23-Apr-2014 16:35:37
23-Apr-2014 16:35:37 Tests in error:
23-Apr-2014 16:35:37   registerAPatient(org.openmrs.reference.RegistrationAppTest): Timed out after 8 seconds waiting for presence of element located by: By.xpath: //a[@href='/openmrs/logout'](..)
23-Apr-2014 16:35:37   testStartVisit(org.openmrs.reference.VisitTest)
23-Apr-2014 16:35:37   testStartVisit(org.openmrs.reference.VisitTest)
23-Apr-2014 16:35:37
23-Apr-2014 16:35:37 Tests run: 9, Failures: 6, Errors: 3, Skipped: 0
23-Apr-2014 16:35:37
23-Apr-2014 16:35:37 [WARNING] File encoding has not been set, using platform encoding UTF-8, i.e. build is platform dependent!
23-Apr-2014 16:35:37 [INFO] ------------------------------------------------------------------------
23-Apr-2014 16:35:37 [INFO] BUILD SUCCESSFUL
23-Apr-2014 16:35:37 [INFO] ------------------------------------------------------------------------
23-Apr-2014 16:35:37 [INFO] Total time: 57 seconds
23-Apr-2014 16:35:37 [INFO] Finished at: Wed Apr 23 16:35:37 EDT 2014
23-Apr-2014 16:35:37 [INFO] Final Memory: 60M/316M
23-Apr-2014 16:35:37 [INFO] ------------------------------------------------------------------------
23-Apr-2014 16:35:38 Parsing test results...
23-Apr-2014 16:35:38 Failing task since 7 failing test cases were found.
23-Apr-2014 16:35:38 Finished task 'Run UI tests'
23-Apr-2014 16:35:38 Starting task 'Collect Tomcat Logs' of type 'com.atlassian.bamboo.plugins.scripttask:task.builder.command'
23-Apr-2014 16:35:38
Beginning to execute external process for build 'Reference Application - Distribution - Run UI Tests #1950 (REFAPP-OMODDISTRO-INTTESTS-1950)'
... running command line:
/bin/bash tomcatLogCollector.sh getTomcatLog
... in: /opt/bamboo-agent/agent2-home/xml-data/build-dir/REFAPP-OMODDISTRO-INTTESTS/utility-scripts
... using extra environment variables:
bamboo_checkVersions=versions:update-properties -Pupdate-to-latest
bamboo_mavenBuildGoals=clean install
bamboo_jdbc_password=********
bamboo_MAJORRELEASE=2.0
bamboo_githubSshKey=/home/bamboo/bamboo-github-key/id_rsa
bamboo_DISPLAY=:99
23-Apr-2014 16:35:39 Finished task 'Collect Tomcat Logs'
23-Apr-2014 16:35:39 Running post build plugin 'Artifact Copier'
23-Apr-2014 16:35:39 Publishing an artifact: ScreenShots
23-Apr-2014 16:35:40 Finished publishing of artifact Job artifact: [ScreenShots], pattern: [*.png] anchored at: [ui-tests/target/screenshots] in 0s
23-Apr-2014 16:35:40 Publishing an artifact: Chrome Driver Log File
23-Apr-2014 16:35:40 Finished publishing of artifact Job artifact: [Chrome Driver Log File], pattern: [chromedriver-**.log] anchored at: [ui-tests/target/chromedriverlogs] in 0s
23-Apr-2014 16:35:40 Publishing an artifact: Tomcat Log
23-Apr-2014 16:35:40 Finished publishing of artifact Job artifact: [Tomcat Log], pattern: [catalina.out] anchored at: [utility-scripts] in 0s
23-Apr-2014 16:35:40 Running post build plugin 'NCover Results Collector'
23-Apr-2014 16:35:40 Running post build plugin 'Clover Results Collector'
23-Apr-2014 16:35:40 Finalising the build...
23-Apr-2014 16:35:40 Stopping timer.
23-Apr-2014 16:35:40 Build REFAPP-OMODDISTRO-INTTESTS-1950 completed.
23-Apr-2014 16:35:40 Running on server: post build plugin 'NCover Results Collector'
23-Apr-2014 16:35:40 Running on server: post build plugin 'Clover Delta Calculator'
23-Apr-2014 16:35:40 Running on server: post build plugin 'Build Hanging Detection Configuration'
23-Apr-2014 16:35:40 Running on server: post build plugin 'Maven Dependencies Postprocessor'
23-Apr-2014 16:35:40 All post build plugins have finished
23-Apr-2014 16:35:40 Generating build results summary...
23-Apr-2014 16:35:40 Saving build results to disk...
23-Apr-2014 16:35:40 Indexing build results...
23-Apr-2014 16:35:40 Finished building REFAPP-OMODDISTRO-INTTESTS-1950.