Deploys Reference Application SNAPSHOT to maven

Build: #3633 failed

Job: Run UI tests on Travis failed

Stages & jobs

  1. Create Reference Application packages

  2. Deploy to Automated Functional Test Server

  3. Run UI Tests

  4. Deploy to Manual Test Server

  5. Release

    Requires a user to start manually
  6. Create Standalone

Job result summary

Completed
Duration
205 minutes
Revision
72891d950435b0b6a024af1e67a8a57db701a460 72891d950435b0b6a024af1e67a8a57db701a460
Total tests
55
Failing since
#3620 (Code changes detected – )
Fixed in
#3656 (Code changes detected)

Tests

  • 55 tests in total
  • 12 tests failed
  • 8 failures are new
  • 3 tests were fixed
  • 21 tests were quarantined / skipped
  • 18 minutes taken in total.
New test failures 8
Status Test Duration
Collapse Failed AddConceptDrugTest addConceptDrugTest History
36 secs
org.openqa.selenium.TimeoutException: Timed out after 30 seconds waiting for presence of element located by: By.linkText: Edit
Build info: version: '2.37.0', revision: 'a7c61cbd68657e133ae96672cf995890bad2ee42', time: '2013-10-18 09:51:02'
System info: host: 'gw107', ip: '149.165.228.105', os.name: 'Linux', os.arch: 'amd64', os.version: '3.13.0-45-generic', java.version: '1.7.0_79'
Driver info: driver.version: unknown
	at sun.reflect.GeneratedConstructorAccessor19.newInstance(Unknown Source)
	at sun.reflect.DelegatingConstructorAccessorImpl.newInstance(DelegatingConstructorAccessorImpl.java:45)
	at java.lang.reflect.Constructor.newInstance(Constructor.java:526)
	at org.openqa.selenium.remote.ErrorHandler.createThrowable(ErrorHandler.java:193)
(15 more lines...)
Collapse Failed EditConceptTest editConceptTest History
36 secs
org.openqa.selenium.TimeoutException: Timed out after 30 seconds waiting for presence of element located by: By.linkText: Edit
Build info: version: '2.37.0', revision: 'a7c61cbd68657e133ae96672cf995890bad2ee42', time: '2013-10-18 09:51:02'
System info: host: 'gw107', ip: '149.165.228.105', os.name: 'Linux', os.arch: 'amd64', os.version: '3.13.0-45-generic', java.version: '1.7.0_79'
Driver info: driver.version: unknown
	at sun.reflect.GeneratedConstructorAccessor19.newInstance(Unknown Source)
	at sun.reflect.DelegatingConstructorAccessorImpl.newInstance(DelegatingConstructorAccessorImpl.java:45)
	at java.lang.reflect.Constructor.newInstance(Constructor.java:526)
	at org.openqa.selenium.remote.ErrorHandler.createThrowable(ErrorHandler.java:193)
(15 more lines...)
Collapse Failed MergePatientByNameTest org.openmrs.reference.MergePatientByNameTest History
< 1 sec
org.openqa.selenium.remote.UnreachableBrowserException: Could not start a new session. Possible causes are invalid address of the remote server or browser start-up failure.
Build info: version: '2.37.0', revision: 'a7c61cbd68657e133ae96672cf995890bad2ee42', time: '2013-10-18 09:51:02'
System info: host: 'gw107', ip: '149.165.228.105', os.name: 'Linux', os.arch: 'amd64', os.version: '3.13.0-45-generic', java.version: '1.7.0_79'
Driver info: driver.version: ChromeDriver
	at org.openqa.selenium.remote.RemoteWebDriver.execute(RemoteWebDriver.java:548)
	at org.openqa.selenium.remote.RemoteWebDriver.startSession(RemoteWebDriver.java:216)
	at org.openqa.selenium.remote.RemoteWebDriver.<init>(RemoteWebDriver.java:111)
	at org.openqa.selenium.remote.RemoteWebDriver.<init>(RemoteWebDriver.java:115)
(100 more lines...)
Collapse Failed PasswordCannotMatchUsernameTest passwordCannotMatchUsernameTest History
19 secs
java.lang.AssertionError: null
	at org.junit.Assert.fail(Assert.java:86)
	at org.junit.Assert.assertTrue(Assert.java:41)
	at org.junit.Assert.assertTrue(Assert.java:52)
	at org.openmrs.reference.PasswordCannotMatchUsernameTest.passwordCannotMatchUsernameTest(PasswordCannotMatchUsernameTest.java:48)
Collapse Failed PasswordMinimumLengthTest passwordMinimumLengthTest History
43 secs
org.openqa.selenium.TimeoutException: Timed out after 30 seconds waiting for presence of element located by: By.name: name
Build info: version: '2.37.0', revision: 'a7c61cbd68657e133ae96672cf995890bad2ee42', time: '2013-10-18 09:51:02'
System info: host: 'gw107', ip: '149.165.228.105', os.name: 'Linux', os.arch: 'amd64', os.version: '3.13.0-45-generic', java.version: '1.7.0_79'
Driver info: driver.version: unknown
	at sun.reflect.GeneratedConstructorAccessor19.newInstance(Unknown Source)
	at sun.reflect.DelegatingConstructorAccessorImpl.newInstance(DelegatingConstructorAccessorImpl.java:45)
	at java.lang.reflect.Constructor.newInstance(Constructor.java:526)
	at org.openqa.selenium.remote.ErrorHandler.createThrowable(ErrorHandler.java:193)
(15 more lines...)
Collapse Failed PasswordRequiresDigitTest passwordRequiresDigitTest History
42 secs
org.openqa.selenium.TimeoutException: Timed out after 30 seconds waiting for presence of element located by: By.name: name
Build info: version: '2.37.0', revision: 'a7c61cbd68657e133ae96672cf995890bad2ee42', time: '2013-10-18 09:51:02'
System info: host: 'gw107', ip: '149.165.228.105', os.name: 'Linux', os.arch: 'amd64', os.version: '3.13.0-45-generic', java.version: '1.7.0_79'
Driver info: driver.version: unknown
	at sun.reflect.GeneratedConstructorAccessor19.newInstance(Unknown Source)
	at sun.reflect.DelegatingConstructorAccessorImpl.newInstance(DelegatingConstructorAccessorImpl.java:45)
	at java.lang.reflect.Constructor.newInstance(Constructor.java:526)
	at org.openqa.selenium.remote.ErrorHandler.createThrowable(ErrorHandler.java:193)
(15 more lines...)
Collapse Failed PasswordRequiresNonDigitTest passwordRequiresNonDigitTest History
43 secs
org.openqa.selenium.TimeoutException: Timed out after 30 seconds waiting for presence of element located by: By.name: name
Build info: version: '2.37.0', revision: 'a7c61cbd68657e133ae96672cf995890bad2ee42', time: '2013-10-18 09:51:02'
System info: host: 'gw107', ip: '149.165.228.105', os.name: 'Linux', os.arch: 'amd64', os.version: '3.13.0-45-generic', java.version: '1.7.0_79'
Driver info: driver.version: unknown
	at sun.reflect.GeneratedConstructorAccessor19.newInstance(Unknown Source)
	at sun.reflect.DelegatingConstructorAccessorImpl.newInstance(DelegatingConstructorAccessorImpl.java:45)
	at java.lang.reflect.Constructor.newInstance(Constructor.java:526)
	at org.openqa.selenium.remote.ErrorHandler.createThrowable(ErrorHandler.java:193)
(15 more lines...)
Collapse Failed PasswordUpperAndLowerCaseTest passwordUpperAndLowerCaseTest History
42 secs
org.openqa.selenium.TimeoutException: Timed out after 30 seconds waiting for presence of element located by: By.name: name
Build info: version: '2.37.0', revision: 'a7c61cbd68657e133ae96672cf995890bad2ee42', time: '2013-10-18 09:51:02'
System info: host: 'gw107', ip: '149.165.228.105', os.name: 'Linux', os.arch: 'amd64', os.version: '3.13.0-45-generic', java.version: '1.7.0_79'
Driver info: driver.version: unknown
	at sun.reflect.GeneratedConstructorAccessor19.newInstance(Unknown Source)
	at sun.reflect.DelegatingConstructorAccessorImpl.newInstance(DelegatingConstructorAccessorImpl.java:45)
	at java.lang.reflect.Constructor.newInstance(Constructor.java:526)
	at org.openqa.selenium.remote.ErrorHandler.createThrowable(ErrorHandler.java:193)
(15 more lines...)
Existing test failures 4
Status Test Failing since Duration
org.openqa.selenium.TimeoutException: Timed out after 30 seconds waiting for presence of element located by: By.selector: i.delete-item.icon-remove
Build info: version: '2.37.0', revision: 'a7c61cbd68657e133ae96672cf995890bad2ee42', time: '2013-10-18 09:51:02'
System info: host: 'gw107', ip: '149.165.228.105', os.name: 'Linux', os.arch: 'amd64', os.version: '3.13.0-45-generic', java.version: '1.7.0_79'
Driver info: driver.version: unknown
	at sun.reflect.NativeConstructorAccessorImpl.newInstance0(Native Method)
	at sun.reflect.NativeConstructorAccessorImpl.newInstance(NativeConstructorAccessorImpl.java:57)
	at sun.reflect.DelegatingConstructorAccessorImpl.newInstance(DelegatingConstructorAccessorImpl.java:45)
	at java.lang.reflect.Constructor.newInstance(Constructor.java:526)
(16 more lines...)
java.lang.AssertionError: null
	at org.junit.Assert.fail(Assert.java:86)
	at org.junit.Assert.assertTrue(Assert.java:41)
	at org.junit.Assert.assertTrue(Assert.java:52)
	at org.openmrs.reference.FindPatientByFamilyNameTest.testRecentlyPatientTest(FindPatientByFamilyNameTest.java:38)
java.lang.AssertionError: null
	at org.junit.Assert.fail(Assert.java:86)
	at org.junit.Assert.assertTrue(Assert.java:41)
	at org.junit.Assert.assertTrue(Assert.java:52)
	at org.openmrs.reference.RelationTypeTest.addEditRetireDeleteRelationTypeTest(RelationTypeTest.java:51)
org.openqa.selenium.TimeoutException: Timed out after 30 seconds waiting for presence of element located by: By.name: addName
Build info: version: '2.37.0', revision: 'a7c61cbd68657e133ae96672cf995890bad2ee42', time: '2013-10-18 09:51:02'
System info: host: 'gw107', ip: '149.165.228.105', os.name: 'Linux', os.arch: 'amd64', os.version: '3.13.0-45-generic', java.version: '1.7.0_79'
Driver info: driver.version: unknown
	at sun.reflect.GeneratedConstructorAccessor19.newInstance(Unknown Source)
	at sun.reflect.DelegatingConstructorAccessorImpl.newInstance(DelegatingConstructorAccessorImpl.java:45)
	at java.lang.reflect.Constructor.newInstance(Constructor.java:526)
	at org.openqa.selenium.remote.ErrorHandler.createThrowable(ErrorHandler.java:193)
(15 more lines...)
Fixed tests 3
Status Test Failing since Duration
Successful CreateAppointmentBlockTest createAppointmentBlockTest History
Failing since build #3631 (Code changes detected) 37 secs
Successful DeleteAppointmentBlockTest deleteAppointmentBlockTest History
Failing since build #3631 (Code changes detected) 8 secs
Successful EditAppointmentBlockTest editAppointmentBlockTest History
Failing since build #3631 (Code changes detected) 9 secs