More details of the release in https://wiki.openmrs.org/x/i4DTAw

Build: #783 failed Changes by Michael Seaton <mseaton@pih.org>

Test results

  • 5,075 tests in total
  • 47 tests failed
  • 30 failures are new
  • 606 tests were fixed
  • 98 tests were quarantined / skipped
  • 13 minutes taken in total.
New test failures 30
Status Test View job Duration
Collapse Failed ImplementerConfiguredCohortDefinitionLibraryTest testSerializedDefinition History
Test against 1.10 < 1 sec
org.openmrs.api.APIException: A user context must first be passed to setUserContext()...use Context.openSession() (and closeSession() to prevent memory leaks!) before using the API
	at org.openmrs.api.context.Context.getUserContext(Context.java:237)
	at org.openmrs.api.context.Context.getAuthenticatedUser(Context.java:616)
	at org.openmrs.api.context.Context.isAuthenticated(Context.java:623)
	at org.openmrs.module.serialization.xstream.XStreamSerializer.deserialize(XStreamSerializer.java:332)
	at org.openmrs.module.reporting.serializer.ReportingSerializer.deserialize(ReportingSerializer.java:92)
	at org.openmrs.module.reporting.definition.library.implementerconfigured.BaseImplementerConfiguredDefinitionLibrary.loadDefinitions(BaseImplementerConfiguredDefinitionLibrary.java:134)
	at org.openmrs.module.reporting.definition.library.implementerconfigured.BaseImplementerConfiguredDefinitionLibrary.ensureDefinitions(BaseImplementerConfiguredDefinitionLibrary.java:104)
(35 more lines...)
Collapse Failed ImplementerConfiguredCohortDefinitionLibraryTest testSerializedDefinition History
Test against 2.0 < 1 sec
org.openmrs.api.APIException: A user context must first be passed to setUserContext()...use Context.openSession() (and closeSession() to prevent memory leaks!) before using the API
	at org.openmrs.api.context.Context.getUserContext(Context.java:236)
	at org.openmrs.api.context.Context.getAuthenticatedUser(Context.java:595)
	at org.openmrs.api.context.Context.isAuthenticated(Context.java:605)
	at org.openmrs.module.serialization.xstream.XStreamSerializer.deserialize(XStreamSerializer.java:332)
	at org.openmrs.module.reporting.serializer.ReportingSerializer.deserialize(ReportingSerializer.java:92)
	at org.openmrs.module.reporting.definition.library.implementerconfigured.BaseImplementerConfiguredDefinitionLibrary.loadDefinitions(BaseImplementerConfiguredDefinitionLibrary.java:134)
	at org.openmrs.module.reporting.definition.library.implementerconfigured.BaseImplementerConfiguredDefinitionLibrary.ensureDefinitions(BaseImplementerConfiguredDefinitionLibrary.java:104)
(35 more lines...)
Collapse Failed ImplementerConfiguredCohortDefinitionLibraryTest testSerializedDefinition History
Test against 2.1 < 1 sec
org.openmrs.api.APIException: A user context must first be passed to setUserContext()...use Context.openSession() (and closeSession() to prevent memory leaks!) before using the API
	at org.openmrs.api.context.Context.getUserContext(Context.java:235)
	at org.openmrs.api.context.Context.getAuthenticatedUser(Context.java:587)
	at org.openmrs.api.context.Context.isAuthenticated(Context.java:597)
	at org.openmrs.module.serialization.xstream.XStreamSerializer.deserialize(XStreamSerializer.java:332)
	at org.openmrs.module.reporting.serializer.ReportingSerializer.deserialize(ReportingSerializer.java:92)
	at org.openmrs.module.reporting.definition.library.implementerconfigured.BaseImplementerConfiguredDefinitionLibrary.loadDefinitions(BaseImplementerConfiguredDefinitionLibrary.java:134)
	at org.openmrs.module.reporting.definition.library.implementerconfigured.BaseImplementerConfiguredDefinitionLibrary.ensureDefinitions(BaseImplementerConfiguredDefinitionLibrary.java:104)
(35 more lines...)
Collapse Failed ImplementerConfiguredCohortDefinitionLibraryTest testSerializedDefinition History
Test against 1.11 < 1 sec
org.openmrs.api.APIException: A user context must first be passed to setUserContext()...use Context.openSession() (and closeSession() to prevent memory leaks!) before using the API
	at org.openmrs.api.context.Context.getUserContext(Context.java:245)
	at org.openmrs.api.context.Context.getAuthenticatedUser(Context.java:644)
	at org.openmrs.api.context.Context.isAuthenticated(Context.java:651)
	at org.openmrs.module.serialization.xstream.XStreamSerializer.deserialize(XStreamSerializer.java:332)
	at org.openmrs.module.reporting.serializer.ReportingSerializer.deserialize(ReportingSerializer.java:92)
	at org.openmrs.module.reporting.definition.library.implementerconfigured.BaseImplementerConfiguredDefinitionLibrary.loadDefinitions(BaseImplementerConfiguredDefinitionLibrary.java:134)
	at org.openmrs.module.reporting.definition.library.implementerconfigured.BaseImplementerConfiguredDefinitionLibrary.ensureDefinitions(BaseImplementerConfiguredDefinitionLibrary.java:104)
(35 more lines...)
Collapse Failed ImplementerConfiguredCohortDefinitionLibraryTest testSerializedDefinition History
Test against 1.12 < 1 sec
org.openmrs.api.APIException: A user context must first be passed to setUserContext()...use Context.openSession() (and closeSession() to prevent memory leaks!) before using the API
	at org.openmrs.api.context.Context.getUserContext(Context.java:246)
	at org.openmrs.api.context.Context.getAuthenticatedUser(Context.java:653)
	at org.openmrs.api.context.Context.isAuthenticated(Context.java:663)
	at org.openmrs.module.serialization.xstream.XStreamSerializer.deserialize(XStreamSerializer.java:332)
	at org.openmrs.module.reporting.serializer.ReportingSerializer.deserialize(ReportingSerializer.java:92)
	at org.openmrs.module.reporting.definition.library.implementerconfigured.BaseImplementerConfiguredDefinitionLibrary.loadDefinitions(BaseImplementerConfiguredDefinitionLibrary.java:134)
	at org.openmrs.module.reporting.definition.library.implementerconfigured.BaseImplementerConfiguredDefinitionLibrary.ensureDefinitions(BaseImplementerConfiguredDefinitionLibrary.java:104)
(35 more lines...)
Collapse Failed ImplementerConfiguredCohortDefinitionLibraryTest testSerializedDefinition History
Default Job < 1 sec
org.openmrs.api.APIException: A user context must first be passed to setUserContext()...use Context.openSession() (and closeSession() to prevent memory leaks!) before using the API
	at org.openmrs.api.context.Context.getUserContext(Context.java:237)
	at org.openmrs.api.context.Context.getAuthenticatedUser(Context.java:616)
	at org.openmrs.api.context.Context.isAuthenticated(Context.java:623)
	at org.openmrs.module.serialization.xstream.XStreamSerializer.deserialize(XStreamSerializer.java:332)
	at org.openmrs.module.reporting.serializer.ReportingSerializer.deserialize(ReportingSerializer.java:92)
	at org.openmrs.module.reporting.definition.library.implementerconfigured.BaseImplementerConfiguredDefinitionLibrary.loadDefinitions(BaseImplementerConfiguredDefinitionLibrary.java:134)
	at org.openmrs.module.reporting.definition.library.implementerconfigured.BaseImplementerConfiguredDefinitionLibrary.ensureDefinitions(BaseImplementerConfiguredDefinitionLibrary.java:104)
(35 more lines...)
Collapse Failed ImplementerConfiguredDataSetDefinitionLibraryTest testSerializedDefinition History
Test against 1.10 < 1 sec
org.openmrs.api.APIException: A user context must first be passed to setUserContext()...use Context.openSession() (and closeSession() to prevent memory leaks!) before using the API
	at org.openmrs.api.context.Context.getUserContext(Context.java:237)
	at org.openmrs.api.context.Context.getAuthenticatedUser(Context.java:616)
	at org.openmrs.api.context.Context.isAuthenticated(Context.java:623)
	at org.openmrs.module.serialization.xstream.XStreamSerializer.deserialize(XStreamSerializer.java:332)
	at org.openmrs.module.reporting.serializer.ReportingSerializer.deserialize(ReportingSerializer.java:92)
	at org.openmrs.module.reporting.definition.library.implementerconfigured.BaseImplementerConfiguredDefinitionLibrary.loadDefinitions(BaseImplementerConfiguredDefinitionLibrary.java:134)
	at org.openmrs.module.reporting.definition.library.implementerconfigured.BaseImplementerConfiguredDefinitionLibrary.ensureDefinitions(BaseImplementerConfiguredDefinitionLibrary.java:104)
(35 more lines...)
Collapse Failed ImplementerConfiguredDataSetDefinitionLibraryTest testSerializedDefinition History
Test against 2.0 < 1 sec
org.openmrs.api.APIException: A user context must first be passed to setUserContext()...use Context.openSession() (and closeSession() to prevent memory leaks!) before using the API
	at org.openmrs.api.context.Context.getUserContext(Context.java:236)
	at org.openmrs.api.context.Context.getAuthenticatedUser(Context.java:595)
	at org.openmrs.api.context.Context.isAuthenticated(Context.java:605)
	at org.openmrs.module.serialization.xstream.XStreamSerializer.deserialize(XStreamSerializer.java:332)
	at org.openmrs.module.reporting.serializer.ReportingSerializer.deserialize(ReportingSerializer.java:92)
	at org.openmrs.module.reporting.definition.library.implementerconfigured.BaseImplementerConfiguredDefinitionLibrary.loadDefinitions(BaseImplementerConfiguredDefinitionLibrary.java:134)
	at org.openmrs.module.reporting.definition.library.implementerconfigured.BaseImplementerConfiguredDefinitionLibrary.ensureDefinitions(BaseImplementerConfiguredDefinitionLibrary.java:104)
(35 more lines...)
Collapse Failed ImplementerConfiguredDataSetDefinitionLibraryTest testSerializedDefinition History
Test against 2.1 < 1 sec
org.openmrs.api.APIException: A user context must first be passed to setUserContext()...use Context.openSession() (and closeSession() to prevent memory leaks!) before using the API
	at org.openmrs.api.context.Context.getUserContext(Context.java:235)
	at org.openmrs.api.context.Context.getAuthenticatedUser(Context.java:587)
	at org.openmrs.api.context.Context.isAuthenticated(Context.java:597)
	at org.openmrs.module.serialization.xstream.XStreamSerializer.deserialize(XStreamSerializer.java:332)
	at org.openmrs.module.reporting.serializer.ReportingSerializer.deserialize(ReportingSerializer.java:92)
	at org.openmrs.module.reporting.definition.library.implementerconfigured.BaseImplementerConfiguredDefinitionLibrary.loadDefinitions(BaseImplementerConfiguredDefinitionLibrary.java:134)
	at org.openmrs.module.reporting.definition.library.implementerconfigured.BaseImplementerConfiguredDefinitionLibrary.ensureDefinitions(BaseImplementerConfiguredDefinitionLibrary.java:104)
(35 more lines...)
Collapse Failed ImplementerConfiguredDataSetDefinitionLibraryTest testSerializedDefinition History
Test against 1.11 < 1 sec
org.openmrs.api.APIException: A user context must first be passed to setUserContext()...use Context.openSession() (and closeSession() to prevent memory leaks!) before using the API
	at org.openmrs.api.context.Context.getUserContext(Context.java:245)
	at org.openmrs.api.context.Context.getAuthenticatedUser(Context.java:644)
	at org.openmrs.api.context.Context.isAuthenticated(Context.java:651)
	at org.openmrs.module.serialization.xstream.XStreamSerializer.deserialize(XStreamSerializer.java:332)
	at org.openmrs.module.reporting.serializer.ReportingSerializer.deserialize(ReportingSerializer.java:92)
	at org.openmrs.module.reporting.definition.library.implementerconfigured.BaseImplementerConfiguredDefinitionLibrary.loadDefinitions(BaseImplementerConfiguredDefinitionLibrary.java:134)
	at org.openmrs.module.reporting.definition.library.implementerconfigured.BaseImplementerConfiguredDefinitionLibrary.ensureDefinitions(BaseImplementerConfiguredDefinitionLibrary.java:104)
(35 more lines...)
Collapse Failed ImplementerConfiguredDataSetDefinitionLibraryTest testSerializedDefinition History
Test against 1.12 < 1 sec
org.openmrs.api.APIException: A user context must first be passed to setUserContext()...use Context.openSession() (and closeSession() to prevent memory leaks!) before using the API
	at org.openmrs.api.context.Context.getUserContext(Context.java:246)
	at org.openmrs.api.context.Context.getAuthenticatedUser(Context.java:653)
	at org.openmrs.api.context.Context.isAuthenticated(Context.java:663)
	at org.openmrs.module.serialization.xstream.XStreamSerializer.deserialize(XStreamSerializer.java:332)
	at org.openmrs.module.reporting.serializer.ReportingSerializer.deserialize(ReportingSerializer.java:92)
	at org.openmrs.module.reporting.definition.library.implementerconfigured.BaseImplementerConfiguredDefinitionLibrary.loadDefinitions(BaseImplementerConfiguredDefinitionLibrary.java:134)
	at org.openmrs.module.reporting.definition.library.implementerconfigured.BaseImplementerConfiguredDefinitionLibrary.ensureDefinitions(BaseImplementerConfiguredDefinitionLibrary.java:104)
(35 more lines...)
Collapse Failed ImplementerConfiguredDataSetDefinitionLibraryTest testSerializedDefinition History
Default Job < 1 sec
org.openmrs.api.APIException: A user context must first be passed to setUserContext()...use Context.openSession() (and closeSession() to prevent memory leaks!) before using the API
	at org.openmrs.api.context.Context.getUserContext(Context.java:237)
	at org.openmrs.api.context.Context.getAuthenticatedUser(Context.java:616)
	at org.openmrs.api.context.Context.isAuthenticated(Context.java:623)
	at org.openmrs.module.serialization.xstream.XStreamSerializer.deserialize(XStreamSerializer.java:332)
	at org.openmrs.module.reporting.serializer.ReportingSerializer.deserialize(ReportingSerializer.java:92)
	at org.openmrs.module.reporting.definition.library.implementerconfigured.BaseImplementerConfiguredDefinitionLibrary.loadDefinitions(BaseImplementerConfiguredDefinitionLibrary.java:134)
	at org.openmrs.module.reporting.definition.library.implementerconfigured.BaseImplementerConfiguredDefinitionLibrary.ensureDefinitions(BaseImplementerConfiguredDefinitionLibrary.java:104)
(35 more lines...)
Collapse Failed ImplementerConfiguredEncounterDataDefinitionLibraryTest testSerializedDefinition History
Test against 1.10 < 1 sec
org.openmrs.api.APIException: A user context must first be passed to setUserContext()...use Context.openSession() (and closeSession() to prevent memory leaks!) before using the API
	at org.openmrs.api.context.Context.getUserContext(Context.java:237)
	at org.openmrs.api.context.Context.getAuthenticatedUser(Context.java:616)
	at org.openmrs.api.context.Context.isAuthenticated(Context.java:623)
	at org.openmrs.module.serialization.xstream.XStreamSerializer.deserialize(XStreamSerializer.java:332)
	at org.openmrs.module.reporting.serializer.ReportingSerializer.deserialize(ReportingSerializer.java:92)
	at org.openmrs.module.reporting.definition.library.implementerconfigured.BaseImplementerConfiguredDefinitionLibrary.loadDefinitions(BaseImplementerConfiguredDefinitionLibrary.java:134)
	at org.openmrs.module.reporting.definition.library.implementerconfigured.BaseImplementerConfiguredDefinitionLibrary.ensureDefinitions(BaseImplementerConfiguredDefinitionLibrary.java:104)
(35 more lines...)
Collapse Failed ImplementerConfiguredEncounterDataDefinitionLibraryTest testSerializedDefinition History
Test against 2.0 < 1 sec
org.openmrs.api.APIException: A user context must first be passed to setUserContext()...use Context.openSession() (and closeSession() to prevent memory leaks!) before using the API
	at org.openmrs.api.context.Context.getUserContext(Context.java:236)
	at org.openmrs.api.context.Context.getAuthenticatedUser(Context.java:595)
	at org.openmrs.api.context.Context.isAuthenticated(Context.java:605)
	at org.openmrs.module.serialization.xstream.XStreamSerializer.deserialize(XStreamSerializer.java:332)
	at org.openmrs.module.reporting.serializer.ReportingSerializer.deserialize(ReportingSerializer.java:92)
	at org.openmrs.module.reporting.definition.library.implementerconfigured.BaseImplementerConfiguredDefinitionLibrary.loadDefinitions(BaseImplementerConfiguredDefinitionLibrary.java:134)
	at org.openmrs.module.reporting.definition.library.implementerconfigured.BaseImplementerConfiguredDefinitionLibrary.ensureDefinitions(BaseImplementerConfiguredDefinitionLibrary.java:104)
(35 more lines...)
Collapse Failed ImplementerConfiguredEncounterDataDefinitionLibraryTest testSerializedDefinition History
Test against 2.1 < 1 sec
org.openmrs.api.APIException: A user context must first be passed to setUserContext()...use Context.openSession() (and closeSession() to prevent memory leaks!) before using the API
	at org.openmrs.api.context.Context.getUserContext(Context.java:235)
	at org.openmrs.api.context.Context.getAuthenticatedUser(Context.java:587)
	at org.openmrs.api.context.Context.isAuthenticated(Context.java:597)
	at org.openmrs.module.serialization.xstream.XStreamSerializer.deserialize(XStreamSerializer.java:332)
	at org.openmrs.module.reporting.serializer.ReportingSerializer.deserialize(ReportingSerializer.java:92)
	at org.openmrs.module.reporting.definition.library.implementerconfigured.BaseImplementerConfiguredDefinitionLibrary.loadDefinitions(BaseImplementerConfiguredDefinitionLibrary.java:134)
	at org.openmrs.module.reporting.definition.library.implementerconfigured.BaseImplementerConfiguredDefinitionLibrary.ensureDefinitions(BaseImplementerConfiguredDefinitionLibrary.java:104)
(35 more lines...)
Collapse Failed ImplementerConfiguredEncounterDataDefinitionLibraryTest testSerializedDefinition History
Test against 1.11 < 1 sec
org.openmrs.api.APIException: A user context must first be passed to setUserContext()...use Context.openSession() (and closeSession() to prevent memory leaks!) before using the API
	at org.openmrs.api.context.Context.getUserContext(Context.java:245)
	at org.openmrs.api.context.Context.getAuthenticatedUser(Context.java:644)
	at org.openmrs.api.context.Context.isAuthenticated(Context.java:651)
	at org.openmrs.module.serialization.xstream.XStreamSerializer.deserialize(XStreamSerializer.java:332)
	at org.openmrs.module.reporting.serializer.ReportingSerializer.deserialize(ReportingSerializer.java:92)
	at org.openmrs.module.reporting.definition.library.implementerconfigured.BaseImplementerConfiguredDefinitionLibrary.loadDefinitions(BaseImplementerConfiguredDefinitionLibrary.java:134)
	at org.openmrs.module.reporting.definition.library.implementerconfigured.BaseImplementerConfiguredDefinitionLibrary.ensureDefinitions(BaseImplementerConfiguredDefinitionLibrary.java:104)
(35 more lines...)
Collapse Failed ImplementerConfiguredEncounterDataDefinitionLibraryTest testSerializedDefinition History
Test against 1.12 < 1 sec
org.openmrs.api.APIException: A user context must first be passed to setUserContext()...use Context.openSession() (and closeSession() to prevent memory leaks!) before using the API
	at org.openmrs.api.context.Context.getUserContext(Context.java:246)
	at org.openmrs.api.context.Context.getAuthenticatedUser(Context.java:653)
	at org.openmrs.api.context.Context.isAuthenticated(Context.java:663)
	at org.openmrs.module.serialization.xstream.XStreamSerializer.deserialize(XStreamSerializer.java:332)
	at org.openmrs.module.reporting.serializer.ReportingSerializer.deserialize(ReportingSerializer.java:92)
	at org.openmrs.module.reporting.definition.library.implementerconfigured.BaseImplementerConfiguredDefinitionLibrary.loadDefinitions(BaseImplementerConfiguredDefinitionLibrary.java:134)
	at org.openmrs.module.reporting.definition.library.implementerconfigured.BaseImplementerConfiguredDefinitionLibrary.ensureDefinitions(BaseImplementerConfiguredDefinitionLibrary.java:104)
(35 more lines...)
Collapse Failed ImplementerConfiguredEncounterDataDefinitionLibraryTest testSerializedDefinition History
Default Job < 1 sec
org.openmrs.api.APIException: A user context must first be passed to setUserContext()...use Context.openSession() (and closeSession() to prevent memory leaks!) before using the API
	at org.openmrs.api.context.Context.getUserContext(Context.java:237)
	at org.openmrs.api.context.Context.getAuthenticatedUser(Context.java:616)
	at org.openmrs.api.context.Context.isAuthenticated(Context.java:623)
	at org.openmrs.module.serialization.xstream.XStreamSerializer.deserialize(XStreamSerializer.java:332)
	at org.openmrs.module.reporting.serializer.ReportingSerializer.deserialize(ReportingSerializer.java:92)
	at org.openmrs.module.reporting.definition.library.implementerconfigured.BaseImplementerConfiguredDefinitionLibrary.loadDefinitions(BaseImplementerConfiguredDefinitionLibrary.java:134)
	at org.openmrs.module.reporting.definition.library.implementerconfigured.BaseImplementerConfiguredDefinitionLibrary.ensureDefinitions(BaseImplementerConfiguredDefinitionLibrary.java:104)
(35 more lines...)
Collapse Failed ImplementerConfiguredPatientDataDefinitionLibraryTest testSerializedDefinition History
Test against 1.10 < 1 sec
org.openmrs.api.APIException: A user context must first be passed to setUserContext()...use Context.openSession() (and closeSession() to prevent memory leaks!) before using the API
	at org.openmrs.api.context.Context.getUserContext(Context.java:237)
	at org.openmrs.api.context.Context.getAuthenticatedUser(Context.java:616)
	at org.openmrs.api.context.Context.isAuthenticated(Context.java:623)
	at org.openmrs.module.serialization.xstream.XStreamSerializer.deserialize(XStreamSerializer.java:332)
	at org.openmrs.module.reporting.serializer.ReportingSerializer.deserialize(ReportingSerializer.java:92)
	at org.openmrs.module.reporting.definition.library.implementerconfigured.BaseImplementerConfiguredDefinitionLibrary.loadDefinitions(BaseImplementerConfiguredDefinitionLibrary.java:134)
	at org.openmrs.module.reporting.definition.library.implementerconfigured.BaseImplementerConfiguredDefinitionLibrary.ensureDefinitions(BaseImplementerConfiguredDefinitionLibrary.java:104)
(35 more lines...)
Collapse Failed ImplementerConfiguredPatientDataDefinitionLibraryTest testSerializedDefinition History
Test against 2.0 < 1 sec
org.openmrs.api.APIException: A user context must first be passed to setUserContext()...use Context.openSession() (and closeSession() to prevent memory leaks!) before using the API
	at org.openmrs.api.context.Context.getUserContext(Context.java:236)
	at org.openmrs.api.context.Context.getAuthenticatedUser(Context.java:595)
	at org.openmrs.api.context.Context.isAuthenticated(Context.java:605)
	at org.openmrs.module.serialization.xstream.XStreamSerializer.deserialize(XStreamSerializer.java:332)
	at org.openmrs.module.reporting.serializer.ReportingSerializer.deserialize(ReportingSerializer.java:92)
	at org.openmrs.module.reporting.definition.library.implementerconfigured.BaseImplementerConfiguredDefinitionLibrary.loadDefinitions(BaseImplementerConfiguredDefinitionLibrary.java:134)
	at org.openmrs.module.reporting.definition.library.implementerconfigured.BaseImplementerConfiguredDefinitionLibrary.ensureDefinitions(BaseImplementerConfiguredDefinitionLibrary.java:104)
(35 more lines...)
Collapse Failed ImplementerConfiguredPatientDataDefinitionLibraryTest testSerializedDefinition History
Test against 2.1 < 1 sec
org.openmrs.api.APIException: A user context must first be passed to setUserContext()...use Context.openSession() (and closeSession() to prevent memory leaks!) before using the API
	at org.openmrs.api.context.Context.getUserContext(Context.java:235)
	at org.openmrs.api.context.Context.getAuthenticatedUser(Context.java:587)
	at org.openmrs.api.context.Context.isAuthenticated(Context.java:597)
	at org.openmrs.module.serialization.xstream.XStreamSerializer.deserialize(XStreamSerializer.java:332)
	at org.openmrs.module.reporting.serializer.ReportingSerializer.deserialize(ReportingSerializer.java:92)
	at org.openmrs.module.reporting.definition.library.implementerconfigured.BaseImplementerConfiguredDefinitionLibrary.loadDefinitions(BaseImplementerConfiguredDefinitionLibrary.java:134)
	at org.openmrs.module.reporting.definition.library.implementerconfigured.BaseImplementerConfiguredDefinitionLibrary.ensureDefinitions(BaseImplementerConfiguredDefinitionLibrary.java:104)
(35 more lines...)
Collapse Failed ImplementerConfiguredPatientDataDefinitionLibraryTest testSerializedDefinition History
Test against 1.11 < 1 sec
org.openmrs.api.APIException: A user context must first be passed to setUserContext()...use Context.openSession() (and closeSession() to prevent memory leaks!) before using the API
	at org.openmrs.api.context.Context.getUserContext(Context.java:245)
	at org.openmrs.api.context.Context.getAuthenticatedUser(Context.java:644)
	at org.openmrs.api.context.Context.isAuthenticated(Context.java:651)
	at org.openmrs.module.serialization.xstream.XStreamSerializer.deserialize(XStreamSerializer.java:332)
	at org.openmrs.module.reporting.serializer.ReportingSerializer.deserialize(ReportingSerializer.java:92)
	at org.openmrs.module.reporting.definition.library.implementerconfigured.BaseImplementerConfiguredDefinitionLibrary.loadDefinitions(BaseImplementerConfiguredDefinitionLibrary.java:134)
	at org.openmrs.module.reporting.definition.library.implementerconfigured.BaseImplementerConfiguredDefinitionLibrary.ensureDefinitions(BaseImplementerConfiguredDefinitionLibrary.java:104)
(35 more lines...)
Collapse Failed ImplementerConfiguredPatientDataDefinitionLibraryTest testSerializedDefinition History
Test against 1.12 < 1 sec
org.openmrs.api.APIException: A user context must first be passed to setUserContext()...use Context.openSession() (and closeSession() to prevent memory leaks!) before using the API
	at org.openmrs.api.context.Context.getUserContext(Context.java:246)
	at org.openmrs.api.context.Context.getAuthenticatedUser(Context.java:653)
	at org.openmrs.api.context.Context.isAuthenticated(Context.java:663)
	at org.openmrs.module.serialization.xstream.XStreamSerializer.deserialize(XStreamSerializer.java:332)
	at org.openmrs.module.reporting.serializer.ReportingSerializer.deserialize(ReportingSerializer.java:92)
	at org.openmrs.module.reporting.definition.library.implementerconfigured.BaseImplementerConfiguredDefinitionLibrary.loadDefinitions(BaseImplementerConfiguredDefinitionLibrary.java:134)
	at org.openmrs.module.reporting.definition.library.implementerconfigured.BaseImplementerConfiguredDefinitionLibrary.ensureDefinitions(BaseImplementerConfiguredDefinitionLibrary.java:104)
(35 more lines...)
Collapse Failed ImplementerConfiguredPatientDataDefinitionLibraryTest testSerializedDefinition History
Default Job < 1 sec
org.openmrs.api.APIException: A user context must first be passed to setUserContext()...use Context.openSession() (and closeSession() to prevent memory leaks!) before using the API
	at org.openmrs.api.context.Context.getUserContext(Context.java:237)
	at org.openmrs.api.context.Context.getAuthenticatedUser(Context.java:616)
	at org.openmrs.api.context.Context.isAuthenticated(Context.java:623)
	at org.openmrs.module.serialization.xstream.XStreamSerializer.deserialize(XStreamSerializer.java:332)
	at org.openmrs.module.reporting.serializer.ReportingSerializer.deserialize(ReportingSerializer.java:92)
	at org.openmrs.module.reporting.definition.library.implementerconfigured.BaseImplementerConfiguredDefinitionLibrary.loadDefinitions(BaseImplementerConfiguredDefinitionLibrary.java:134)
	at org.openmrs.module.reporting.definition.library.implementerconfigured.BaseImplementerConfiguredDefinitionLibrary.ensureDefinitions(BaseImplementerConfiguredDefinitionLibrary.java:104)
(35 more lines...)
Collapse Failed ImplementerConfiguredVisitDataDefinitionLibraryTest testSerializedDefinition History
Default Job < 1 sec
org.openmrs.api.APIException: A user context must first be passed to setUserContext()...use Context.openSession() (and closeSession() to prevent memory leaks!) before using the API
	at org.openmrs.api.context.Context.getUserContext(Context.java:237)
	at org.openmrs.api.context.Context.getAuthenticatedUser(Context.java:616)
	at org.openmrs.api.context.Context.isAuthenticated(Context.java:623)
	at org.openmrs.module.serialization.xstream.XStreamSerializer.deserialize(XStreamSerializer.java:332)
	at org.openmrs.module.reporting.serializer.ReportingSerializer.deserialize(ReportingSerializer.java:92)
	at org.openmrs.module.reporting.definition.library.implementerconfigured.BaseImplementerConfiguredDefinitionLibrary.loadDefinitions(BaseImplementerConfiguredDefinitionLibrary.java:134)
	at org.openmrs.module.reporting.definition.library.implementerconfigured.BaseImplementerConfiguredDefinitionLibrary.ensureDefinitions(BaseImplementerConfiguredDefinitionLibrary.java:104)
(35 more lines...)
Collapse Failed ImplementerConfiguredVisitDataDefinitionLibraryTest testSerializedDefinition History
Test against 1.10 < 1 sec
org.openmrs.api.APIException: A user context must first be passed to setUserContext()...use Context.openSession() (and closeSession() to prevent memory leaks!) before using the API
	at org.openmrs.api.context.Context.getUserContext(Context.java:237)
	at org.openmrs.api.context.Context.getAuthenticatedUser(Context.java:616)
	at org.openmrs.api.context.Context.isAuthenticated(Context.java:623)
	at org.openmrs.module.serialization.xstream.XStreamSerializer.deserialize(XStreamSerializer.java:332)
	at org.openmrs.module.reporting.serializer.ReportingSerializer.deserialize(ReportingSerializer.java:92)
	at org.openmrs.module.reporting.definition.library.implementerconfigured.BaseImplementerConfiguredDefinitionLibrary.loadDefinitions(BaseImplementerConfiguredDefinitionLibrary.java:134)
	at org.openmrs.module.reporting.definition.library.implementerconfigured.BaseImplementerConfiguredDefinitionLibrary.ensureDefinitions(BaseImplementerConfiguredDefinitionLibrary.java:104)
(35 more lines...)
Collapse Failed ImplementerConfiguredVisitDataDefinitionLibraryTest testSerializedDefinition History
Test against 2.0 < 1 sec
org.openmrs.api.APIException: A user context must first be passed to setUserContext()...use Context.openSession() (and closeSession() to prevent memory leaks!) before using the API
	at org.openmrs.api.context.Context.getUserContext(Context.java:236)
	at org.openmrs.api.context.Context.getAuthenticatedUser(Context.java:595)
	at org.openmrs.api.context.Context.isAuthenticated(Context.java:605)
	at org.openmrs.module.serialization.xstream.XStreamSerializer.deserialize(XStreamSerializer.java:332)
	at org.openmrs.module.reporting.serializer.ReportingSerializer.deserialize(ReportingSerializer.java:92)
	at org.openmrs.module.reporting.definition.library.implementerconfigured.BaseImplementerConfiguredDefinitionLibrary.loadDefinitions(BaseImplementerConfiguredDefinitionLibrary.java:134)
	at org.openmrs.module.reporting.definition.library.implementerconfigured.BaseImplementerConfiguredDefinitionLibrary.ensureDefinitions(BaseImplementerConfiguredDefinitionLibrary.java:104)
(35 more lines...)
Collapse Failed ImplementerConfiguredVisitDataDefinitionLibraryTest testSerializedDefinition History
Test against 2.1 < 1 sec
org.openmrs.api.APIException: A user context must first be passed to setUserContext()...use Context.openSession() (and closeSession() to prevent memory leaks!) before using the API
	at org.openmrs.api.context.Context.getUserContext(Context.java:235)
	at org.openmrs.api.context.Context.getAuthenticatedUser(Context.java:587)
	at org.openmrs.api.context.Context.isAuthenticated(Context.java:597)
	at org.openmrs.module.serialization.xstream.XStreamSerializer.deserialize(XStreamSerializer.java:332)
	at org.openmrs.module.reporting.serializer.ReportingSerializer.deserialize(ReportingSerializer.java:92)
	at org.openmrs.module.reporting.definition.library.implementerconfigured.BaseImplementerConfiguredDefinitionLibrary.loadDefinitions(BaseImplementerConfiguredDefinitionLibrary.java:134)
	at org.openmrs.module.reporting.definition.library.implementerconfigured.BaseImplementerConfiguredDefinitionLibrary.ensureDefinitions(BaseImplementerConfiguredDefinitionLibrary.java:104)
(35 more lines...)
Collapse Failed ImplementerConfiguredVisitDataDefinitionLibraryTest testSerializedDefinition History
Test against 1.11 < 1 sec
org.openmrs.api.APIException: A user context must first be passed to setUserContext()...use Context.openSession() (and closeSession() to prevent memory leaks!) before using the API
	at org.openmrs.api.context.Context.getUserContext(Context.java:245)
	at org.openmrs.api.context.Context.getAuthenticatedUser(Context.java:644)
	at org.openmrs.api.context.Context.isAuthenticated(Context.java:651)
	at org.openmrs.module.serialization.xstream.XStreamSerializer.deserialize(XStreamSerializer.java:332)
	at org.openmrs.module.reporting.serializer.ReportingSerializer.deserialize(ReportingSerializer.java:92)
	at org.openmrs.module.reporting.definition.library.implementerconfigured.BaseImplementerConfiguredDefinitionLibrary.loadDefinitions(BaseImplementerConfiguredDefinitionLibrary.java:134)
	at org.openmrs.module.reporting.definition.library.implementerconfigured.BaseImplementerConfiguredDefinitionLibrary.ensureDefinitions(BaseImplementerConfiguredDefinitionLibrary.java:104)
(35 more lines...)
Collapse Failed ImplementerConfiguredVisitDataDefinitionLibraryTest testSerializedDefinition History
Test against 1.12 < 1 sec
org.openmrs.api.APIException: A user context must first be passed to setUserContext()...use Context.openSession() (and closeSession() to prevent memory leaks!) before using the API
	at org.openmrs.api.context.Context.getUserContext(Context.java:246)
	at org.openmrs.api.context.Context.getAuthenticatedUser(Context.java:653)
	at org.openmrs.api.context.Context.isAuthenticated(Context.java:663)
	at org.openmrs.module.serialization.xstream.XStreamSerializer.deserialize(XStreamSerializer.java:332)
	at org.openmrs.module.reporting.serializer.ReportingSerializer.deserialize(ReportingSerializer.java:92)
	at org.openmrs.module.reporting.definition.library.implementerconfigured.BaseImplementerConfiguredDefinitionLibrary.loadDefinitions(BaseImplementerConfiguredDefinitionLibrary.java:134)
	at org.openmrs.module.reporting.definition.library.implementerconfigured.BaseImplementerConfiguredDefinitionLibrary.ensureDefinitions(BaseImplementerConfiguredDefinitionLibrary.java:104)
(35 more lines...)
Existing test failures 17
Status Test Failing since View job Duration
java.lang.AssertionError: expected:<2> but was:<3>
	at org.junit.Assert.fail(Assert.java:88)
	at org.junit.Assert.failNotEquals(Assert.java:834)
	at org.junit.Assert.assertEquals(Assert.java:645)
	at org.junit.Assert.assertEquals(Assert.java:631)
	at org.openmrs.module.reporting.cohort.definition.evaluator.AgeCohortDefinitionEvaluatorTest.testAgeRange(AgeCohortDefinitionEvaluatorTest.java:112)
	at org.openmrs.module.reporting.cohort.definition.evaluator.AgeCohortDefinitionEvaluatorTest.evaluate_shouldReturnOnlyPatientsBornOnOrBeforeTheEvaluationDate(AgeCohortDefinitionEvaluatorTest.java:47)
	at sun.reflect.NativeMethodAccessorImpl.invoke0(Native Method)
(35 more lines...)
java.lang.AssertionError: expected:<1> but was:<0>
	at org.junit.Assert.fail(Assert.java:88)
	at org.junit.Assert.failNotEquals(Assert.java:834)
	at org.junit.Assert.assertEquals(Assert.java:645)
	at org.junit.Assert.assertEquals(Assert.java:631)
	at org.openmrs.module.reporting.cohort.definition.evaluator.AgeCohortDefinitionEvaluatorTest.testAgeRange(AgeCohortDefinitionEvaluatorTest.java:112)
	at org.openmrs.module.reporting.cohort.definition.evaluator.AgeCohortDefinitionEvaluatorTest.evaluate_shouldReturnOnlyPatientsInTheGivenAgeRange(AgeCohortDefinitionEvaluatorTest.java:60)
	at sun.reflect.NativeMethodAccessorImpl.invoke0(Native Method)
(35 more lines...)
java.lang.AssertionError: expected:<8> but was:<9>
	at org.junit.Assert.fail(Assert.java:88)
	at org.junit.Assert.failNotEquals(Assert.java:834)
	at org.junit.Assert.assertEquals(Assert.java:645)
	at org.junit.Assert.assertEquals(Assert.java:631)
	at org.openmrs.module.reporting.cohort.definition.evaluator.PatientIdentifierCohortDefinitionEvaluatorTest.evaluate_shouldReturnPatientsWhoHaveIdentifiersMatchingThePassedLocations(PatientIdentifierCohortDefinitionEvaluatorTest.java:82)
	at sun.reflect.NativeMethodAccessorImpl.invoke0(Native Method)
	at sun.reflect.NativeMethodAccessorImpl.invoke(NativeMethodAccessorImpl.java:62)
(34 more lines...)
java.lang.AssertionError: expected:<8> but was:<9>
	at org.junit.Assert.fail(Assert.java:88)
	at org.junit.Assert.failNotEquals(Assert.java:834)
	at org.junit.Assert.assertEquals(Assert.java:645)
	at org.junit.Assert.assertEquals(Assert.java:631)
	at org.openmrs.module.reporting.cohort.definition.evaluator.PatientIdentifierCohortDefinitionEvaluatorTest.evaluate_shouldReturnPatientsWhoHaveIdentifiersOfThePassedTypes(PatientIdentifierCohortDefinitionEvaluatorTest.java:57)
	at sun.reflect.NativeMethodAccessorImpl.invoke0(Native Method)
	at sun.reflect.NativeMethodAccessorImpl.invoke(NativeMethodAccessorImpl.java:62)
(34 more lines...)
org.openmrs.api.ValidationException: 'Visit #null' failed to validate with reason: startDatetime: Visit.startDateCannotFallBeforeTheBirthDateOfTheSamePatient
	at org.openmrs.validator.ValidateUtil.validate(ValidateUtil.java:82)
	at org.openmrs.aop.RequiredDataAdvice.before(RequiredDataAdvice.java:127)
	at org.springframework.aop.framework.adapter.MethodBeforeAdviceInterceptor.invoke(MethodBeforeAdviceInterceptor.java:51)
	at org.springframework.aop.framework.ReflectiveMethodInvocation.proceed(ReflectiveMethodInvocation.java:179)
	at org.springframework.aop.framework.adapter.MethodBeforeAdviceInterceptor.invoke(MethodBeforeAdviceInterceptor.java:52)
	at org.springframework.aop.framework.ReflectiveMethodInvocation.proceed(ReflectiveMethodInvocation.java:179)
	at org.springframework.aop.framework.JdkDynamicAopProxy.invoke(JdkDynamicAopProxy.java:207)
(39 more lines...)
org.openmrs.api.ValidationException: 'Visit #null' failed to validate with reason: startDatetime: Visit.startDateCannotFallBeforeTheBirthDateOfTheSamePatient
	at org.openmrs.validator.ValidateUtil.validate(ValidateUtil.java:82)
	at org.openmrs.aop.RequiredDataAdvice.before(RequiredDataAdvice.java:127)
	at org.springframework.aop.framework.adapter.MethodBeforeAdviceInterceptor.invoke(MethodBeforeAdviceInterceptor.java:51)
	at org.springframework.aop.framework.ReflectiveMethodInvocation.proceed(ReflectiveMethodInvocation.java:179)
	at org.springframework.aop.framework.adapter.MethodBeforeAdviceInterceptor.invoke(MethodBeforeAdviceInterceptor.java:52)
	at org.springframework.aop.framework.ReflectiveMethodInvocation.proceed(ReflectiveMethodInvocation.java:179)
	at org.springframework.aop.framework.JdkDynamicAopProxy.invoke(JdkDynamicAopProxy.java:207)
(39 more lines...)
org.openmrs.api.ValidationException: 'Visit #null' failed to validate with reason: startDatetime: Visit.startDateCannotFallBeforeTheBirthDateOfTheSamePatient
	at org.openmrs.validator.ValidateUtil.validate(ValidateUtil.java:82)
	at org.openmrs.aop.RequiredDataAdvice.before(RequiredDataAdvice.java:127)
	at org.springframework.aop.framework.adapter.MethodBeforeAdviceInterceptor.invoke(MethodBeforeAdviceInterceptor.java:51)
	at org.springframework.aop.framework.ReflectiveMethodInvocation.proceed(ReflectiveMethodInvocation.java:179)
	at org.springframework.aop.framework.adapter.MethodBeforeAdviceInterceptor.invoke(MethodBeforeAdviceInterceptor.java:52)
	at org.springframework.aop.framework.ReflectiveMethodInvocation.proceed(ReflectiveMethodInvocation.java:179)
	at org.springframework.aop.framework.JdkDynamicAopProxy.invoke(JdkDynamicAopProxy.java:207)
(39 more lines...)
org.openmrs.api.ValidationException: 'Visit #null' failed to validate with reason: startDatetime: Visit.startDateCannotFallBeforeTheBirthDateOfTheSamePatient
	at org.openmrs.validator.ValidateUtil.validate(ValidateUtil.java:82)
	at org.openmrs.aop.RequiredDataAdvice.before(RequiredDataAdvice.java:127)
	at org.springframework.aop.framework.adapter.MethodBeforeAdviceInterceptor.invoke(MethodBeforeAdviceInterceptor.java:51)
	at org.springframework.aop.framework.ReflectiveMethodInvocation.proceed(ReflectiveMethodInvocation.java:179)
	at org.springframework.aop.framework.adapter.MethodBeforeAdviceInterceptor.invoke(MethodBeforeAdviceInterceptor.java:52)
	at org.springframework.aop.framework.ReflectiveMethodInvocation.proceed(ReflectiveMethodInvocation.java:179)
	at org.springframework.aop.framework.JdkDynamicAopProxy.invoke(JdkDynamicAopProxy.java:207)
(39 more lines...)
java.lang.AssertionError: expected:<3> but was:<5>
	at org.junit.Assert.fail(Assert.java:88)
	at org.junit.Assert.failNotEquals(Assert.java:834)
	at org.junit.Assert.assertEquals(Assert.java:645)
	at org.junit.Assert.assertEquals(Assert.java:631)
	at org.openmrs.module.reporting.dataset.definition.evaluator.MultiParameterDataSetEvaluatorTest.evaluate_shouldEvaluateAMultiParameterDataSetDefinition(MultiParameterDataSetEvaluatorTest.java:80)
	at sun.reflect.NativeMethodAccessorImpl.invoke0(Native Method)
	at sun.reflect.NativeMethodAccessorImpl.invoke(NativeMethodAccessorImpl.java:62)
(34 more lines...)
java.lang.AssertionError: expected:<Sun May 27 00:00:00 UTC 2007> but was:<1975-05-27 00:00:00.0>
	at org.junit.Assert.fail(Assert.java:88)
	at org.junit.Assert.failNotEquals(Assert.java:834)
	at org.junit.Assert.assertEquals(Assert.java:118)
	at org.junit.Assert.assertEquals(Assert.java:144)
	at org.openmrs.module.reporting.dataset.definition.evaluator.MultiPeriodIndicatorDataSetEvaluatorTest.evaluate_shouldEvaluateAMultiPeriodIndicatorDataSetDefinition(MultiPeriodIndicatorDataSetEvaluatorTest.java:53)
	at sun.reflect.NativeMethodAccessorImpl.invoke0(Native Method)
	at sun.reflect.NativeMethodAccessorImpl.invoke(NativeMethodAccessorImpl.java:62)
(34 more lines...)
org.openmrs.api.APIException: A user context must first be passed to setUserContext()...use Context.openSession() (and closeSession() to prevent memory leaks!) before using the API
	at org.openmrs.api.context.Context.getUserContext(Context.java:230)
	at org.openmrs.api.context.Context.getAuthenticatedUser(Context.java:598)
	at org.openmrs.api.context.Context.isAuthenticated(Context.java:608)
	at org.openmrs.module.serialization.xstream.XStreamSerializer.deserialize(XStreamSerializer.java:332)
	at org.openmrs.module.reporting.serializer.ReportingSerializer.deserialize(ReportingSerializer.java:92)
	at org.openmrs.module.reporting.definition.library.implementerconfigured.BaseImplementerConfiguredDefinitionLibrary.loadDefinitions(BaseImplementerConfiguredDefinitionLibrary.java:134)
	at org.openmrs.module.reporting.definition.library.implementerconfigured.BaseImplementerConfiguredDefinitionLibrary.ensureDefinitions(BaseImplementerConfiguredDefinitionLibrary.java:104)
(38 more lines...)
org.openmrs.api.APIException: A user context must first be passed to setUserContext()...use Context.openSession() (and closeSession() to prevent memory leaks!) before using the API
	at org.openmrs.api.context.Context.getUserContext(Context.java:230)
	at org.openmrs.api.context.Context.getAuthenticatedUser(Context.java:598)
	at org.openmrs.api.context.Context.isAuthenticated(Context.java:608)
	at org.openmrs.module.serialization.xstream.XStreamSerializer.deserialize(XStreamSerializer.java:332)
	at org.openmrs.module.reporting.serializer.ReportingSerializer.deserialize(ReportingSerializer.java:92)
	at org.openmrs.module.reporting.definition.library.implementerconfigured.BaseImplementerConfiguredDefinitionLibrary.loadDefinitions(BaseImplementerConfiguredDefinitionLibrary.java:134)
	at org.openmrs.module.reporting.definition.library.implementerconfigured.BaseImplementerConfiguredDefinitionLibrary.ensureDefinitions(BaseImplementerConfiguredDefinitionLibrary.java:104)
(38 more lines...)
org.openmrs.api.APIException: A user context must first be passed to setUserContext()...use Context.openSession() (and closeSession() to prevent memory leaks!) before using the API
	at org.openmrs.api.context.Context.getUserContext(Context.java:230)
	at org.openmrs.api.context.Context.getAuthenticatedUser(Context.java:598)
	at org.openmrs.api.context.Context.isAuthenticated(Context.java:608)
	at org.openmrs.module.serialization.xstream.XStreamSerializer.deserialize(XStreamSerializer.java:332)
	at org.openmrs.module.reporting.serializer.ReportingSerializer.deserialize(ReportingSerializer.java:92)
	at org.openmrs.module.reporting.definition.library.implementerconfigured.BaseImplementerConfiguredDefinitionLibrary.loadDefinitions(BaseImplementerConfiguredDefinitionLibrary.java:134)
	at org.openmrs.module.reporting.definition.library.implementerconfigured.BaseImplementerConfiguredDefinitionLibrary.ensureDefinitions(BaseImplementerConfiguredDefinitionLibrary.java:104)
(38 more lines...)
org.openmrs.api.APIException: A user context must first be passed to setUserContext()...use Context.openSession() (and closeSession() to prevent memory leaks!) before using the API
	at org.openmrs.api.context.Context.getUserContext(Context.java:230)
	at org.openmrs.api.context.Context.getAuthenticatedUser(Context.java:598)
	at org.openmrs.api.context.Context.isAuthenticated(Context.java:608)
	at org.openmrs.module.serialization.xstream.XStreamSerializer.deserialize(XStreamSerializer.java:332)
	at org.openmrs.module.reporting.serializer.ReportingSerializer.deserialize(ReportingSerializer.java:92)
	at org.openmrs.module.reporting.definition.library.implementerconfigured.BaseImplementerConfiguredDefinitionLibrary.loadDefinitions(BaseImplementerConfiguredDefinitionLibrary.java:134)
	at org.openmrs.module.reporting.definition.library.implementerconfigured.BaseImplementerConfiguredDefinitionLibrary.ensureDefinitions(BaseImplementerConfiguredDefinitionLibrary.java:104)
(38 more lines...)
org.openmrs.api.APIException: A user context must first be passed to setUserContext()...use Context.openSession() (and closeSession() to prevent memory leaks!) before using the API
	at org.openmrs.api.context.Context.getUserContext(Context.java:230)
	at org.openmrs.api.context.Context.getAuthenticatedUser(Context.java:598)
	at org.openmrs.api.context.Context.isAuthenticated(Context.java:608)
	at org.openmrs.module.serialization.xstream.XStreamSerializer.deserialize(XStreamSerializer.java:332)
	at org.openmrs.module.reporting.serializer.ReportingSerializer.deserialize(ReportingSerializer.java:92)
	at org.openmrs.module.reporting.definition.library.implementerconfigured.BaseImplementerConfiguredDefinitionLibrary.loadDefinitions(BaseImplementerConfiguredDefinitionLibrary.java:134)
	at org.openmrs.module.reporting.definition.library.implementerconfigured.BaseImplementerConfiguredDefinitionLibrary.ensureDefinitions(BaseImplementerConfiguredDefinitionLibrary.java:104)
(38 more lines...)
org.junit.ComparisonFailure: expected:<...r><birthdate>27/May/[2007]</birthdate></row><r...> but was:<...r><birthdate>27/May/[1975]</birthdate></row><r...>
	at org.junit.Assert.assertEquals(Assert.java:115)
	at org.junit.Assert.assertEquals(Assert.java:144)
	at org.openmrs.module.reporting.report.renderer.TextTemplateRendererTest.shouldRenderTemplate(TextTemplateRendererTest.java:114)
	at org.openmrs.module.reporting.report.renderer.TextTemplateRendererTest.shouldRenderVelocityTemplate(TextTemplateRendererTest.java:49)
	at sun.reflect.NativeMethodAccessorImpl.invoke0(Native Method)
	at sun.reflect.NativeMethodAccessorImpl.invoke(NativeMethodAccessorImpl.java:62)
	at sun.reflect.DelegatingMethodAccessorImpl.invoke(DelegatingMethodAccessorImpl.java:43)
(33 more lines...)
org.junit.ComparisonFailure: expected:<...r><birthdate>27/May/[2007]</birthdate></row><r...> but was:<...r><birthdate>27/May/[1975]</birthdate></row><r...>
	at org.junit.Assert.assertEquals(Assert.java:115)
	at org.junit.Assert.assertEquals(Assert.java:144)
	at org.openmrs.module.reporting.report.renderer.TextTemplateRendererTest.shouldRenderTemplate(TextTemplateRendererTest.java:114)
	at org.openmrs.module.reporting.report.renderer.TextTemplateRendererTest.shouldRenderGroovyTemplate(TextTemplateRendererTest.java:44)
	at sun.reflect.NativeMethodAccessorImpl.invoke0(Native Method)
	at sun.reflect.NativeMethodAccessorImpl.invoke(NativeMethodAccessorImpl.java:62)
	at sun.reflect.DelegatingMethodAccessorImpl.invoke(DelegatingMethodAccessorImpl.java:43)
(33 more lines...)
Fixed tests 606
Status Test Failing since View job Duration
Successful PatientDataCalculationBehaviorTest evaluate_shouldEvaluateAPatientCalculationWithTheSpecifiedParameterValues History
Failing since build #782 (Manual run by Mike Seaton) Test against 2.2 < 1 sec
Successful PatientDataCalculationBehaviorTest evaluate_shouldEvaluateTheSpecifiedPersonCalculation History
Failing since build #782 (Manual run by Mike Seaton) Test against 2.2 < 1 sec
Successful PatientDataCalculationBehaviorTest evaluate_shouldEvaluateAPatientCalculation History
Failing since build #782 (Manual run by Mike Seaton) Test against 2.2 < 1 sec
Successful CohortsTest testFemales History
Failing since build #782 (Manual run by Mike Seaton) Test against 2.2 < 1 sec
Successful CohortsTest testAllPatients History
Failing since build #782 (Manual run by Mike Seaton) Test against 2.2 < 1 sec
Successful CohortsTest testMales History
Failing since build #782 (Manual run by Mike Seaton) Test against 2.2 < 1 sec
Successful AgeCohortDefinitionEvaluatorTest evaluate_shouldReturnOnlyNonVoidedPatients History
Failing since build #782 (Manual run by Mike Seaton) Test against 2.2 < 1 sec
Successful AgeCohortDefinitionEvaluatorTest evaluate_shouldHandleBoundaryConditionCorrectly History
Failing since build #782 (Manual run by Mike Seaton) Test against 2.2 < 1 sec
Successful AgeCohortDefinitionEvaluatorTest evaluate_shouldOnlyReturnPatientsWithUnknownAgeIfSpecified History
Failing since build #782 (Manual run by Mike Seaton) Test against 2.2 < 1 sec
Successful AllPatientsCohortDefinitionEvaluatorTest evaluate_shouldReturnAllNonVoidedPatientsOptionallyLimitedToThoseInThePassedContext History
Failing since build #782 (Manual run by Mike Seaton) Test against 2.2 < 1 sec
Successful BirthAndDeathCohortDefinitionEvaluatorTest evaluate_shouldReturnPatientsWhoDiedWithoutDeathDate History
Failing since build #782 (Manual run by Mike Seaton) Test against 2.2 < 1 sec
Successful BirthAndDeathCohortDefinitionEvaluatorTest evaluate_shouldFindPatientsByBirthRangeAndDeathRange History
Failing since build #782 (Manual run by Mike Seaton) Test against 2.2 < 1 sec
Successful BirthAndDeathCohortDefinitionEvaluatorTest evaluate_shouldFindPatientsThatDiedOnTheOnOrBeforeDateIfPassedInTimeIsAtMidnight History
Failing since build #782 (Manual run by Mike Seaton) Test against 2.2 < 1 sec
Successful BirthAndDeathCohortDefinitionEvaluatorTest evaluate_shouldFindPatientsByDeathRange History
Failing since build #782 (Manual run by Mike Seaton) Test against 2.2 < 1 sec
Successful BirthAndDeathCohortDefinitionEvaluatorTest evaluate_shouldFindPatientsBornOnTheOnOrBeforeDateIfPassedInTimeIsAtMidnight History
Failing since build #782 (Manual run by Mike Seaton) Test against 2.2 < 1 sec
Successful BirthAndDeathCohortDefinitionEvaluatorTest evaluate_shouldFindPatientsBornAfterTheSpecifiedDate History
Failing since build #782 (Manual run by Mike Seaton) Test against 2.2 < 1 sec
Successful BirthAndDeathCohortDefinitionEvaluatorTest evaluate_shouldFindPatientsThatDiedAfterTheSpecifiedDate History
Failing since build #782 (Manual run by Mike Seaton) Test against 2.2 < 1 sec
Successful BirthAndDeathCohortDefinitionEvaluatorTest evaluate_shouldFindPatientsByBirthRange History
Failing since build #782 (Manual run by Mike Seaton) Test against 2.2 < 1 sec
Successful CodedObsCohortDefinitionEvaluatorTest evaluate_shouldTestAnyWithManyPropertiesSpecified History
Failing since build #782 (Manual run by Mike Seaton) Test against 2.2 < 1 sec
Successful CodedObsCohortDefinitionEvaluatorTest evaluate_shouldTestThatObsAreRestrictedByEncounterType History
Failing since build #782 (Manual run by Mike Seaton) Test against 2.2 < 1 sec
Successful CodedObsCohortDefinitionEvaluatorTest evaluate_shouldTestLastWithManyPropertiesSpecified History
Failing since build #782 (Manual run by Mike Seaton) Test against 2.2 < 1 sec
Successful CompositionCohortDefinitionEvaluatorTest evaluate_shouldHandleNot History
Failing since build #782 (Manual run by Mike Seaton) Test against 2.2 < 1 sec
Successful CompositionCohortDefinitionEvaluatorTest evaluate_shouldHandleParenthesis History
Failing since build #782 (Manual run by Mike Seaton) Test against 2.2 < 1 sec
Successful CompositionCohortDefinitionEvaluatorTest evaluate_shouldHandleOr History
Failing since build #782 (Manual run by Mike Seaton) Test against 2.2 < 1 sec
Successful CompositionCohortDefinitionEvaluatorTest evaluate_shouldHandleAnd History
Failing since build #782 (Manual run by Mike Seaton) Test against 2.2 < 1 sec
Successful ConditionalParameterCohortDefinitionEvaluatorTest evaluate_shouldSupportIntegerParameter History
Failing since build #782 (Manual run by Mike Seaton) Test against 2.2 < 1 sec
Successful DateObsCohortDefinitionEvaluatorTest evaluate_shouldTestAnyWithManyPropertiesSpecified History
Failing since build #782 (Manual run by Mike Seaton) Test against 2.2 < 1 sec
Successful DateObsCohortDefinitionEvaluatorTest evaluate_shouldFindNobodyIfNoPatientsMatch History
Failing since build #782 (Manual run by Mike Seaton) Test against 2.2 < 1 sec
Successful DateObsCohortDefinitionEvaluatorTest evaluate_shouldReturnPatientsWithObsWithinTheSpecifiedTimeframe History
Failing since build #782 (Manual run by Mike Seaton) Test against 2.2 < 1 sec
Successful DefinitionLibraryCohortDefinitionEvaluatorTest testEvaluateWithParameterValues History
Failing since build #782 (Manual run by Mike Seaton) Test against 2.2 < 1 sec
Successful DefinitionLibraryCohortDefinitionEvaluatorTest testEvaluateWithNoParameters History
Failing since build #782 (Manual run by Mike Seaton) Test against 2.2 < 1 sec
Successful DefinitionLibraryCohortDefinitionEvaluatorTest testCachingDoesNotHappenIncorrectly History
Failing since build #782 (Manual run by Mike Seaton) Test against 2.2 < 1 sec
Successful EncounterCohortDefinitionEvaluatorTest evaluate_shouldFindPatientsWithEncountersCreatedOnTheSpecifiedDateIfPassedInTimeIsAtMidnight History
Failing since build #782 (Manual run by Mike Seaton) Test against 2.2 < 1 sec
Successful EncounterCohortDefinitionEvaluatorTest evaluate_shouldReturnAllPatientsWithEncountersIfAllArgumentsToCohortDefinitionAreEmpty History
Failing since build #782 (Manual run by Mike Seaton) Test against 2.2 < 1 sec
Successful EncounterCohortDefinitionEvaluatorTest evaluate_shouldReturnCorrectPatientsWhenAllNonGroupingParametersAreSet History
Failing since build #782 (Manual run by Mike Seaton) Test against 2.2 < 1 sec
Successful EncounterCohortDefinitionEvaluatorTest evaluate_shouldReturnCorrectPatientsWhenTimeQualifierParametersAreSet History
Failing since build #782 (Manual run by Mike Seaton) Test against 2.2 < 1 sec
Successful EncounterCohortDefinitionEvaluatorTest evaluate_shouldReturnCorrectPatientsWhenCreationDateParametersAreSet History
Failing since build #782 (Manual run by Mike Seaton) Test against 2.2 < 1 sec
Successful EncounterCohortDefinitionEvaluatorTest evaluate_shouldFindPatientsWithEncountersOnTheOnOrBeforeDateIfPassedInTimeIsAtMidnight History
Failing since build #782 (Manual run by Mike Seaton) Test against 2.2 < 1 sec
Successful EncounterCohortDefinitionEvaluatorTest evaluate_shouldReturnCorrectPatientsWhenAllParametersAreSet History
Failing since build #782 (Manual run by Mike Seaton) Test against 2.2 < 1 sec
Successful EncounterWithCodedObsCohortDefinitionEvaluatorTest testEvaluateExcludingValue History
Failing since build #782 (Manual run by Mike Seaton) Test against 2.2 < 1 sec
Successful EncounterWithCodedObsCohortDefinitionEvaluatorTest testEvaluateIncludingValue History
Failing since build #782 (Manual run by Mike Seaton) Test against 2.2 < 1 sec
Successful EncounterWithCodedObsCohortDefinitionEvaluatorTest testDateRange History
Failing since build #782 (Manual run by Mike Seaton) Test against 2.2 < 1 sec
Successful EncounterWithCodedObsCohortDefinitionEvaluatorTest testEvaluateNullValue History
Failing since build #782 (Manual run by Mike Seaton) Test against 2.2 < 1 sec
Successful EvaluatableCohortDefinitionEvaluatorTest evaluate History
Failing since build #782 (Manual run by Mike Seaton) Test against 2.2 < 1 sec
Successful GenderCohortDefinitionEvaluatorTest evaluate_shouldReturnMalePatientsWhenMalesAreIncluded History
Failing since build #782 (Manual run by Mike Seaton) Test against 2.2 < 1 sec
Successful GenderCohortDefinitionEvaluatorTest evaluate_shouldReturnFemalePatientsWhenFemalesAreIncluded History
Failing since build #782 (Manual run by Mike Seaton) Test against 2.2 < 1 sec
Successful GenderCohortDefinitionEvaluatorTest evaluate_shouldReturnNoPatientsWhenNoneAreIncluded History
Failing since build #782 (Manual run by Mike Seaton) Test against 2.2 < 1 sec
Successful GenderCohortDefinitionEvaluatorTest evaluate_shouldReturnAllNonVoidedPatientsWhenAllAreIncluded History
Failing since build #782 (Manual run by Mike Seaton) Test against 2.2 < 1 sec
Successful GenderCohortDefinitionEvaluatorTest evaluate_shouldReturnPatientsWithUnknownGenderWhenUnknownAreIncluded History
Failing since build #782 (Manual run by Mike Seaton) Test against 2.2 < 1 sec
Successful InProgramCohortDefinitionEvaluatorTest evaluate_shouldReturnPatientsEnrolledInTheGivenProgramsOnOrBeforeTheGivenDate History
Failing since build #782 (Manual run by Mike Seaton) Test against 2.2 < 1 sec
Successful InProgramCohortDefinitionEvaluatorTest evaluate_shouldFindPatientsInAProgramOnTheOnOrBeforeDateIfPassedInTimeIsAtMidnight History
Failing since build #782 (Manual run by Mike Seaton) Test against 2.2 < 1 sec
Successful InProgramCohortDefinitionEvaluatorTest evaluate_shouldReturnPatientsEnrolledInTheGivenProgramsAtTheGivenLocations History
Failing since build #782 (Manual run by Mike Seaton) Test against 2.2 < 1 sec
Successful InProgramCohortDefinitionEvaluatorTest evaluate_shouldReturnPatientsEnrolledAtEvaluationDateIfNoOtherDatesSupplied History
Failing since build #782 (Manual run by Mike Seaton) Test against 2.2 < 1 sec
Successful InProgramCohortDefinitionEvaluatorTest evaluate_shouldReturnPatientsEnrolledInTheGivenProgramsOnOrAfterTheGivenDate History
Failing since build #782 (Manual run by Mike Seaton) Test against 2.2 < 1 sec
Successful InStateCohortDefinitionEvaluatorTest evaluate_shouldReturnPatientsInTheGivenStateOnOrAfterTheGivenEndDate History
Failing since build #782 (Manual run by Mike Seaton) Test against 2.2 < 1 sec
Successful InStateCohortDefinitionEvaluatorTest evaluate_shouldReturnPatientsInTheGivenStateOnOrBeforeTheGivenStartDate History
Failing since build #782 (Manual run by Mike Seaton) Test against 2.2 < 1 sec
Successful InStateCohortDefinitionEvaluatorTest evaluate_shouldReturnPatientsEnrolledAtEvaluationDateIfNoOtherDatesSupplied History
Failing since build #782 (Manual run by Mike Seaton) Test against 2.2 < 1 sec
Successful InStateCohortDefinitionEvaluatorTest evaluate_shouldReturnPatientsInGivenStateOnGivenDate History
Failing since build #782 (Manual run by Mike Seaton) Test against 2.2 < 1 sec
Successful InStateCohortDefinitionEvaluatorTest evaluate_shouldReturnPatientsEnrolledInTheGivenProgramsAtTheGivenLocations History
Failing since build #782 (Manual run by Mike Seaton) Test against 2.2 < 1 sec
Successful InStateCohortDefinitionEvaluatorTest evaluate_shouldFindPatientsInAStateOnTheOnOrBeforeDateIfPassedInTimeIsAtMidnight History
Failing since build #782 (Manual run by Mike Seaton) Test against 2.2 < 1 sec
Successful InStateCohortDefinitionEvaluatorTest evaluate_shouldReturnNoPatientsIfNoneHaveTheGivenState History
Failing since build #782 (Manual run by Mike Seaton) Test against 2.2 < 1 sec
Successful InverseCohortDefinitionEvaluatorTest evaluate_shouldReturnAllPatientsWhoAreNotInTheInnerCohortDefinition History
Failing since build #782 (Manual run by Mike Seaton) Test against 2.2 < 1 sec
Successful InverseCohortDefinitionEvaluatorTest evaluate_shouldSuccessfullyUseTheContextBaseCohort History
Failing since build #782 (Manual run by Mike Seaton) Test against 2.2 < 1 sec
Successful MappedParametersCohortDefinitionEvaluatorTest testEvaluate History
Failing since build #782 (Manual run by Mike Seaton) Test against 2.2 < 1 sec
Successful NumericObsCohortDefinitionEvaluatorTest evaluate_shouldTestAvgWithManyPropertiesSpecified History
Failing since build #782 (Manual run by Mike Seaton) Test against 2.2 < 1 sec
Successful NumericObsCohortDefinitionEvaluatorTest getPatientsHavingRangedObs_shouldGetPatientsWhoseFirstObsOfASpecifiedConceptIsInARange History
Failing since build #782 (Manual run by Mike Seaton) Test against 2.2 < 1 sec
Successful NumericObsCohortDefinitionEvaluatorTest getPatientsHavingRangedObs_shouldGetPatientsWithAnyObsOfASpecifiedConceptInASpecifiedEncounterType History
Failing since build #782 (Manual run by Mike Seaton) Test against 2.2 < 1 sec
Successful NumericObsCohortDefinitionEvaluatorTest getPatientsHavingRangedObs_shouldGetPatientsWhoseMaximumObsOfASpecifiedConceptInASpecifiedEncounterTypeIsEqualsToASpecifiedValue History
Failing since build #782 (Manual run by Mike Seaton) Test against 2.2 < 1 sec
Successful NumericObsCohortDefinitionEvaluatorTest evaluate_shouldTestAnyWithManyPropertiesSpecified History
Failing since build #782 (Manual run by Mike Seaton) Test against 2.2 < 1 sec
Successful NumericObsCohortDefinitionEvaluatorTest getPatientsHavingRangedObs_shouldGetPatientsWithAQueryWithAllParameters History
Failing since build #782 (Manual run by Mike Seaton) Test against 2.2 < 1 sec
Successful NumericObsCohortDefinitionEvaluatorTest evaluate_shouldGetPatientsWithAnyObsOfASpecifiedConcept History
Failing since build #782 (Manual run by Mike Seaton) Test against 2.2 < 1 sec
Successful NumericObsCohortDefinitionEvaluatorTest getPatientsHavingRangedObs_shouldGetPatientsWithAnyObsOfASpecifiedConcept History
Failing since build #782 (Manual run by Mike Seaton) Test against 2.2 < 1 sec
Successful NumericObsCohortDefinitionEvaluatorTest getPatientsHavingRangedObs_shouldGetPatientsWhoseMaximumObsOfASpecifiedConceptIsEqualToASpecifiedValue History
Failing since build #782 (Manual run by Mike Seaton) Test against 2.2 < 1 sec
Successful NumericObsCohortDefinitionEvaluatorTest evaluate_shouldTestLastWithManyPropertiesSpecified History
Failing since build #782 (Manual run by Mike Seaton) Test against 2.2 < 1 sec
Successful NumericObsCohortDefinitionEvaluatorTest getPatientsHavingRangedObs_shouldGetPatientsWhoseFirstObsOfASpecifiedConceptInASpecifiedEncounterTypeIsInARange History
Failing since build #782 (Manual run by Mike Seaton) Test against 2.2 < 1 sec
Successful OptionalParameterCohortDefinitionEvaluatorTest evaluate_shouldSupportIntegerParameter History
Failing since build #782 (Manual run by Mike Seaton) Test against 2.2 < 1 sec
Successful PatientIdentifierCohortDefinitionEvaluatorTest evaluate_shouldReturnPatientsWhoHaveIdentifiersMatchingThePassedRegularExpression History
Failing since build #782 (Manual run by Mike Seaton) Test against 2.2 < 1 sec
Successful PatientIdentifierCohortDefinitionEvaluatorTest evaluate_shouldReturnPatientsWhoHaveIdentifiersMatchingThePassedText History
Failing since build #782 (Manual run by Mike Seaton) Test against 2.2 < 1 sec
Successful PatientStateCohortDefinitionEvaluatorTest evaluate_shouldReturnPatientsInTheSpecifiedStatesAfterTheEndDate History
Failing since build #782 (Manual run by Mike Seaton) Test against 2.2 < 1 sec
Successful PatientStateCohortDefinitionEvaluatorTest evaluate_shouldReturnPatientsInTheSpecifiedStatesBeforeTheEndDate History
Failing since build #782 (Manual run by Mike Seaton) Test against 2.2 < 1 sec
Successful PatientStateCohortDefinitionEvaluatorTest evaluate_shouldFindPatientsInSpecifiedStatesOnTheBeforeEndDateIfPassedInTimeIsAtMidnight History
Failing since build #782 (Manual run by Mike Seaton) Test against 2.2 < 1 sec
Successful PatientStateCohortDefinitionEvaluatorTest evaluate_shouldReturnPatientsInTheSpecifiedStatesBeforeTheStartDate History
Failing since build #782 (Manual run by Mike Seaton) Test against 2.2 < 1 sec
Successful PatientStateCohortDefinitionEvaluatorTest evaluate_shouldFindPatientsInSpecifiedStatesForTheSpecifiedLocations History
Failing since build #782 (Manual run by Mike Seaton) Test against 2.2 < 1 sec
Successful PatientStateCohortDefinitionEvaluatorTest evaluate_shouldReturnPatientsInTheSpecifiedStatesAfterTheStartDate History
Failing since build #782 (Manual run by Mike Seaton) Test against 2.2 < 1 sec
Successful PatientStateCohortDefinitionEvaluatorTest evaluate_shouldFindPatientsInSpecifiedStatesOnTheBeforeStartDateIfPassedInTimeIsAtMidnight History
Failing since build #782 (Manual run by Mike Seaton) Test against 2.2 < 1 sec
Successful PersonAttributeCohortDefinitionEvaluatorTest evaluate_shouldGetPatientsWithGivenAttributeTypeAndValues History
Failing since build #782 (Manual run by Mike Seaton) Test against 2.2 < 1 sec
Successful PersonAttributeCohortDefinitionEvaluatorTest evaluate_shouldGetPatientsHavingAttributesWithLocationAttributeValues History
Failing since build #782 (Manual run by Mike Seaton) Test against 2.2 < 1 sec
Successful PersonAttributeCohortDefinitionEvaluatorTest evaluate_shouldGetPatientsHavingAnyAttributes History
Failing since build #782 (Manual run by Mike Seaton) Test against 2.2 < 1 sec
Successful PersonAttributeCohortDefinitionEvaluatorTest evaluate_shouldGetPatientsHavingAttributesWithAnyGivenAttributeValues History
Failing since build #782 (Manual run by Mike Seaton) Test against 2.2 < 1 sec
Successful PresenceOrAbsenceCohortDefinitionEvaluatorTest evaluate_shouldHandleZero History
Failing since build #782 (Manual run by Mike Seaton) Test against 2.2 < 1 sec
Successful PresenceOrAbsenceCohortDefinitionEvaluatorTest evaluate_shouldHandleAtLeast History
Failing since build #782 (Manual run by Mike Seaton) Test against 2.2 < 1 sec
Successful PresenceOrAbsenceCohortDefinitionEvaluatorTest evaluate_shouldHandleAtMost History
Failing since build #782 (Manual run by Mike Seaton) Test against 2.2 < 1 sec
Successful ProgramEnrollmentCohortDefinitionEvaluatorTest evaluate_shouldReturnPatientsThatCompletedTheGivenProgramsOnTheGivenDateIfPassedInTimeIsAtMidnight History
Failing since build #782 (Manual run by Mike Seaton) Test against 2.2 < 1 sec
Successful ProgramEnrollmentCohortDefinitionEvaluatorTest evaluate_shouldReturnPatientsEnrolledInTheGivenProgramsAfterTheGivenDate History
Failing since build #782 (Manual run by Mike Seaton) Test against 2.2 4 secs
Successful ProgramEnrollmentCohortDefinitionEvaluatorTest evaluate_shouldReturnPatientsThatCompletedTheGivenProgramsAfterTheGivenDate History
Failing since build #782 (Manual run by Mike Seaton) Test against 2.2 < 1 sec
Successful ProgramEnrollmentCohortDefinitionEvaluatorTest evaluate_shouldReturnPatientsEnrolledInTheGivenProgramsBeforeTheGivenDate History
Failing since build #782 (Manual run by Mike Seaton) Test against 2.2 < 1 sec
Successful ProgramEnrollmentCohortDefinitionEvaluatorTest evaluate_shouldReturnPatientsThatCompletedTheGivenProgramsBeforeTheGivenDate History
Failing since build #782 (Manual run by Mike Seaton) Test against 2.2 < 1 sec
Successful ProgramEnrollmentCohortDefinitionEvaluatorTest evaluate_shouldReturnPatientsEnrolledInTheGivenProgramsOnTheGivenDateIfPassedInTimeIsAtMidnight History
Failing since build #782 (Manual run by Mike Seaton) Test against 2.2 < 1 sec
Successful ProgramEnrollmentCohortDefinitionEvaluatorTest evaluate_shouldReturnPatientsEnrolledAtTheGivenLocations History
Failing since build #782 (Manual run by Mike Seaton) Test against 2.2 < 1 sec
Successful ScriptedCohortDefinitionEvaluatorTest evaluate_shouldRunScript History
Failing since build #782 (Manual run by Mike Seaton) Test against 2.2 < 1 sec
Skipped tests 98
Status Test Failing since View job
Skipped CodedObsCohortDefinitionEvaluatorTest evaluate_shouldNotReturnVoidedPatients History
Test against 2.0
Skipped CodedObsCohortDefinitionEvaluatorTest evaluate_shouldNotReturnVoidedPatients History
Test against 2.1
Skipped CodedObsCohortDefinitionEvaluatorTest evaluate_shouldNotReturnVoidedPatients History
Default Job
Skipped CodedObsCohortDefinitionEvaluatorTest evaluate_shouldNotReturnVoidedPatients History
Test against 1.11
Skipped CodedObsCohortDefinitionEvaluatorTest evaluate_shouldNotReturnVoidedPatients History
Test against 2.2
Skipped CodedObsCohortDefinitionEvaluatorTest evaluate_shouldNotReturnVoidedPatients History
Test against 1.10
Skipped CodedObsCohortDefinitionEvaluatorTest evaluate_shouldNotReturnVoidedPatients History
Test against 1.12
Skipped EncounterCohortDefinitionEvaluatorTest evaluate_shouldNotReturnVoidedPatients History
Test against 1.12
Skipped EncounterCohortDefinitionEvaluatorTest evaluate_shouldReturnCorrectPatientsWhenProviderParametersAreSet History
Test against 2.2
Skipped EncounterCohortDefinitionEvaluatorTest evaluate_shouldNotReturnVoidedPatients History
Test against 2.2
Skipped EncounterCohortDefinitionEvaluatorTest evaluate_shouldReturnCorrectPatientsWhenProviderParametersAreSet History
Default Job
Skipped EncounterCohortDefinitionEvaluatorTest evaluate_shouldNotReturnVoidedPatients History
Default Job
Skipped EncounterCohortDefinitionEvaluatorTest evaluate_shouldNotReturnVoidedPatients History
Test against 2.1
Skipped EncounterCohortDefinitionEvaluatorTest evaluate_shouldReturnCorrectPatientsWhenProviderParametersAreSet History
Test against 2.1
Skipped EncounterCohortDefinitionEvaluatorTest evaluate_shouldReturnCorrectPatientsWhenProviderParametersAreSet History
Test against 1.11
Skipped EncounterCohortDefinitionEvaluatorTest evaluate_shouldNotReturnVoidedPatients History
Test against 1.11
Skipped EncounterCohortDefinitionEvaluatorTest evaluate_shouldReturnCorrectPatientsWhenProviderParametersAreSet History
Test against 2.0
Skipped EncounterCohortDefinitionEvaluatorTest evaluate_shouldNotReturnVoidedPatients History
Test against 1.10
Skipped EncounterCohortDefinitionEvaluatorTest evaluate_shouldNotReturnVoidedPatients History
Test against 2.0
Skipped EncounterCohortDefinitionEvaluatorTest evaluate_shouldReturnCorrectPatientsWhenProviderParametersAreSet History
Test against 1.10
Skipped EncounterCohortDefinitionEvaluatorTest evaluate_shouldReturnCorrectPatientsWhenProviderParametersAreSet History
Test against 1.12
Skipped TestUtil org.openmrs.module.reporting.common.TestUtil History
Test against 2.2
Skipped TestUtil org.openmrs.module.reporting.common.TestUtil History
Default Job
Skipped TestUtil org.openmrs.module.reporting.common.TestUtil History
Test against 1.11
Skipped TestUtil org.openmrs.module.reporting.common.TestUtil History
Test against 2.1
Skipped TestUtil org.openmrs.module.reporting.common.TestUtil History
Test against 1.10
Skipped TestUtil org.openmrs.module.reporting.common.TestUtil History
Test against 1.12
Skipped TestUtil org.openmrs.module.reporting.common.TestUtil History
Test against 2.0
Skipped GroupMemberObsDataEvaluatorTest testMakeSureEmptyListEntryEvenIfNoMatchingObsInGroup History
Test against 1.12
Skipped GroupMemberObsDataEvaluatorTest testMakeSureEmptySingleEntryEvenIfNoMatchingObsInGroup History
Test against 1.12
Skipped GroupMemberObsDataEvaluatorTest testMakeSureEmptyListEntryEvenIfNoMatchingObsInGroup History
Test against 2.1
Skipped GroupMemberObsDataEvaluatorTest testMakeSureEmptySingleEntryEvenIfNoMatchingObsInGroup History
Test against 2.1
Skipped GroupMemberObsDataEvaluatorTest testMakeSureEmptySingleEntryEvenIfNoMatchingObsInGroup History
Test against 2.2
Skipped GroupMemberObsDataEvaluatorTest testMakeSureEmptyListEntryEvenIfNoMatchingObsInGroup History
Test against 2.2
Skipped GroupMemberObsDataEvaluatorTest testMakeSureEmptyListEntryEvenIfNoMatchingObsInGroup History
Test against 1.11
Skipped GroupMemberObsDataEvaluatorTest testMakeSureEmptySingleEntryEvenIfNoMatchingObsInGroup History
Test against 2.0
Skipped GroupMemberObsDataEvaluatorTest testMakeSureEmptySingleEntryEvenIfNoMatchingObsInGroup History
Test against 1.11
Skipped GroupMemberObsDataEvaluatorTest testMakeSureEmptySingleEntryEvenIfNoMatchingObsInGroup History
Default Job
Skipped GroupMemberObsDataEvaluatorTest testMakeSureEmptyListEntryEvenIfNoMatchingObsInGroup History
Test against 2.0
Skipped GroupMemberObsDataEvaluatorTest testMakeSureEmptyListEntryEvenIfNoMatchingObsInGroup History
Default Job
Skipped GroupMemberObsDataEvaluatorTest testMakeSureEmptyListEntryEvenIfNoMatchingObsInGroup History
Test against 1.10
Skipped GroupMemberObsDataEvaluatorTest testMakeSureEmptySingleEntryEvenIfNoMatchingObsInGroup History
Test against 1.10
Skipped LogicDataEvaluatorTest org.openmrs.module.reporting.data.patient.evaluator.LogicDataEvaluatorTest History
Test against 2.2
Skipped LogicDataEvaluatorTest org.openmrs.module.reporting.data.patient.evaluator.LogicDataEvaluatorTest History
Test against 2.1
Skipped LogicDataEvaluatorTest org.openmrs.module.reporting.data.patient.evaluator.LogicDataEvaluatorTest History
Default Job
Skipped LogicDataEvaluatorTest org.openmrs.module.reporting.data.patient.evaluator.LogicDataEvaluatorTest History
Test against 1.10
Skipped LogicDataEvaluatorTest org.openmrs.module.reporting.data.patient.evaluator.LogicDataEvaluatorTest History
Test against 1.11
Skipped LogicDataEvaluatorTest org.openmrs.module.reporting.data.patient.evaluator.LogicDataEvaluatorTest History
Test against 2.0
Skipped LogicDataEvaluatorTest org.openmrs.module.reporting.data.patient.evaluator.LogicDataEvaluatorTest History
Test against 1.12
Skipped TestPatientCalculation org.openmrs.module.reporting.data.patient.evaluator.TestPatientCalculation History
Test against 1.10
Skipped TestPatientCalculation org.openmrs.module.reporting.data.patient.evaluator.TestPatientCalculation History
Test against 2.2
Skipped TestPatientCalculation org.openmrs.module.reporting.data.patient.evaluator.TestPatientCalculation History
Test against 2.1
Skipped TestPatientCalculation org.openmrs.module.reporting.data.patient.evaluator.TestPatientCalculation History
Default Job
Skipped TestPatientCalculation org.openmrs.module.reporting.data.patient.evaluator.TestPatientCalculation History
Test against 1.11
Skipped TestPatientCalculation org.openmrs.module.reporting.data.patient.evaluator.TestPatientCalculation History
Test against 2.0
Skipped TestPatientCalculation org.openmrs.module.reporting.data.patient.evaluator.TestPatientCalculation History
Test against 1.12
Skipped DataExportDataSetPersisterTest org.openmrs.module.reporting.dataset.DataExportDataSetPersisterTest History
Test against 2.0
Skipped DataExportDataSetPersisterTest org.openmrs.module.reporting.dataset.DataExportDataSetPersisterTest History
Test against 1.12
Skipped DataExportDataSetPersisterTest org.openmrs.module.reporting.dataset.DataExportDataSetPersisterTest History
Test against 2.1
Skipped DataExportDataSetPersisterTest org.openmrs.module.reporting.dataset.DataExportDataSetPersisterTest History
Default Job
Skipped DataExportDataSetPersisterTest org.openmrs.module.reporting.dataset.DataExportDataSetPersisterTest History
Test against 1.11
Skipped DataExportDataSetPersisterTest org.openmrs.module.reporting.dataset.DataExportDataSetPersisterTest History
Test against 2.2
Skipped DataExportDataSetPersisterTest org.openmrs.module.reporting.dataset.DataExportDataSetPersisterTest History
Test against 1.10
Skipped LogicDataSetEvaluatorTest org.openmrs.module.reporting.dataset.definition.evaluator.LogicDataSetEvaluatorTest History
Test against 1.10
Skipped LogicDataSetEvaluatorTest org.openmrs.module.reporting.dataset.definition.evaluator.LogicDataSetEvaluatorTest History
Test against 1.12
Skipped LogicDataSetEvaluatorTest org.openmrs.module.reporting.dataset.definition.evaluator.LogicDataSetEvaluatorTest History
Test against 2.1
Skipped LogicDataSetEvaluatorTest org.openmrs.module.reporting.dataset.definition.evaluator.LogicDataSetEvaluatorTest History
Default Job
Skipped LogicDataSetEvaluatorTest org.openmrs.module.reporting.dataset.definition.evaluator.LogicDataSetEvaluatorTest History
Test against 1.11
Skipped LogicDataSetEvaluatorTest org.openmrs.module.reporting.dataset.definition.evaluator.LogicDataSetEvaluatorTest History
Test against 2.2
Skipped LogicDataSetEvaluatorTest org.openmrs.module.reporting.dataset.definition.evaluator.LogicDataSetEvaluatorTest History
Test against 2.0
Skipped MySqlDataSetEvaluatorTest org.openmrs.module.reporting.dataset.definition.evaluator.MySqlDataSetEvaluatorTest History
Test against 1.12
Skipped MySqlDataSetEvaluatorTest org.openmrs.module.reporting.dataset.definition.evaluator.MySqlDataSetEvaluatorTest History
Test against 2.2
Skipped MySqlDataSetEvaluatorTest org.openmrs.module.reporting.dataset.definition.evaluator.MySqlDataSetEvaluatorTest History
Test against 2.1
Skipped MySqlDataSetEvaluatorTest org.openmrs.module.reporting.dataset.definition.evaluator.MySqlDataSetEvaluatorTest History
Default Job
Skipped MySqlDataSetEvaluatorTest org.openmrs.module.reporting.dataset.definition.evaluator.MySqlDataSetEvaluatorTest History
Test against 1.11
Skipped MySqlDataSetEvaluatorTest org.openmrs.module.reporting.dataset.definition.evaluator.MySqlDataSetEvaluatorTest History
Test against 2.0
Skipped MySqlDataSetEvaluatorTest org.openmrs.module.reporting.dataset.definition.evaluator.MySqlDataSetEvaluatorTest History
Test against 1.10
Skipped ObsQueryServiceImplTest evaluate_shouldEvaluateAnObsQuery History
Test against 2.1
Skipped ObsQueryServiceImplTest evaluate_shouldEvaluateAnObsQuery History
Test against 2.2
Skipped ObsQueryServiceImplTest evaluate_shouldEvaluateAnObsQuery History
Default Job
Skipped ObsQueryServiceImplTest evaluate_shouldEvaluateAnObsQuery History
Test against 1.11
Skipped ObsQueryServiceImplTest evaluate_shouldEvaluateAnObsQuery History
Test against 2.0
Skipped ObsQueryServiceImplTest evaluate_shouldEvaluateAnObsQuery History
Test against 1.10
Skipped ObsQueryServiceImplTest evaluate_shouldEvaluateAnObsQuery History
Test against 1.12
Skipped MysqlReportServiceTest org.openmrs.module.reporting.report.service.MysqlReportServiceTest History
Test against 2.0
Skipped MysqlReportServiceTest org.openmrs.module.reporting.report.service.MysqlReportServiceTest History
Default Job
Skipped MysqlReportServiceTest org.openmrs.module.reporting.report.service.MysqlReportServiceTest History
Test against 2.2
Skipped MysqlReportServiceTest org.openmrs.module.reporting.report.service.MysqlReportServiceTest History
Test against 2.1
Skipped MysqlReportServiceTest org.openmrs.module.reporting.report.service.MysqlReportServiceTest History
Test against 1.11
Skipped MysqlReportServiceTest org.openmrs.module.reporting.report.service.MysqlReportServiceTest History
Test against 1.10
Skipped MysqlReportServiceTest org.openmrs.module.reporting.report.service.MysqlReportServiceTest History
Test against 1.12
Skipped TestReportProcessor org.openmrs.module.reporting.report.service.TestReportProcessor History
Test against 2.2
Skipped TestReportProcessor org.openmrs.module.reporting.report.service.TestReportProcessor History
Test against 2.1
Skipped TestReportProcessor org.openmrs.module.reporting.report.service.TestReportProcessor History
Test against 1.11
Skipped TestReportProcessor org.openmrs.module.reporting.report.service.TestReportProcessor History
Default Job
Skipped TestReportProcessor org.openmrs.module.reporting.report.service.TestReportProcessor History
Test against 1.10
Skipped TestReportProcessor org.openmrs.module.reporting.report.service.TestReportProcessor History
Test against 1.12
Skipped TestReportProcessor org.openmrs.module.reporting.report.service.TestReportProcessor History
Test against 2.0