Sonar metrics for OpenMRS Core Master

Build: #551 failed Scheduled with changes by Daniel Kayiwa

Build result summary

Details

Completed
Queue duration
9 seconds
Duration
23 minutes
Labels
None
Revision
0855385acffca3a4e24a0988d9086aca19f29c68 0855385acffca3a4e24a0988d9086aca19f29c68
Total tests
3417
Failing since
#524 (Scheduled with changes by Daniel Kayiwa)
Fixed in
#675 (Manual run by Rafal Korytkowski)

Tests

Responsible

Code commits

Author Commit Message Commit date
Daniel Kayiwa Daniel Kayiwa 0855385acffca3a4e24a0988d9086aca19f29c68 0855385acffca3a4e24a0988d9086aca19f29c68 uiFramework.development.moduleid VM argument should load classes from dev folder - TRUNK-4739 (cherry picked from commit dfe1f31fd66f7b5a5ba983ff886ba27865900e73)

Tests

Existing test failures 8
Status Test Failing since View job Duration
org.hibernate.NonUniqueResultException: query did not return a unique result: 2
	at org.hibernate.internal.AbstractQueryImpl.uniqueElement(AbstractQueryImpl.java:975)
	at org.hibernate.internal.CriteriaImpl.uniqueResult(CriteriaImpl.java:402)
	at org.openmrs.scheduler.db.hibernate.HibernateSchedulerDAO.getTaskByName(HibernateSchedulerDAO.java:93)
	at org.openmrs.scheduler.timer.TimerSchedulerServiceImpl.getTaskByName(TimerSchedulerServiceImpl.java:390)
	at sun.reflect.NativeMethodAccessorImpl.invoke0(Native Method)
	at sun.reflect.NativeMethodAccessorImpl.invoke(NativeMethodAccessorImpl.java:62)
	at sun.reflect.DelegatingMethodAccessorImpl.invoke(DelegatingMethodAccessorImpl.java:43)
(28 more lines...)
org.hibernate.NonUniqueResultException: query did not return a unique result: 2
	at org.hibernate.internal.AbstractQueryImpl.uniqueElement(AbstractQueryImpl.java:975)
	at org.hibernate.internal.CriteriaImpl.uniqueResult(CriteriaImpl.java:402)
	at org.openmrs.scheduler.db.hibernate.HibernateSchedulerDAO.getTaskByName(HibernateSchedulerDAO.java:93)
	at org.openmrs.scheduler.timer.TimerSchedulerServiceImpl.getTaskByName(TimerSchedulerServiceImpl.java:390)
	at sun.reflect.NativeMethodAccessorImpl.invoke0(Native Method)
	at sun.reflect.NativeMethodAccessorImpl.invoke(NativeMethodAccessorImpl.java:62)
	at sun.reflect.DelegatingMethodAccessorImpl.invoke(DelegatingMethodAccessorImpl.java:43)
(28 more lines...)
java.lang.AssertionError: null
	at org.junit.Assert.fail(Assert.java:86)
	at org.junit.Assert.assertTrue(Assert.java:41)
	at org.junit.Assert.assertNotNull(Assert.java:621)
	at org.junit.Assert.assertNotNull(Assert.java:631)
	at org.openmrs.web.controller.ConceptFormControllerTest.shouldAddConceptWithAllNamingSpecified(ConceptFormControllerTest.java:345)
java.lang.AssertionError: null
	at org.junit.Assert.fail(Assert.java:86)
	at org.junit.Assert.assertTrue(Assert.java:41)
	at org.junit.Assert.assertNotNull(Assert.java:621)
	at org.junit.Assert.assertNotNull(Assert.java:631)
	at org.openmrs.web.controller.ConceptFormControllerTest.shouldUpdateConceptWithShortNameAlreadyInSynonymList(ConceptFormControllerTest.java:446)
java.lang.AssertionError: null
	at org.junit.Assert.fail(Assert.java:86)
	at org.junit.Assert.assertTrue(Assert.java:41)
	at org.junit.Assert.assertNotNull(Assert.java:621)
	at org.junit.Assert.assertNotNull(Assert.java:631)
	at org.openmrs.web.controller.ConceptFormControllerTest.shouldAddConceptWithNameAndShortNameAndDescriptionSpecifiedToNumericConcepts(ConceptFormControllerTest.java:294)
java.lang.AssertionError: null
	at org.junit.Assert.fail(Assert.java:86)
	at org.junit.Assert.assertTrue(Assert.java:41)
	at org.junit.Assert.assertNotNull(Assert.java:621)
	at org.junit.Assert.assertNotNull(Assert.java:631)
	at org.openmrs.web.controller.ConceptFormControllerTest.shouldAddConceptWithNameAndShortNameSpecified(ConceptFormControllerTest.java:206)
java.lang.AssertionError: null
	at org.junit.Assert.fail(Assert.java:86)
	at org.junit.Assert.assertTrue(Assert.java:41)
	at org.junit.Assert.assertNotNull(Assert.java:621)
	at org.junit.Assert.assertNotNull(Assert.java:631)
	at org.openmrs.web.controller.ConceptFormControllerTest.shouldUpdateConceptWithNameAlreadyInSynonymList(ConceptFormControllerTest.java:397)
java.lang.AssertionError: null
	at org.junit.Assert.fail(Assert.java:86)
	at org.junit.Assert.assertTrue(Assert.java:41)
	at org.junit.Assert.assertNotNull(Assert.java:621)
	at org.junit.Assert.assertNotNull(Assert.java:631)
	at org.openmrs.web.controller.ConceptFormControllerTest.shouldAddConceptWithNameAndShortNameAndDescriptionSpecifiedToCodeConcepts(ConceptFormControllerTest.java:249)

Jira issues

IssueDescriptionStatus
Unknown Issue TypeTRUNK-4739Could not obtain issue details from Jira