Build: #128 failed

Job: Default Job failed

Stages & jobs

  1. Default Stage

Job result summary

Completed
Duration
35 minutes
Revision
140f43952c76a7a2b0a754e564692f25ff8f6f88 140f43952c76a7a2b0a754e564692f25ff8f6f88
Total tests
2400
Fixed in
#129 (Manual run by Rafal Korytkowski)

Tests

  • 2,400 tests in total
  • 1 test failed
  • 1 failure is new
  • 39 minutes taken in total.
New test failures 1
Status Test Duration
Collapse Failed ModuleActivatorTest shouldStopDependantModulesOnStopModule History
16 secs
java.lang.AssertionError
	at org.junit.Assert.fail(Assert.java:86)
	at org.junit.Assert.assertTrue(Assert.java:41)
	at org.junit.Assert.assertTrue(Assert.java:52)
	at org.openmrs.module.ModuleActivatorTest.shouldStopDependantModulesOnStopModule(ModuleActivatorTest.java:98)
	at sun.reflect.NativeMethodAccessorImpl.invoke0(Native Method)
	at sun.reflect.NativeMethodAccessorImpl.invoke(NativeMethodAccessorImpl.java:57)
	at sun.reflect.DelegatingMethodAccessorImpl.invoke(DelegatingMethodAccessorImpl.java:43)
(32 more lines...)

Error summary

The build generated some errors. See the full build log for more details.

[INFO] ------------------------------------------------------------------------
[ERROR] BUILD FAILURE
[INFO] ------------------------------------------------------------------------
[INFO] There are test failures.

Please refer to /opt/bamboo-home/xml-data/build-dir/TRUNK-LATEST-JOB1/api/target/surefire-reports for the individual test results.
[INFO] ------------------------------------------------------------------------
[INFO] For more information, run Maven with the -e switch