Build: #133 failed

Job: Default Job failed

Stages & jobs

  1. Default Stage

Job result summary

Completed
Duration
8 minutes
Revision
991b29dbcff84f3229c02066f57d711b9fd17115 991b29dbcff84f3229c02066f57d711b9fd17115
Total tests
2408
Fixed in
#134 (Manual run by Rafal Korytkowski)

Tests

  • 2,408 tests in total
  • 1 test failed
  • 1 failure is new
  • 8 minutes taken in total.
New test failures 1
Status Test Duration
Collapse Failed ModuleActivatorTest shouldStopDependantModulesOnStopModule History
< 1 sec
java.lang.AssertionError
	at org.junit.Assert.fail(Assert.java:86)
	at org.junit.Assert.assertTrue(Assert.java:41)
	at org.junit.Assert.assertTrue(Assert.java:52)
	at org.openmrs.module.ModuleActivatorTest.shouldStopDependantModulesOnStopModule(ModuleActivatorTest.java:99)
	at sun.reflect.NativeMethodAccessorImpl.invoke0(Native Method)
	at sun.reflect.NativeMethodAccessorImpl.invoke(NativeMethodAccessorImpl.java:57)
	at sun.reflect.DelegatingMethodAccessorImpl.invoke(DelegatingMethodAccessorImpl.java:43)
(32 more lines...)

Error summary

The build generated some errors. See the full build log for more details.

[INFO] ------------------------------------------------------------------------
[ERROR] BUILD FAILURE
[INFO] ------------------------------------------------------------------------
[INFO] There are test failures.

Please refer to /opt/bamboo-agent/agent3-home/xml-data/build-dir/TRUNK-LATEST-JOB1/api/target/surefire-reports for the individual test results.
[INFO] ------------------------------------------------------------------------
[INFO] For more information, run Maven with the -e switch