Build: #267 was successful

Job: Default Job was successful

Stages & jobs

  1. Default Stage

  2. Deploy

  3. Release

    Requires a user to start manually

Build log

The build generated 3,053 lines of output.The output is too long and has been truncated to the last 1,000 lines. Download or view full build log

05-Feb-2018 19:54:37 Running org.openmrs.api.db.ContextDAOTest
05-Feb-2018 19:54:39 Tests run: 20, Failures: 0, Errors: 0, Skipped: 0, Time elapsed: 1.369 sec
05-Feb-2018 19:54:39 Running org.openmrs.reporting.CachingPatientFilterTest
05-Feb-2018 19:54:39 Tests run: 1, Failures: 0, Errors: 0, Skipped: 0, Time elapsed: 0.074 sec
05-Feb-2018 19:54:39 Running org.openmrs.validator.SchedulerFormValidatorTest
05-Feb-2018 19:54:39 Tests run: 8, Failures: 0, Errors: 0, Skipped: 0, Time elapsed: 0.005 sec
05-Feb-2018 19:54:39 Running org.openmrs.validator.PatientIdentifierTypeValidatorTest
05-Feb-2018 19:54:39 Tests run: 6, Failures: 0, Errors: 0, Skipped: 0, Time elapsed: 0.421 sec
05-Feb-2018 19:54:39 Running org.openmrs.validator.PatientProgramValidatorTest
05-Feb-2018 19:54:40 Tests run: 16, Failures: 0, Errors: 0, Skipped: 0, Time elapsed: 1.165 sec
05-Feb-2018 19:54:40 Running org.openmrs.validator.ConceptMapTypeValidatorTest
05-Feb-2018 19:54:41 Tests run: 6, Failures: 0, Errors: 0, Skipped: 0, Time elapsed: 0.448 sec
05-Feb-2018 19:54:41 Running org.openmrs.util.OpenmrsClassLoaderTest
05-Feb-2018 19:54:41 Tests run: 1, Failures: 0, Errors: 0, Skipped: 0, Time elapsed: 0.008 sec
05-Feb-2018 19:54:41 Running org.openmrs.validator.UserValidatorTest
05-Feb-2018 19:54:42 Tests run: 17, Failures: 0, Errors: 0, Skipped: 0, Time elapsed: 1.11 sec
05-Feb-2018 19:54:42 Running org.openmrs.ConceptWordTest
05-Feb-2018 19:54:42 Tests run: 2, Failures: 0, Errors: 0, Skipped: 0, Time elapsed: 0.12 sec
05-Feb-2018 19:54:42 Running org.openmrs.api.AdministrationServiceTest
05-Feb-2018 19:54:44 ERROR - MutableResourceBundleMessageSource.findPropertiesFiles(319) |2018-02-05 19:54:44,158| Error generated
05-Feb-2018 19:54:44 java.io.FileNotFoundException: class path resource [WEB-INF/] cannot be resolved to URL because it does not exist
05-Feb-2018 19:54:44         at org.springframework.core.io.ClassPathResource.getURL(ClassPathResource.java:179)
05-Feb-2018 19:54:44         at org.springframework.core.io.AbstractFileResolvingResource.getFile(AbstractFileResolvingResource.java:48)
05-Feb-2018 19:54:44         at org.openmrs.messagesource.impl.MutableResourceBundleMessageSource.findPropertiesFiles(MutableResourceBundleMessageSource.java:307)
05-Feb-2018 19:54:44         at org.openmrs.messagesource.impl.MutableResourceBundleMessageSource.findLocales(MutableResourceBundleMessageSource.java:89)
05-Feb-2018 19:54:44         at org.openmrs.messagesource.impl.MutableResourceBundleMessageSource.getLocales(MutableResourceBundleMessageSource.java:66)
05-Feb-2018 19:54:44         at org.openmrs.messagesource.impl.MessageSourceServiceImpl.getLocales(MessageSourceServiceImpl.java:82)
05-Feb-2018 19:54:44         at sun.reflect.NativeMethodAccessorImpl.invoke0(Native Method)
05-Feb-2018 19:54:44         at sun.reflect.NativeMethodAccessorImpl.invoke(NativeMethodAccessorImpl.java:57)
05-Feb-2018 19:54:44         at sun.reflect.DelegatingMethodAccessorImpl.invoke(DelegatingMethodAccessorImpl.java:43)
05-Feb-2018 19:54:44         at java.lang.reflect.Method.invoke(Method.java:606)
05-Feb-2018 19:54:44         at org.springframework.aop.support.AopUtils.invokeJoinpointUsingReflection(AopUtils.java:309)
05-Feb-2018 19:54:44         at org.springframework.aop.framework.ReflectiveMethodInvocation.invokeJoinpoint(ReflectiveMethodInvocation.java:183)
05-Feb-2018 19:54:44         at org.springframework.aop.framework.ReflectiveMethodInvocation.proceed(ReflectiveMethodInvocation.java:150)
05-Feb-2018 19:54:44         at org.springframework.transaction.interceptor.TransactionInterceptor.invoke(TransactionInterceptor.java:110)
05-Feb-2018 19:54:44         at org.springframework.aop.framework.ReflectiveMethodInvocation.proceed(ReflectiveMethodInvocation.java:172)
05-Feb-2018 19:54:44         at org.openmrs.aop.LoggingAdvice.invoke(LoggingAdvice.java:118)
05-Feb-2018 19:54:44         at org.springframework.aop.framework.ReflectiveMethodInvocation.proceed(ReflectiveMethodInvocation.java:172)
05-Feb-2018 19:54:44         at org.springframework.aop.framework.adapter.MethodBeforeAdviceInterceptor.invoke(MethodBeforeAdviceInterceptor.java:50)
05-Feb-2018 19:54:44         at org.springframework.aop.framework.ReflectiveMethodInvocation.proceed(ReflectiveMethodInvocation.java:172)
05-Feb-2018 19:54:44         at org.springframework.aop.framework.adapter.MethodBeforeAdviceInterceptor.invoke(MethodBeforeAdviceInterceptor.java:50)
05-Feb-2018 19:54:44         at org.springframework.aop.framework.ReflectiveMethodInvocation.proceed(ReflectiveMethodInvocation.java:172)
05-Feb-2018 19:54:44         at org.springframework.aop.framework.JdkDynamicAopProxy.invoke(JdkDynamicAopProxy.java:202)
05-Feb-2018 19:54:44         at com.sun.proxy.$Proxy19.getLocales(Unknown Source)
05-Feb-2018 19:54:44         at sun.reflect.NativeMethodAccessorImpl.invoke0(Native Method)
05-Feb-2018 19:54:44         at sun.reflect.NativeMethodAccessorImpl.invoke(NativeMethodAccessorImpl.java:57)
05-Feb-2018 19:54:44         at sun.reflect.DelegatingMethodAccessorImpl.invoke(DelegatingMethodAccessorImpl.java:43)
05-Feb-2018 19:54:44         at java.lang.reflect.Method.invoke(Method.java:606)
05-Feb-2018 19:54:44         at org.springframework.aop.support.AopUtils.invokeJoinpointUsingReflection(AopUtils.java:309)
05-Feb-2018 19:54:44         at org.springframework.aop.framework.ReflectiveMethodInvocation.invokeJoinpoint(ReflectiveMethodInvocation.java:183)
05-Feb-2018 19:54:44         at org.springframework.aop.framework.ReflectiveMethodInvocation.proceed(ReflectiveMethodInvocation.java:150)
05-Feb-2018 19:54:44         at org.springframework.transaction.interceptor.TransactionInterceptor.invoke(TransactionInterceptor.java:110)
05-Feb-2018 19:54:44         at org.springframework.aop.framework.ReflectiveMethodInvocation.proceed(ReflectiveMethodInvocation.java:172)
05-Feb-2018 19:54:44         at org.springframework.aop.framework.JdkDynamicAopProxy.invoke(JdkDynamicAopProxy.java:202)
05-Feb-2018 19:54:44         at com.sun.proxy.$Proxy72.getLocales(Unknown Source)
05-Feb-2018 19:54:44         at org.openmrs.api.impl.AdministrationServiceImpl.getPresentationLocales(AdministrationServiceImpl.java:1014)
05-Feb-2018 19:54:44         at sun.reflect.NativeMethodAccessorImpl.invoke0(Native Method)
05-Feb-2018 19:54:44         at sun.reflect.NativeMethodAccessorImpl.invoke(NativeMethodAccessorImpl.java:57)
05-Feb-2018 19:54:44         at sun.reflect.DelegatingMethodAccessorImpl.invoke(DelegatingMethodAccessorImpl.java:43)
05-Feb-2018 19:54:44         at java.lang.reflect.Method.invoke(Method.java:606)
05-Feb-2018 19:54:44         at org.springframework.aop.support.AopUtils.invokeJoinpointUsingReflection(AopUtils.java:309)
05-Feb-2018 19:54:44         at org.springframework.aop.framework.ReflectiveMethodInvocation.invokeJoinpoint(ReflectiveMethodInvocation.java:183)
05-Feb-2018 19:54:44         at org.springframework.aop.framework.ReflectiveMethodInvocation.proceed(ReflectiveMethodInvocation.java:150)
05-Feb-2018 19:54:44         at org.springframework.transaction.interceptor.TransactionInterceptor.invoke(TransactionInterceptor.java:110)
05-Feb-2018 19:54:44         at org.springframework.aop.framework.ReflectiveMethodInvocation.proceed(ReflectiveMethodInvocation.java:172)
05-Feb-2018 19:54:44         at org.springframework.aop.framework.JdkDynamicAopProxy.invoke(JdkDynamicAopProxy.java:202)
05-Feb-2018 19:54:44         at com.sun.proxy.$Proxy21.getPresentationLocales(Unknown Source)
05-Feb-2018 19:54:44         at sun.reflect.NativeMethodAccessorImpl.invoke0(Native Method)
05-Feb-2018 19:54:44         at sun.reflect.NativeMethodAccessorImpl.invoke(NativeMethodAccessorImpl.java:57)
05-Feb-2018 19:54:44         at sun.reflect.DelegatingMethodAccessorImpl.invoke(DelegatingMethodAccessorImpl.java:43)
05-Feb-2018 19:54:44         at java.lang.reflect.Method.invoke(Method.java:606)
05-Feb-2018 19:54:44         at org.springframework.aop.support.AopUtils.invokeJoinpointUsingReflection(AopUtils.java:309)
05-Feb-2018 19:54:44         at org.springframework.aop.framework.ReflectiveMethodInvocation.invokeJoinpoint(ReflectiveMethodInvocation.java:183)
05-Feb-2018 19:54:44         at org.springframework.aop.framework.ReflectiveMethodInvocation.proceed(ReflectiveMethodInvocation.java:150)
05-Feb-2018 19:54:44         at org.springframework.transaction.interceptor.TransactionInterceptor.invoke(TransactionInterceptor.java:110)
05-Feb-2018 19:54:44         at org.springframework.aop.framework.ReflectiveMethodInvocation.proceed(ReflectiveMethodInvocation.java:172)
05-Feb-2018 19:54:44         at org.openmrs.aop.LoggingAdvice.invoke(LoggingAdvice.java:118)
05-Feb-2018 19:54:44         at org.springframework.aop.framework.ReflectiveMethodInvocation.proceed(ReflectiveMethodInvocation.java:172)
05-Feb-2018 19:54:44         at org.springframework.aop.framework.adapter.MethodBeforeAdviceInterceptor.invoke(MethodBeforeAdviceInterceptor.java:50)
05-Feb-2018 19:54:44         at org.springframework.aop.framework.ReflectiveMethodInvocation.proceed(ReflectiveMethodInvocation.java:172)
05-Feb-2018 19:54:44         at org.springframework.aop.framework.adapter.MethodBeforeAdviceInterceptor.invoke(MethodBeforeAdviceInterceptor.java:50)
05-Feb-2018 19:54:44         at org.springframework.aop.framework.ReflectiveMethodInvocation.proceed(ReflectiveMethodInvocation.java:172)
05-Feb-2018 19:54:44         at org.springframework.aop.framework.JdkDynamicAopProxy.invoke(JdkDynamicAopProxy.java:202)
05-Feb-2018 19:54:44         at com.sun.proxy.$Proxy40.getPresentationLocales(Unknown Source)
05-Feb-2018 19:54:44         at sun.reflect.NativeMethodAccessorImpl.invoke0(Native Method)
05-Feb-2018 19:54:44         at sun.reflect.NativeMethodAccessorImpl.invoke(NativeMethodAccessorImpl.java:57)
05-Feb-2018 19:54:44         at sun.reflect.DelegatingMethodAccessorImpl.invoke(DelegatingMethodAccessorImpl.java:43)
05-Feb-2018 19:54:44         at java.lang.reflect.Method.invoke(Method.java:606)
05-Feb-2018 19:54:44         at org.springframework.aop.support.AopUtils.invokeJoinpointUsingReflection(AopUtils.java:309)
05-Feb-2018 19:54:44         at org.springframework.aop.framework.ReflectiveMethodInvocation.invokeJoinpoint(ReflectiveMethodInvocation.java:183)
05-Feb-2018 19:54:44         at org.springframework.aop.framework.ReflectiveMethodInvocation.proceed(ReflectiveMethodInvocation.java:150)
05-Feb-2018 19:54:44         at org.springframework.transaction.interceptor.TransactionInterceptor.invoke(TransactionInterceptor.java:110)
05-Feb-2018 19:54:44         at org.springframework.aop.framework.ReflectiveMethodInvocation.proceed(ReflectiveMethodInvocation.java:172)
05-Feb-2018 19:54:44         at org.springframework.aop.framework.JdkDynamicAopProxy.invoke(JdkDynamicAopProxy.java:202)
05-Feb-2018 19:54:44         at com.sun.proxy.$Proxy40.getPresentationLocales(Unknown Source)
05-Feb-2018 19:54:44         at org.openmrs.api.AdministrationServiceTest.getPresentationLocales_shouldNotReturnMoreLocalesThanMessageSourceServiceLocales(AdministrationServiceTest.java:414)
05-Feb-2018 19:54:44         at sun.reflect.NativeMethodAccessorImpl.invoke0(Native Method)
05-Feb-2018 19:54:44         at sun.reflect.NativeMethodAccessorImpl.invoke(NativeMethodAccessorImpl.java:57)
05-Feb-2018 19:54:44         at sun.reflect.DelegatingMethodAccessorImpl.invoke(DelegatingMethodAccessorImpl.java:43)
05-Feb-2018 19:54:44         at java.lang.reflect.Method.invoke(Method.java:606)
05-Feb-2018 19:54:44         at org.junit.runners.model.FrameworkMethod$1.runReflectiveCall(FrameworkMethod.java:47)
05-Feb-2018 19:54:44         at org.junit.internal.runners.model.ReflectiveCallable.run(ReflectiveCallable.java:12)
05-Feb-2018 19:54:44         at org.junit.runners.model.FrameworkMethod.invokeExplosively(FrameworkMethod.java:44)
05-Feb-2018 19:54:44         at org.junit.internal.runners.statements.InvokeMethod.evaluate(InvokeMethod.java:17)
05-Feb-2018 19:54:44         at org.junit.internal.runners.statements.RunBefores.evaluate(RunBefores.java:26)
05-Feb-2018 19:54:44         at org.springframework.test.context.junit4.statements.RunBeforeTestMethodCallbacks.evaluate(RunBeforeTestMethodCallbacks.java:74)
05-Feb-2018 19:54:44         at org.junit.internal.runners.statements.RunAfters.evaluate(RunAfters.java:27)
05-Feb-2018 19:54:44         at org.springframework.test.context.junit4.statements.RunAfterTestMethodCallbacks.evaluate(RunAfterTestMethodCallbacks.java:82)
05-Feb-2018 19:54:44         at org.springframework.test.context.junit4.statements.SpringRepeat.evaluate(SpringRepeat.java:72)
05-Feb-2018 19:54:44         at org.springframework.test.context.junit4.SpringJUnit4ClassRunner.runChild(SpringJUnit4ClassRunner.java:240)
05-Feb-2018 19:54:44         at org.junit.runners.BlockJUnit4ClassRunner.runChild(BlockJUnit4ClassRunner.java:50)
05-Feb-2018 19:54:44         at org.junit.runners.ParentRunner$3.run(ParentRunner.java:238)
05-Feb-2018 19:54:44         at org.junit.runners.ParentRunner$1.schedule(ParentRunner.java:63)
05-Feb-2018 19:54:44         at org.junit.runners.ParentRunner.runChildren(ParentRunner.java:236)
05-Feb-2018 19:54:44         at org.junit.runners.ParentRunner.access$000(ParentRunner.java:53)
05-Feb-2018 19:54:44         at org.junit.runners.ParentRunner$2.evaluate(ParentRunner.java:229)
05-Feb-2018 19:54:44         at org.springframework.test.context.junit4.statements.RunBeforeTestClassCallbacks.evaluate(RunBeforeTestClassCallbacks.java:61)
05-Feb-2018 19:54:44         at org.junit.internal.runners.statements.RunAfters.evaluate(RunAfters.java:27)
05-Feb-2018 19:54:44         at org.springframework.test.context.junit4.statements.RunAfterTestClassCallbacks.evaluate(RunAfterTestClassCallbacks.java:70)
05-Feb-2018 19:54:44         at org.junit.runners.ParentRunner.run(ParentRunner.java:309)
05-Feb-2018 19:54:44         at org.springframework.test.context.junit4.SpringJUnit4ClassRunner.run(SpringJUnit4ClassRunner.java:180)
05-Feb-2018 19:54:44         at org.apache.maven.surefire.junit4.JUnit4TestSet.execute(JUnit4TestSet.java:59)
05-Feb-2018 19:54:44         at org.apache.maven.surefire.suite.AbstractDirectoryTestSuite.executeTestSet(AbstractDirectoryTestSuite.java:115)
05-Feb-2018 19:54:44         at org.apache.maven.surefire.suite.AbstractDirectoryTestSuite.execute(AbstractDirectoryTestSuite.java:102)
05-Feb-2018 19:54:44         at org.apache.maven.surefire.Surefire.run(Surefire.java:180)
05-Feb-2018 19:54:44         at sun.reflect.NativeMethodAccessorImpl.invoke0(Native Method)
05-Feb-2018 19:54:44         at sun.reflect.NativeMethodAccessorImpl.invoke(NativeMethodAccessorImpl.java:57)
05-Feb-2018 19:54:44         at sun.reflect.DelegatingMethodAccessorImpl.invoke(DelegatingMethodAccessorImpl.java:43)
05-Feb-2018 19:54:44         at java.lang.reflect.Method.invoke(Method.java:606)
05-Feb-2018 19:54:44         at org.apache.maven.surefire.booter.SurefireBooter.runSuitesInProcess(SurefireBooter.java:350)
05-Feb-2018 19:54:44         at org.apache.maven.surefire.booter.SurefireBooter.main(SurefireBooter.java:1021)
05-Feb-2018 19:54:45 Tests run: 41, Failures: 0, Errors: 0, Skipped: 4, Time elapsed: 2.575 sec
05-Feb-2018 19:54:45 Running org.openmrs.api.handler.ExistingVisitAssignmentHandlerTest
05-Feb-2018 19:54:45 Tests run: 3, Failures: 0, Errors: 0, Skipped: 0, Time elapsed: 0.291 sec
05-Feb-2018 19:54:45 Running org.openmrs.report.RowPerObsDatasetTest
05-Feb-2018 19:54:45 Tests run: 1, Failures: 0, Errors: 0, Skipped: 0, Time elapsed: 0.073 sec
05-Feb-2018 19:54:45 Running org.openmrs.annotation.OpenmrsProfileIncludeFilterTest
05-Feb-2018 19:54:45 Tests run: 2, Failures: 0, Errors: 0, Skipped: 0, Time elapsed: 0.163 sec
05-Feb-2018 19:54:45 Running org.openmrs.api.PersonServiceTest
05-Feb-2018 19:54:53 Tests run: 112, Failures: 0, Errors: 0, Skipped: 2, Time elapsed: 7.952 sec
05-Feb-2018 19:54:53 Running org.openmrs.validator.ConceptDatatypeValidatorTest
05-Feb-2018 19:54:53 Tests run: 3, Failures: 0, Errors: 0, Skipped: 0, Time elapsed: 0.003 sec
05-Feb-2018 19:54:53 Running org.openmrs.api.ConceptServiceTest
05-Feb-2018 19:55:01 ERROR - JDBCExceptionReporter.logExceptions(234) |2018-02-05 19:55:01,739| NULL not allowed for column "DESCRIPTION"; SQL statement:
05-Feb-2018 19:55:01 insert into concept_name_tag (concept_name_tag_id, tag, description, date_created, creator, voided, date_voided, void_reason, voided_by, uuid) values (null, ?, ?, ?, ?, ?, ?, ?, ?, ?) [90006-135]
05-Feb-2018 19:55:03 ERROR - JDBCExceptionReporter.logExceptions(234) |2018-02-05 19:55:03,110| NULL not allowed for column "DESCRIPTION"; SQL statement:
05-Feb-2018 19:55:03 insert into concept_name_tag (concept_name_tag_id, tag, description, date_created, creator, voided, date_voided, void_reason, voided_by, uuid) values (null, ?, ?, ?, ?, ?, ?, ?, ?, ?) [90006-135]
05-Feb-2018 19:55:05 Tests run: 170, Failures: 0, Errors: 0, Skipped: 0, Time elapsed: 11.81 sec
05-Feb-2018 19:55:05 Running org.openmrs.patient.impl.LuhnIdentifierValidatorTest
05-Feb-2018 19:55:05 Tests run: 3, Failures: 0, Errors: 0, Skipped: 0, Time elapsed: 0.001 sec
05-Feb-2018 19:55:05 Running org.openmrs.api.db.UserDAOTest
05-Feb-2018 19:55:05 Tests run: 8, Failures: 0, Errors: 0, Skipped: 0, Time elapsed: 0.506 sec
05-Feb-2018 19:55:05 Running org.openmrs.validator.StateConversionValidatorTest
05-Feb-2018 19:55:06 Tests run: 4, Failures: 0, Errors: 0, Skipped: 0, Time elapsed: 0.243 sec
05-Feb-2018 19:55:06 Running org.openmrs.propertyeditor.UserEditorTest
05-Feb-2018 19:55:06 Tests run: 2, Failures: 0, Errors: 0, Skipped: 0, Time elapsed: 0.13 sec
05-Feb-2018 19:55:06 Running org.openmrs.api.PatientServiceTest
05-Feb-2018 19:55:19 Tests run: 162, Failures: 0, Errors: 0, Skipped: 2, Time elapsed: 13.054 sec
05-Feb-2018 19:55:19 Running org.openmrs.api.ObsServiceTest
05-Feb-2018 19:55:23 ERROR - ImageHandler.getObs(70) |2018-02-05 19:55:23,579| Trying to read file: /tmp/appdir-for-unit-tests-8387823430682794564/complex_obs/openmrs_logo_small.gif
05-Feb-2018 19:55:23 javax.imageio.IIOException: Can't read input file!
05-Feb-2018 19:55:23         at javax.imageio.ImageIO.read(ImageIO.java:1301)
05-Feb-2018 19:55:23         at org.openmrs.obs.handler.ImageHandler.getObs(ImageHandler.java:67)
05-Feb-2018 19:55:23         at org.openmrs.api.impl.ObsServiceImpl.getComplexObs(ObsServiceImpl.java:710)
05-Feb-2018 19:55:23         at sun.reflect.NativeMethodAccessorImpl.invoke0(Native Method)
05-Feb-2018 19:55:23         at sun.reflect.NativeMethodAccessorImpl.invoke(NativeMethodAccessorImpl.java:57)
05-Feb-2018 19:55:23         at sun.reflect.DelegatingMethodAccessorImpl.invoke(DelegatingMethodAccessorImpl.java:43)
05-Feb-2018 19:55:23         at java.lang.reflect.Method.invoke(Method.java:606)
05-Feb-2018 19:55:23         at org.springframework.aop.support.AopUtils.invokeJoinpointUsingReflection(AopUtils.java:309)
05-Feb-2018 19:55:23         at org.springframework.aop.framework.ReflectiveMethodInvocation.invokeJoinpoint(ReflectiveMethodInvocation.java:183)
05-Feb-2018 19:55:23         at org.springframework.aop.framework.ReflectiveMethodInvocation.proceed(ReflectiveMethodInvocation.java:150)
05-Feb-2018 19:55:23         at org.springframework.transaction.interceptor.TransactionInterceptor.invoke(TransactionInterceptor.java:110)
05-Feb-2018 19:55:23         at org.springframework.aop.framework.ReflectiveMethodInvocation.proceed(ReflectiveMethodInvocation.java:172)
05-Feb-2018 19:55:23         at org.springframework.aop.framework.JdkDynamicAopProxy.invoke(JdkDynamicAopProxy.java:202)
05-Feb-2018 19:55:23         at com.sun.proxy.$Proxy30.getComplexObs(Unknown Source)
05-Feb-2018 19:55:23         at sun.reflect.NativeMethodAccessorImpl.invoke0(Native Method)
05-Feb-2018 19:55:23         at sun.reflect.NativeMethodAccessorImpl.invoke(NativeMethodAccessorImpl.java:57)
05-Feb-2018 19:55:23         at sun.reflect.DelegatingMethodAccessorImpl.invoke(DelegatingMethodAccessorImpl.java:43)
05-Feb-2018 19:55:23         at java.lang.reflect.Method.invoke(Method.java:606)
05-Feb-2018 19:55:23         at org.springframework.aop.support.AopUtils.invokeJoinpointUsingReflection(AopUtils.java:309)
05-Feb-2018 19:55:23         at org.springframework.aop.framework.ReflectiveMethodInvocation.invokeJoinpoint(ReflectiveMethodInvocation.java:183)
05-Feb-2018 19:55:23         at org.springframework.aop.framework.ReflectiveMethodInvocation.proceed(ReflectiveMethodInvocation.java:150)
05-Feb-2018 19:55:23         at org.springframework.transaction.interceptor.TransactionInterceptor.invoke(TransactionInterceptor.java:110)
05-Feb-2018 19:55:23         at org.springframework.aop.framework.ReflectiveMethodInvocation.proceed(ReflectiveMethodInvocation.java:172)
05-Feb-2018 19:55:23         at org.openmrs.aop.LoggingAdvice.invoke(LoggingAdvice.java:118)
05-Feb-2018 19:55:23         at org.springframework.aop.framework.ReflectiveMethodInvocation.proceed(ReflectiveMethodInvocation.java:172)
05-Feb-2018 19:55:23         at org.springframework.aop.framework.adapter.MethodBeforeAdviceInterceptor.invoke(MethodBeforeAdviceInterceptor.java:50)
05-Feb-2018 19:55:23         at org.springframework.aop.framework.ReflectiveMethodInvocation.proceed(ReflectiveMethodInvocation.java:172)
05-Feb-2018 19:55:23         at org.springframework.aop.framework.adapter.MethodBeforeAdviceInterceptor.invoke(MethodBeforeAdviceInterceptor.java:50)
05-Feb-2018 19:55:23         at org.springframework.aop.framework.ReflectiveMethodInvocation.proceed(ReflectiveMethodInvocation.java:172)
05-Feb-2018 19:55:23         at org.springframework.aop.framework.JdkDynamicAopProxy.invoke(JdkDynamicAopProxy.java:202)
05-Feb-2018 19:55:23         at com.sun.proxy.$Proxy31.getComplexObs(Unknown Source)
05-Feb-2018 19:55:23         at sun.reflect.NativeMethodAccessorImpl.invoke0(Native Method)
05-Feb-2018 19:55:23         at sun.reflect.NativeMethodAccessorImpl.invoke(NativeMethodAccessorImpl.java:57)
05-Feb-2018 19:55:23         at sun.reflect.DelegatingMethodAccessorImpl.invoke(DelegatingMethodAccessorImpl.java:43)
05-Feb-2018 19:55:23         at java.lang.reflect.Method.invoke(Method.java:606)
05-Feb-2018 19:55:23         at org.springframework.aop.support.AopUtils.invokeJoinpointUsingReflection(AopUtils.java:309)
05-Feb-2018 19:55:23         at org.springframework.aop.framework.ReflectiveMethodInvocation.invokeJoinpoint(ReflectiveMethodInvocation.java:183)
05-Feb-2018 19:55:23         at org.springframework.aop.framework.ReflectiveMethodInvocation.proceed(ReflectiveMethodInvocation.java:150)
05-Feb-2018 19:55:23         at org.springframework.transaction.interceptor.TransactionInterceptor.invoke(TransactionInterceptor.java:110)
05-Feb-2018 19:55:23         at org.springframework.aop.framework.ReflectiveMethodInvocation.proceed(ReflectiveMethodInvocation.java:172)
05-Feb-2018 19:55:23         at org.springframework.aop.framework.JdkDynamicAopProxy.invoke(JdkDynamicAopProxy.java:202)
05-Feb-2018 19:55:23         at com.sun.proxy.$Proxy31.getComplexObs(Unknown Source)
05-Feb-2018 19:55:23         at org.openmrs.api.ObsServiceTest.getComplexObs_shouldNotFailWithNullView(ObsServiceTest.java:414)
05-Feb-2018 19:55:23         at sun.reflect.NativeMethodAccessorImpl.invoke0(Native Method)
05-Feb-2018 19:55:23         at sun.reflect.NativeMethodAccessorImpl.invoke(NativeMethodAccessorImpl.java:57)
05-Feb-2018 19:55:23         at sun.reflect.DelegatingMethodAccessorImpl.invoke(DelegatingMethodAccessorImpl.java:43)
05-Feb-2018 19:55:23         at java.lang.reflect.Method.invoke(Method.java:606)
05-Feb-2018 19:55:23         at org.junit.runners.model.FrameworkMethod$1.runReflectiveCall(FrameworkMethod.java:47)
05-Feb-2018 19:55:23         at org.junit.internal.runners.model.ReflectiveCallable.run(ReflectiveCallable.java:12)
05-Feb-2018 19:55:23         at org.junit.runners.model.FrameworkMethod.invokeExplosively(FrameworkMethod.java:44)
05-Feb-2018 19:55:23         at org.junit.internal.runners.statements.InvokeMethod.evaluate(InvokeMethod.java:17)
05-Feb-2018 19:55:23         at org.junit.internal.runners.statements.RunBefores.evaluate(RunBefores.java:26)
05-Feb-2018 19:55:23         at org.springframework.test.context.junit4.statements.RunBeforeTestMethodCallbacks.evaluate(RunBeforeTestMethodCallbacks.java:74)
05-Feb-2018 19:55:23         at org.junit.internal.runners.statements.RunAfters.evaluate(RunAfters.java:27)
05-Feb-2018 19:55:23         at org.springframework.test.context.junit4.statements.RunAfterTestMethodCallbacks.evaluate(RunAfterTestMethodCallbacks.java:82)
05-Feb-2018 19:55:23         at org.springframework.test.context.junit4.statements.SpringRepeat.evaluate(SpringRepeat.java:72)
05-Feb-2018 19:55:23         at org.springframework.test.context.junit4.SpringJUnit4ClassRunner.runChild(SpringJUnit4ClassRunner.java:240)
05-Feb-2018 19:55:23         at org.junit.runners.BlockJUnit4ClassRunner.runChild(BlockJUnit4ClassRunner.java:50)
05-Feb-2018 19:55:23         at org.junit.runners.ParentRunner$3.run(ParentRunner.java:238)
05-Feb-2018 19:55:23         at org.junit.runners.ParentRunner$1.schedule(ParentRunner.java:63)
05-Feb-2018 19:55:23         at org.junit.runners.ParentRunner.runChildren(ParentRunner.java:236)
05-Feb-2018 19:55:23         at org.junit.runners.ParentRunner.access$000(ParentRunner.java:53)
05-Feb-2018 19:55:23         at org.junit.runners.ParentRunner$2.evaluate(ParentRunner.java:229)
05-Feb-2018 19:55:23         at org.springframework.test.context.junit4.statements.RunBeforeTestClassCallbacks.evaluate(RunBeforeTestClassCallbacks.java:61)
05-Feb-2018 19:55:23         at org.junit.internal.runners.statements.RunAfters.evaluate(RunAfters.java:27)
05-Feb-2018 19:55:23         at org.springframework.test.context.junit4.statements.RunAfterTestClassCallbacks.evaluate(RunAfterTestClassCallbacks.java:70)
05-Feb-2018 19:55:23         at org.junit.runners.ParentRunner.run(ParentRunner.java:309)
05-Feb-2018 19:55:23         at org.springframework.test.context.junit4.SpringJUnit4ClassRunner.run(SpringJUnit4ClassRunner.java:180)
05-Feb-2018 19:55:23         at org.apache.maven.surefire.junit4.JUnit4TestSet.execute(JUnit4TestSet.java:59)
05-Feb-2018 19:55:23         at org.apache.maven.surefire.suite.AbstractDirectoryTestSuite.executeTestSet(AbstractDirectoryTestSuite.java:115)
05-Feb-2018 19:55:23         at org.apache.maven.surefire.suite.AbstractDirectoryTestSuite.execute(AbstractDirectoryTestSuite.java:102)
05-Feb-2018 19:55:23         at org.apache.maven.surefire.Surefire.run(Surefire.java:180)
05-Feb-2018 19:55:23         at sun.reflect.NativeMethodAccessorImpl.invoke0(Native Method)
05-Feb-2018 19:55:23         at sun.reflect.NativeMethodAccessorImpl.invoke(NativeMethodAccessorImpl.java:57)
05-Feb-2018 19:55:23         at sun.reflect.DelegatingMethodAccessorImpl.invoke(DelegatingMethodAccessorImpl.java:43)
05-Feb-2018 19:55:23         at java.lang.reflect.Method.invoke(Method.java:606)
05-Feb-2018 19:55:23         at org.apache.maven.surefire.booter.SurefireBooter.runSuitesInProcess(SurefireBooter.java:350)
05-Feb-2018 19:55:23         at org.apache.maven.surefire.booter.SurefireBooter.main(SurefireBooter.java:1021)
05-Feb-2018 19:55:23 ERROR - ImageHandler.getObs(70) |2018-02-05 19:55:23,704| Trying to read file: /tmp/appdir-for-unit-tests-4858645346611859623/complex_obs/openmrs_logo_small.gif
05-Feb-2018 19:55:23 javax.imageio.IIOException: Can't read input file!
05-Feb-2018 19:55:23         at javax.imageio.ImageIO.read(ImageIO.java:1301)
05-Feb-2018 19:55:23         at org.openmrs.obs.handler.ImageHandler.getObs(ImageHandler.java:67)
05-Feb-2018 19:55:23         at org.openmrs.api.impl.ObsServiceImpl.getComplexObs(ObsServiceImpl.java:710)
05-Feb-2018 19:55:23         at sun.reflect.NativeMethodAccessorImpl.invoke0(Native Method)
05-Feb-2018 19:55:23         at sun.reflect.NativeMethodAccessorImpl.invoke(NativeMethodAccessorImpl.java:57)
05-Feb-2018 19:55:23         at sun.reflect.DelegatingMethodAccessorImpl.invoke(DelegatingMethodAccessorImpl.java:43)
05-Feb-2018 19:55:23         at java.lang.reflect.Method.invoke(Method.java:606)
05-Feb-2018 19:55:23         at org.springframework.aop.support.AopUtils.invokeJoinpointUsingReflection(AopUtils.java:309)
05-Feb-2018 19:55:23         at org.springframework.aop.framework.ReflectiveMethodInvocation.invokeJoinpoint(ReflectiveMethodInvocation.java:183)
05-Feb-2018 19:55:23         at org.springframework.aop.framework.ReflectiveMethodInvocation.proceed(ReflectiveMethodInvocation.java:150)
05-Feb-2018 19:55:23         at org.springframework.transaction.interceptor.TransactionInterceptor.invoke(TransactionInterceptor.java:110)
05-Feb-2018 19:55:23         at org.springframework.aop.framework.ReflectiveMethodInvocation.proceed(ReflectiveMethodInvocation.java:172)
05-Feb-2018 19:55:23         at org.springframework.aop.framework.JdkDynamicAopProxy.invoke(JdkDynamicAopProxy.java:202)
05-Feb-2018 19:55:23         at com.sun.proxy.$Proxy30.getComplexObs(Unknown Source)
05-Feb-2018 19:55:23         at sun.reflect.NativeMethodAccessorImpl.invoke0(Native Method)
05-Feb-2018 19:55:23         at sun.reflect.NativeMethodAccessorImpl.invoke(NativeMethodAccessorImpl.java:57)
05-Feb-2018 19:55:23         at sun.reflect.DelegatingMethodAccessorImpl.invoke(DelegatingMethodAccessorImpl.java:43)
05-Feb-2018 19:55:23         at java.lang.reflect.Method.invoke(Method.java:606)
05-Feb-2018 19:55:23         at org.springframework.aop.support.AopUtils.invokeJoinpointUsingReflection(AopUtils.java:309)
05-Feb-2018 19:55:23         at org.springframework.aop.framework.ReflectiveMethodInvocation.invokeJoinpoint(ReflectiveMethodInvocation.java:183)
05-Feb-2018 19:55:23         at org.springframework.aop.framework.ReflectiveMethodInvocation.proceed(ReflectiveMethodInvocation.java:150)
05-Feb-2018 19:55:23         at org.springframework.transaction.interceptor.TransactionInterceptor.invoke(TransactionInterceptor.java:110)
05-Feb-2018 19:55:23         at org.springframework.aop.framework.ReflectiveMethodInvocation.proceed(ReflectiveMethodInvocation.java:172)
05-Feb-2018 19:55:23         at org.openmrs.aop.LoggingAdvice.invoke(LoggingAdvice.java:118)
05-Feb-2018 19:55:23         at org.springframework.aop.framework.ReflectiveMethodInvocation.proceed(ReflectiveMethodInvocation.java:172)
05-Feb-2018 19:55:23         at org.springframework.aop.framework.adapter.MethodBeforeAdviceInterceptor.invoke(MethodBeforeAdviceInterceptor.java:50)
05-Feb-2018 19:55:23         at org.springframework.aop.framework.ReflectiveMethodInvocation.proceed(ReflectiveMethodInvocation.java:172)
05-Feb-2018 19:55:23         at org.springframework.aop.framework.adapter.MethodBeforeAdviceInterceptor.invoke(MethodBeforeAdviceInterceptor.java:50)
05-Feb-2018 19:55:23         at org.springframework.aop.framework.ReflectiveMethodInvocation.proceed(ReflectiveMethodInvocation.java:172)
05-Feb-2018 19:55:23         at org.springframework.aop.framework.JdkDynamicAopProxy.invoke(JdkDynamicAopProxy.java:202)
05-Feb-2018 19:55:23         at com.sun.proxy.$Proxy31.getComplexObs(Unknown Source)
05-Feb-2018 19:55:23         at sun.reflect.NativeMethodAccessorImpl.invoke0(Native Method)
05-Feb-2018 19:55:23         at sun.reflect.NativeMethodAccessorImpl.invoke(NativeMethodAccessorImpl.java:57)
05-Feb-2018 19:55:23         at sun.reflect.DelegatingMethodAccessorImpl.invoke(DelegatingMethodAccessorImpl.java:43)
05-Feb-2018 19:55:23         at java.lang.reflect.Method.invoke(Method.java:606)
05-Feb-2018 19:55:23         at org.springframework.aop.support.AopUtils.invokeJoinpointUsingReflection(AopUtils.java:309)
05-Feb-2018 19:55:23         at org.springframework.aop.framework.ReflectiveMethodInvocation.invokeJoinpoint(ReflectiveMethodInvocation.java:183)
05-Feb-2018 19:55:23         at org.springframework.aop.framework.ReflectiveMethodInvocation.proceed(ReflectiveMethodInvocation.java:150)
05-Feb-2018 19:55:23         at org.springframework.transaction.interceptor.TransactionInterceptor.invoke(TransactionInterceptor.java:110)
05-Feb-2018 19:55:23         at org.springframework.aop.framework.ReflectiveMethodInvocation.proceed(ReflectiveMethodInvocation.java:172)
05-Feb-2018 19:55:23         at org.springframework.aop.framework.JdkDynamicAopProxy.invoke(JdkDynamicAopProxy.java:202)
05-Feb-2018 19:55:23         at com.sun.proxy.$Proxy31.getComplexObs(Unknown Source)
05-Feb-2018 19:55:23         at org.openmrs.api.ObsServiceTest.getComplexObs_shouldFillInComplexDataObjectForComplexObs(ObsServiceTest.java:396)
05-Feb-2018 19:55:23         at sun.reflect.NativeMethodAccessorImpl.invoke0(Native Method)
05-Feb-2018 19:55:23         at sun.reflect.NativeMethodAccessorImpl.invoke(NativeMethodAccessorImpl.java:57)
05-Feb-2018 19:55:23         at sun.reflect.DelegatingMethodAccessorImpl.invoke(DelegatingMethodAccessorImpl.java:43)
05-Feb-2018 19:55:23         at java.lang.reflect.Method.invoke(Method.java:606)
05-Feb-2018 19:55:23         at org.junit.runners.model.FrameworkMethod$1.runReflectiveCall(FrameworkMethod.java:47)
05-Feb-2018 19:55:23         at org.junit.internal.runners.model.ReflectiveCallable.run(ReflectiveCallable.java:12)
05-Feb-2018 19:55:23         at org.junit.runners.model.FrameworkMethod.invokeExplosively(FrameworkMethod.java:44)
05-Feb-2018 19:55:23         at org.junit.internal.runners.statements.InvokeMethod.evaluate(InvokeMethod.java:17)
05-Feb-2018 19:55:23         at org.junit.internal.runners.statements.RunBefores.evaluate(RunBefores.java:26)
05-Feb-2018 19:55:23         at org.springframework.test.context.junit4.statements.RunBeforeTestMethodCallbacks.evaluate(RunBeforeTestMethodCallbacks.java:74)
05-Feb-2018 19:55:23         at org.junit.internal.runners.statements.RunAfters.evaluate(RunAfters.java:27)
05-Feb-2018 19:55:23         at org.springframework.test.context.junit4.statements.RunAfterTestMethodCallbacks.evaluate(RunAfterTestMethodCallbacks.java:82)
05-Feb-2018 19:55:23         at org.springframework.test.context.junit4.statements.SpringRepeat.evaluate(SpringRepeat.java:72)
05-Feb-2018 19:55:23         at org.springframework.test.context.junit4.SpringJUnit4ClassRunner.runChild(SpringJUnit4ClassRunner.java:240)
05-Feb-2018 19:55:23         at org.junit.runners.BlockJUnit4ClassRunner.runChild(BlockJUnit4ClassRunner.java:50)
05-Feb-2018 19:55:23         at org.junit.runners.ParentRunner$3.run(ParentRunner.java:238)
05-Feb-2018 19:55:23         at org.junit.runners.ParentRunner$1.schedule(ParentRunner.java:63)
05-Feb-2018 19:55:23         at org.junit.runners.ParentRunner.runChildren(ParentRunner.java:236)
05-Feb-2018 19:55:23         at org.junit.runners.ParentRunner.access$000(ParentRunner.java:53)
05-Feb-2018 19:55:23         at org.junit.runners.ParentRunner$2.evaluate(ParentRunner.java:229)
05-Feb-2018 19:55:23         at org.springframework.test.context.junit4.statements.RunBeforeTestClassCallbacks.evaluate(RunBeforeTestClassCallbacks.java:61)
05-Feb-2018 19:55:23         at org.junit.internal.runners.statements.RunAfters.evaluate(RunAfters.java:27)
05-Feb-2018 19:55:23         at org.springframework.test.context.junit4.statements.RunAfterTestClassCallbacks.evaluate(RunAfterTestClassCallbacks.java:70)
05-Feb-2018 19:55:23         at org.junit.runners.ParentRunner.run(ParentRunner.java:309)
05-Feb-2018 19:55:23         at org.springframework.test.context.junit4.SpringJUnit4ClassRunner.run(SpringJUnit4ClassRunner.java:180)
05-Feb-2018 19:55:23         at org.apache.maven.surefire.junit4.JUnit4TestSet.execute(JUnit4TestSet.java:59)
05-Feb-2018 19:55:23         at org.apache.maven.surefire.suite.AbstractDirectoryTestSuite.executeTestSet(AbstractDirectoryTestSuite.java:115)
05-Feb-2018 19:55:23         at org.apache.maven.surefire.suite.AbstractDirectoryTestSuite.execute(AbstractDirectoryTestSuite.java:102)
05-Feb-2018 19:55:23         at org.apache.maven.surefire.Surefire.run(Surefire.java:180)
05-Feb-2018 19:55:23         at sun.reflect.NativeMethodAccessorImpl.invoke0(Native Method)
05-Feb-2018 19:55:23         at sun.reflect.NativeMethodAccessorImpl.invoke(NativeMethodAccessorImpl.java:57)
05-Feb-2018 19:55:23         at sun.reflect.DelegatingMethodAccessorImpl.invoke(DelegatingMethodAccessorImpl.java:43)
05-Feb-2018 19:55:23         at java.lang.reflect.Method.invoke(Method.java:606)
05-Feb-2018 19:55:23         at org.apache.maven.surefire.booter.SurefireBooter.runSuitesInProcess(SurefireBooter.java:350)
05-Feb-2018 19:55:23         at org.apache.maven.surefire.booter.SurefireBooter.main(SurefireBooter.java:1021)
05-Feb-2018 19:55:23 Tests run: 65, Failures: 0, Errors: 0, Skipped: 0, Time elapsed: 4.368 sec
05-Feb-2018 19:55:23 Running org.openmrs.scheduler.SchedulerUtilTest
05-Feb-2018 19:55:23 Tests run: 1, Failures: 0, Errors: 0, Skipped: 0, Time elapsed: 0.002 sec
05-Feb-2018 19:55:23 Running org.openmrs.propertyeditor.ConceptSourceEditorTest
05-Feb-2018 19:55:23 Tests run: 2, Failures: 0, Errors: 0, Skipped: 0, Time elapsed: 0.12 sec
05-Feb-2018 19:55:23 Running org.openmrs.propertyeditor.PersonAttributeTypeEditorTest
05-Feb-2018 19:55:23 Tests run: 2, Failures: 0, Errors: 0, Skipped: 0, Time elapsed: 0.12 sec
05-Feb-2018 19:55:23 Running org.openmrs.hl7.HL7ServiceTest
05-Feb-2018 19:55:25 Tests run: 26, Failures: 0, Errors: 0, Skipped: 2, Time elapsed: 1.724 sec
05-Feb-2018 19:55:25 Running org.openmrs.notification.AlertServiceTest
05-Feb-2018 19:55:25 Tests run: 1, Failures: 0, Errors: 0, Skipped: 0, Time elapsed: 0.07 sec
05-Feb-2018 19:55:25 Running org.openmrs.propertyeditor.OrderTypeEditorTest
05-Feb-2018 19:55:25 Tests run: 2, Failures: 0, Errors: 0, Skipped: 0, Time elapsed: 0.139 sec
05-Feb-2018 19:55:25 Running org.openmrs.report.RowPerProgramEnrollmentDatasetTest
05-Feb-2018 19:55:25 Tests run: 1, Failures: 0, Errors: 0, Skipped: 0, Time elapsed: 0.079 sec
05-Feb-2018 19:55:25
05-Feb-2018 19:55:25 Results :
05-Feb-2018 19:55:25
05-Feb-2018 19:55:25 Tests run: 2253, Failures: 0, Errors: 0, Skipped: 26
05-Feb-2018 19:55:25
05-Feb-2018 19:55:29 [INFO]
05-Feb-2018 19:55:29 [INFO] --- maven-jar-plugin:2.3.2:jar (default-jar) @ openmrs-api ---
05-Feb-2018 19:55:30 [INFO] Building jar: /home/bamboo-agent/bamboo-agent/xml-data/build-dir/TRUNK-LATEST-JOB1/api/target/openmrs-api-1.9.13-SNAPSHOT.jar
05-Feb-2018 19:55:30 [INFO]
05-Feb-2018 19:55:30 [INFO] --- maven-jar-plugin:2.3.2:test-jar (default) @ openmrs-api ---
05-Feb-2018 19:55:30 [INFO] Building jar: /home/bamboo-agent/bamboo-agent/xml-data/build-dir/TRUNK-LATEST-JOB1/api/target/openmrs-api-1.9.13-SNAPSHOT-tests.jar
05-Feb-2018 19:55:31 [INFO]
05-Feb-2018 19:55:31 [INFO] --- license-maven-plugin:2.6:check (default) @ openmrs-api ---
05-Feb-2018 19:55:31 [INFO] Checking licenses...
05-Feb-2018 19:55:31 [INFO]
05-Feb-2018 19:55:31 [INFO] --- maven-install-plugin:2.4:install (default-install) @ openmrs-api ---
05-Feb-2018 19:55:31 [INFO] Installing /home/bamboo-agent/bamboo-agent/xml-data/build-dir/TRUNK-LATEST-JOB1/api/target/openmrs-api-1.9.13-SNAPSHOT.jar to /home/bamboo-agent/.m2/repository/org/openmrs/api/openmrs-api/1.9.13-SNAPSHOT/openmrs-api-1.9.13-SNAPSHOT.jar
05-Feb-2018 19:55:31 [INFO] Installing /home/bamboo-agent/bamboo-agent/xml-data/build-dir/TRUNK-LATEST-JOB1/api/pom.xml to /home/bamboo-agent/.m2/repository/org/openmrs/api/openmrs-api/1.9.13-SNAPSHOT/openmrs-api-1.9.13-SNAPSHOT.pom
05-Feb-2018 19:55:31 [INFO] Installing /home/bamboo-agent/bamboo-agent/xml-data/build-dir/TRUNK-LATEST-JOB1/api/target/openmrs-api-1.9.13-SNAPSHOT-tests.jar to /home/bamboo-agent/.m2/repository/org/openmrs/api/openmrs-api/1.9.13-SNAPSHOT/openmrs-api-1.9.13-SNAPSHOT-tests.jar
05-Feb-2018 19:55:31 [INFO]
05-Feb-2018 19:55:31 [INFO] --- maven-deploy-plugin:2.7:deploy (default-deploy) @ openmrs-api ---
05-Feb-2018 19:55:31 [INFO] Downloading: http://mavenrepo.openmrs.org/nexus/content/repositories/snapshots/org/openmrs/api/openmrs-api/1.9.13-SNAPSHOT/maven-metadata.xml
05-Feb-2018 19:55:32 [INFO] Downloaded: http://mavenrepo.openmrs.org/nexus/content/repositories/snapshots/org/openmrs/api/openmrs-api/1.9.13-SNAPSHOT/maven-metadata.xml (992 B at 3.9 KB/sec)
05-Feb-2018 19:55:32 [INFO] Uploading: http://mavenrepo.openmrs.org/nexus/content/repositories/snapshots/org/openmrs/api/openmrs-api/1.9.13-SNAPSHOT/openmrs-api-1.9.13-20180205.195532-2.jar
05-Feb-2018 19:55:33 [INFO] Uploaded: http://mavenrepo.openmrs.org/nexus/content/repositories/snapshots/org/openmrs/api/openmrs-api/1.9.13-SNAPSHOT/openmrs-api-1.9.13-20180205.195532-2.jar (1763 KB at 1344.5 KB/sec)
05-Feb-2018 19:55:33 [INFO] Uploading: http://mavenrepo.openmrs.org/nexus/content/repositories/snapshots/org/openmrs/api/openmrs-api/1.9.13-SNAPSHOT/openmrs-api-1.9.13-20180205.195532-2.pom
05-Feb-2018 19:55:33 [INFO] Uploaded: http://mavenrepo.openmrs.org/nexus/content/repositories/snapshots/org/openmrs/api/openmrs-api/1.9.13-SNAPSHOT/openmrs-api-1.9.13-20180205.195532-2.pom (11 KB at 23.5 KB/sec)
05-Feb-2018 19:55:33 [INFO] Downloading: http://mavenrepo.openmrs.org/nexus/content/repositories/snapshots/org/openmrs/api/openmrs-api/maven-metadata.xml
05-Feb-2018 19:55:34 [INFO] Downloaded: http://mavenrepo.openmrs.org/nexus/content/repositories/snapshots/org/openmrs/api/openmrs-api/maven-metadata.xml (2 KB at 5.1 KB/sec)
05-Feb-2018 19:55:34 [INFO] Uploading: http://mavenrepo.openmrs.org/nexus/content/repositories/snapshots/org/openmrs/api/openmrs-api/1.9.13-SNAPSHOT/maven-metadata.xml
05-Feb-2018 19:55:34 [INFO] Uploaded: http://mavenrepo.openmrs.org/nexus/content/repositories/snapshots/org/openmrs/api/openmrs-api/1.9.13-SNAPSHOT/maven-metadata.xml (992 B at 2.7 KB/sec)
05-Feb-2018 19:55:34 [INFO] Uploading: http://mavenrepo.openmrs.org/nexus/content/repositories/snapshots/org/openmrs/api/openmrs-api/maven-metadata.xml
05-Feb-2018 19:55:34 [INFO] Uploaded: http://mavenrepo.openmrs.org/nexus/content/repositories/snapshots/org/openmrs/api/openmrs-api/maven-metadata.xml (2 KB at 2.9 KB/sec)
05-Feb-2018 19:55:34 [INFO] Uploading: http://mavenrepo.openmrs.org/nexus/content/repositories/snapshots/org/openmrs/api/openmrs-api/1.9.13-SNAPSHOT/openmrs-api-1.9.13-20180205.195532-2-tests.jar
05-Feb-2018 19:55:35 [INFO] Uploaded: http://mavenrepo.openmrs.org/nexus/content/repositories/snapshots/org/openmrs/api/openmrs-api/1.9.13-SNAPSHOT/openmrs-api-1.9.13-20180205.195532-2-tests.jar (2620 KB at 3354.3 KB/sec)
05-Feb-2018 19:55:35 [INFO] Uploading: http://mavenrepo.openmrs.org/nexus/content/repositories/snapshots/org/openmrs/api/openmrs-api/1.9.13-SNAPSHOT/maven-metadata.xml
05-Feb-2018 19:55:35 [INFO] Uploaded: http://mavenrepo.openmrs.org/nexus/content/repositories/snapshots/org/openmrs/api/openmrs-api/1.9.13-SNAPSHOT/maven-metadata.xml (992 B at 2.6 KB/sec)
05-Feb-2018 19:55:35 [INFO]                                                                         
05-Feb-2018 19:55:35 [INFO] ------------------------------------------------------------------------
05-Feb-2018 19:55:35 [INFO] Building openmrs-web 1.9.13-SNAPSHOT
05-Feb-2018 19:55:35 [INFO] ------------------------------------------------------------------------
05-Feb-2018 19:55:35 [INFO] Downloading: http://mavenrepo.openmrs.org/nexus/content/repositories/public/org/openmrs/api/openmrs-api/1.9.13-SNAPSHOT/maven-metadata.xml
05-Feb-2018 19:55:36 [INFO] Downloaded: http://mavenrepo.openmrs.org/nexus/content/repositories/public/org/openmrs/api/openmrs-api/1.9.13-SNAPSHOT/maven-metadata.xml (992 B at 2.5 KB/sec)
05-Feb-2018 19:55:36 [INFO] Downloading: http://mavenrepo.openmrs.org/nexus/content/repositories/public/org/openmrs/api/openmrs-api/1.9.13-SNAPSHOT/openmrs-api-1.9.13-20180205.195532-2-tests.jar
05-Feb-2018 19:55:37 [INFO] Downloaded: http://mavenrepo.openmrs.org/nexus/content/repositories/public/org/openmrs/api/openmrs-api/1.9.13-SNAPSHOT/openmrs-api-1.9.13-20180205.195532-2-tests.jar (2620 KB at 2366.5 KB/sec)
05-Feb-2018 19:55:37 [INFO]
05-Feb-2018 19:55:37 [INFO] --- maven-clean-plugin:2.5:clean (default-clean) @ openmrs-web ---
05-Feb-2018 19:55:37 [INFO]
05-Feb-2018 19:55:37 [INFO] --- buildnumber-maven-plugin:1.1:create (default) @ openmrs-web ---
05-Feb-2018 19:55:37 [INFO]
05-Feb-2018 19:55:37 [INFO] --- build-helper-maven-plugin:1.5:parse-version (parse-version) @ openmrs-web ---
05-Feb-2018 19:55:37 [INFO]
05-Feb-2018 19:55:37 [INFO] --- maven-java-formatter-plugin:0.3:format (default) @ openmrs-web ---
05-Feb-2018 19:55:37 [INFO] Using 'UTF-8' encoding to format source files.
05-Feb-2018 19:55:37 [INFO] Number of files to be formatted: 409
05-Feb-2018 19:55:38 [INFO] Successfully formatted: 1 file(s)
05-Feb-2018 19:55:38 [INFO] Fail to format        : 0 file(s)
05-Feb-2018 19:55:38 [INFO] Skipped               : 408 file(s)
05-Feb-2018 19:55:38 [INFO] Approximate time taken: 0s
05-Feb-2018 19:55:38 [INFO]
05-Feb-2018 19:55:38 [INFO] --- maven-resources-plugin:2.4:resources (default-resources) @ openmrs-web ---
05-Feb-2018 19:55:38 [INFO] Using 'UTF-8' encoding to copy filtered resources.
05-Feb-2018 19:55:38 [INFO] Copying 22 resources
05-Feb-2018 19:55:38 [INFO]
05-Feb-2018 19:55:38 [INFO] --- maven-compiler-plugin:2.1:compile (default-compile) @ openmrs-web ---
05-Feb-2018 19:55:38 [INFO] Compiling 345 source files to /home/bamboo-agent/bamboo-agent/xml-data/build-dir/TRUNK-LATEST-JOB1/web/target/classes
05-Feb-2018 19:55:43 [INFO]
05-Feb-2018 19:55:43 [INFO] --- maven-resources-plugin:2.4:testResources (default-testResources) @ openmrs-web ---
05-Feb-2018 19:55:43 [INFO] Using 'UTF-8' encoding to copy filtered resources.
05-Feb-2018 19:55:43 [INFO] Copying 18 resources
05-Feb-2018 19:55:43 [INFO]
05-Feb-2018 19:55:43 [INFO] --- maven-compiler-plugin:2.1:testCompile (default-testCompile) @ openmrs-web ---
05-Feb-2018 19:55:43 [INFO] Compiling 64 source files to /home/bamboo-agent/bamboo-agent/xml-data/build-dir/TRUNK-LATEST-JOB1/web/target/test-classes
05-Feb-2018 19:55:45 [INFO]
05-Feb-2018 19:55:45 [INFO] --- maven-surefire-plugin:2.5:test (default-test) @ openmrs-web ---
05-Feb-2018 19:55:45 [INFO] Surefire report directory: /home/bamboo-agent/bamboo-agent/xml-data/build-dir/TRUNK-LATEST-JOB1/web/target/surefire-reports
05-Feb-2018 19:55:45
05-Feb-2018 19:55:45 -------------------------------------------------------
05-Feb-2018 19:55:45 T E S T S
05-Feb-2018 19:55:45 -------------------------------------------------------
05-Feb-2018 19:55:45 Running org.openmrs.web.controller.encounter.LocationFormControllerTest
05-Feb-2018 19:55:59 Tests run: 3, Failures: 0, Errors: 0, Skipped: 0, Time elapsed: 13.607 sec
05-Feb-2018 19:55:59 Running org.openmrs.web.controller.user.RoleFormControllerTest
05-Feb-2018 19:55:59 Tests run: 1, Failures: 0, Errors: 0, Skipped: 0, Time elapsed: 0.362 sec
05-Feb-2018 19:55:59 Running org.openmrs.web.WebUtilTest
05-Feb-2018 19:55:59 Tests run: 7, Failures: 0, Errors: 0, Skipped: 0, Time elapsed: 0.01 sec
05-Feb-2018 19:55:59 Running org.openmrs.web.taglib.RequireTagTest
05-Feb-2018 19:56:00 Tests run: 6, Failures: 0, Errors: 0, Skipped: 0, Time elapsed: 0.325 sec
05-Feb-2018 19:56:00 Running org.openmrs.web.filter.update.UpdateFilterTest
05-Feb-2018 19:56:00 Tests run: 5, Failures: 0, Errors: 0, Skipped: 0, Time elapsed: 0.733 sec
05-Feb-2018 19:56:00 Running org.openmrs.web.controller.person.PersonAttributeTypeListControllerTest
05-Feb-2018 19:56:02 Tests run: 9, Failures: 0, Errors: 0, Skipped: 0, Time elapsed: 1.302 sec
05-Feb-2018 19:56:02 Running org.openmrs.web.controller.person.AddPersonControllerTest
05-Feb-2018 19:56:02 Tests run: 2, Failures: 0, Errors: 0, Skipped: 0, Time elapsed: 0.445 sec
05-Feb-2018 19:56:02 Running org.openmrs.annotation.OpenmrsProfileExcludeFilterWithModulesTest
05-Feb-2018 19:56:03 Tests run: 1, Failures: 0, Errors: 0, Skipped: 0, Time elapsed: 0.86 sec
05-Feb-2018 19:56:03 Running org.openmrs.web.servlet.ShowGraphServletTest
05-Feb-2018 19:56:04 Tests run: 7, Failures: 0, Errors: 0, Skipped: 0, Time elapsed: 0.879 sec
05-Feb-2018 19:56:04 Running org.openmrs.web.order.OrderTest
05-Feb-2018 19:56:04 Tests run: 1, Failures: 0, Errors: 0, Skipped: 0, Time elapsed: 0.137 sec
05-Feb-2018 19:56:04 Running org.openmrs.module.web.WebModuleUtilTest
05-Feb-2018 19:56:06 SLF4J: Class path contains multiple SLF4J bindings.
05-Feb-2018 19:56:06 SLF4J: Found binding in [jar:file:/home/bamboo-agent/.m2/repository/org/slf4j/slf4j-log4j12/1.6.0/slf4j-log4j12-1.6.0.jar!/org/slf4j/impl/StaticLoggerBinder.class]
05-Feb-2018 19:56:06 SLF4J: Found binding in [jar:file:/home/bamboo-agent/.m2/repository/org/slf4j/slf4j-log4j12/1.6.0/slf4j-log4j12-1.6.0.jar!/org/slf4j/impl/StaticLoggerBinder.class]
05-Feb-2018 19:56:06 SLF4J: See http://www.slf4j.org/codes.html#multiple_bindings for an explanation.
05-Feb-2018 19:56:06 Tests run: 2, Failures: 0, Errors: 0, Skipped: 0, Time elapsed: 2.09 sec
05-Feb-2018 19:56:06 Running org.openmrs.layout.web.NameTemplateTest
05-Feb-2018 19:56:06 Tests run: 2, Failures: 0, Errors: 0, Skipped: 0, Time elapsed: 0.005 sec
05-Feb-2018 19:56:06 Running org.openmrs.web.dwr.DWRPatientServiceTest
05-Feb-2018 19:56:07 Tests run: 6, Failures: 0, Errors: 0, Skipped: 2, Time elapsed: 0.639 sec
05-Feb-2018 19:56:07 Running org.openmrs.web.taglib.ForEachEncounterTagTest
05-Feb-2018 19:56:07 Tests run: 2, Failures: 0, Errors: 0, Skipped: 0, Time elapsed: 0.199 sec
05-Feb-2018 19:56:07 Running org.openmrs.web.servlet.LoginServletTest
05-Feb-2018 19:56:07 Tests run: 3, Failures: 0, Errors: 0, Skipped: 0, Time elapsed: 0.295 sec
05-Feb-2018 19:56:07 Running org.openmrs.scheduler.web.controller.SchedulerFormControllerTest
05-Feb-2018 19:56:08 Tests run: 3, Failures: 0, Errors: 0, Skipped: 0, Time elapsed: 0.423 sec
05-Feb-2018 19:56:08 Running org.openmrs.web.controller.concept.ConceptStopWordFormControllerTest
05-Feb-2018 19:56:08 Tests run: 2, Failures: 0, Errors: 0, Skipped: 0, Time elapsed: 0.177 sec
05-Feb-2018 19:56:08 Running org.openmrs.web.ForgotPasswordFormControllerTest
05-Feb-2018 19:56:08 WARN - HibernateUserDAO.getUserByUsername(103) |2018-02-05 19:56:08,565| request for username 'invaliduser' not found
05-Feb-2018 19:56:08 WARN - HibernateUserDAO.getUserByUsername(103) |2018-02-05 19:56:08,567| request for username 'invaliduser' not found
05-Feb-2018 19:56:08 WARN - HibernateUserDAO.getUserByUsername(103) |2018-02-05 19:56:08,568| request for username 'invaliduser' not found
05-Feb-2018 19:56:08 WARN - HibernateUserDAO.getUserByUsername(103) |2018-02-05 19:56:08,570| request for username 'invaliduser' not found
05-Feb-2018 19:56:08 WARN - HibernateUserDAO.getUserByUsername(103) |2018-02-05 19:56:08,666| request for username 'invaliduser' not found
05-Feb-2018 19:56:08 WARN - HibernateUserDAO.getUserByUsername(103) |2018-02-05 19:56:08,667| request for username 'invaliduser' not found
05-Feb-2018 19:56:08 WARN - HibernateUserDAO.getUserByUsername(103) |2018-02-05 19:56:08,668| request for username 'invaliduser' not found
05-Feb-2018 19:56:08 WARN - HibernateUserDAO.getUserByUsername(103) |2018-02-05 19:56:08,669| request for username 'invaliduser' not found
05-Feb-2018 19:56:08 WARN - HibernateUserDAO.getUserByUsername(103) |2018-02-05 19:56:08,670| request for username 'invaliduser' not found
05-Feb-2018 19:56:08 WARN - HibernateUserDAO.getUserByUsername(103) |2018-02-05 19:56:08,815| request for username 'invaliduser' not found
05-Feb-2018 19:56:08 WARN - HibernateUserDAO.getUserByUsername(103) |2018-02-05 19:56:08,816| request for username 'invaliduser' not found
05-Feb-2018 19:56:08 WARN - HibernateUserDAO.getUserByUsername(103) |2018-02-05 19:56:08,817| request for username 'invaliduser' not found
05-Feb-2018 19:56:08 WARN - HibernateUserDAO.getUserByUsername(103) |2018-02-05 19:56:08,818| request for username 'invaliduser' not found
05-Feb-2018 19:56:08 WARN - HibernateUserDAO.getUserByUsername(103) |2018-02-05 19:56:08,819| request for username 'invaliduser' not found
05-Feb-2018 19:56:08 Tests run: 8, Failures: 0, Errors: 0, Skipped: 0, Time elapsed: 0.779 sec
05-Feb-2018 19:56:08 Running org.openmrs.web.patient.PatientDashboardGraphControllerTest
05-Feb-2018 19:56:09 Tests run: 2, Failures: 0, Errors: 0, Skipped: 0, Time elapsed: 0.196 sec
05-Feb-2018 19:56:09 Running org.openmrs.scheduler.web.controller.SchedulerFormTest
05-Feb-2018 19:56:09 Tests run: 1, Failures: 0, Errors: 0, Skipped: 0, Time elapsed: 0.074 sec
05-Feb-2018 19:56:09 Running org.openmrs.web.dwr.ProviderListItemTest
05-Feb-2018 19:56:09 Tests run: 4, Failures: 0, Errors: 0, Skipped: 0, Time elapsed: 0.007 sec
05-Feb-2018 19:56:09 Running org.openmrs.web.controller.user.UserFormControllerTest
05-Feb-2018 19:56:09 Tests run: 2, Failures: 0, Errors: 0, Skipped: 0, Time elapsed: 0.69 sec
05-Feb-2018 19:56:09 Running org.openmrs.web.controller.user.ChangePasswordFormControllerTest
05-Feb-2018 19:56:11 Tests run: 13, Failures: 0, Errors: 0, Skipped: 0, Time elapsed: 1.208 sec
05-Feb-2018 19:56:11 Running org.openmrs.web.controller.patient.ShortPatientFormValidatorTest
05-Feb-2018 19:56:12 Tests run: 15, Failures: 0, Errors: 0, Skipped: 0, Time elapsed: 1.37 sec
05-Feb-2018 19:56:12 Running org.openmrs.web.controller.concept.ConceptSourceListControllerTest
05-Feb-2018 19:56:12 Tests run: 1, Failures: 0, Errors: 0, Skipped: 0, Time elapsed: 0.079 sec
05-Feb-2018 19:56:12 Running org.openmrs.web.filter.update.util.FilterUtilTest
05-Feb-2018 19:56:12 Tests run: 2, Failures: 0, Errors: 0, Skipped: 2, Time elapsed: 0.003 sec
05-Feb-2018 19:56:12 Running org.openmrs.web.dwr.DWRConceptServiceTest
05-Feb-2018 19:56:13 Tests run: 11, Failures: 0, Errors: 0, Skipped: 0, Time elapsed: 1.275 sec
05-Feb-2018 19:56:13 Running org.openmrs.web.controller.patient.ShortPatientFormControllerTest
05-Feb-2018 19:56:15 Tests run: 14, Failures: 0, Errors: 0, Skipped: 0, Time elapsed: 1.54 sec
05-Feb-2018 19:56:15 Running org.openmrs.web.controller.UserPropertiesTest
05-Feb-2018 19:56:15 Tests run: 6, Failures: 0, Errors: 0, Skipped: 0, Time elapsed: 0.004 sec
05-Feb-2018 19:56:15 Running org.openmrs.web.controller.OptionsFormControllerTest
05-Feb-2018 19:56:15 ERROR - MutableResourceBundleMessageSource.findPropertiesFiles(319) |2018-02-05 19:56:15,505| Error generated
05-Feb-2018 19:56:15 java.io.FileNotFoundException: class path resource [WEB-INF/] cannot be resolved to URL because it does not exist
05-Feb-2018 19:56:15         at org.springframework.core.io.ClassPathResource.getURL(ClassPathResource.java:179)
05-Feb-2018 19:56:15         at org.springframework.core.io.AbstractFileResolvingResource.getFile(AbstractFileResolvingResource.java:48)
05-Feb-2018 19:56:15         at org.openmrs.messagesource.impl.MutableResourceBundleMessageSource.findPropertiesFiles(MutableResourceBundleMessageSource.java:307)
05-Feb-2018 19:56:15         at org.openmrs.messagesource.impl.MutableResourceBundleMessageSource.findLocales(MutableResourceBundleMessageSource.java:89)
05-Feb-2018 19:56:15         at org.openmrs.messagesource.impl.MutableResourceBundleMessageSource.getLocales(MutableResourceBundleMessageSource.java:66)
05-Feb-2018 19:56:15         at sun.reflect.NativeMethodAccessorImpl.invoke0(Native Method)
05-Feb-2018 19:56:15         at sun.reflect.NativeMethodAccessorImpl.invoke(NativeMethodAccessorImpl.java:57)
05-Feb-2018 19:56:15         at sun.reflect.DelegatingMethodAccessorImpl.invoke(DelegatingMethodAccessorImpl.java:43)
05-Feb-2018 19:56:15         at java.lang.reflect.Method.invoke(Method.java:606)
05-Feb-2018 19:56:15         at org.springframework.aop.support.AopUtils.invokeJoinpointUsingReflection(AopUtils.java:309)
05-Feb-2018 19:56:15         at org.springframework.aop.framework.ReflectiveMethodInvocation.invokeJoinpoint(ReflectiveMethodInvocation.java:183)
05-Feb-2018 19:56:15         at org.springframework.aop.framework.ReflectiveMethodInvocation.proceed(ReflectiveMethodInvocation.java:150)
05-Feb-2018 19:56:15         at org.springframework.transaction.interceptor.TransactionInterceptor.invoke(TransactionInterceptor.java:110)
05-Feb-2018 19:56:15         at org.springframework.aop.framework.ReflectiveMethodInvocation.proceed(ReflectiveMethodInvocation.java:172)
05-Feb-2018 19:56:15         at org.springframework.aop.framework.JdkDynamicAopProxy.invoke(JdkDynamicAopProxy.java:202)
05-Feb-2018 19:56:15         at com.sun.proxy.$Proxy23.getLocales(Unknown Source)
05-Feb-2018 19:56:15         at org.openmrs.messagesource.impl.MessageSourceServiceImpl.getLocales(MessageSourceServiceImpl.java:82)
05-Feb-2018 19:56:15         at sun.reflect.NativeMethodAccessorImpl.invoke0(Native Method)
05-Feb-2018 19:56:15         at sun.reflect.NativeMethodAccessorImpl.invoke(NativeMethodAccessorImpl.java:57)
05-Feb-2018 19:56:15         at sun.reflect.DelegatingMethodAccessorImpl.invoke(DelegatingMethodAccessorImpl.java:43)
05-Feb-2018 19:56:15         at java.lang.reflect.Method.invoke(Method.java:606)
05-Feb-2018 19:56:15         at org.springframework.aop.support.AopUtils.invokeJoinpointUsingReflection(AopUtils.java:309)
05-Feb-2018 19:56:15         at org.springframework.aop.framework.ReflectiveMethodInvocation.invokeJoinpoint(ReflectiveMethodInvocation.java:183)
05-Feb-2018 19:56:15         at org.springframework.aop.framework.ReflectiveMethodInvocation.proceed(ReflectiveMethodInvocation.java:150)
05-Feb-2018 19:56:15         at org.springframework.transaction.interceptor.TransactionInterceptor.invoke(TransactionInterceptor.java:110)
05-Feb-2018 19:56:15         at org.springframework.aop.framework.ReflectiveMethodInvocation.proceed(ReflectiveMethodInvocation.java:172)
05-Feb-2018 19:56:15         at org.openmrs.aop.LoggingAdvice.invoke(LoggingAdvice.java:118)
05-Feb-2018 19:56:15         at org.springframework.aop.framework.ReflectiveMethodInvocation.proceed(ReflectiveMethodInvocation.java:172)
05-Feb-2018 19:56:15         at org.springframework.aop.framework.adapter.MethodBeforeAdviceInterceptor.invoke(MethodBeforeAdviceInterceptor.java:50)
05-Feb-2018 19:56:15         at org.springframework.aop.framework.ReflectiveMethodInvocation.proceed(ReflectiveMethodInvocation.java:172)
05-Feb-2018 19:56:15         at org.springframework.aop.framework.adapter.MethodBeforeAdviceInterceptor.invoke(MethodBeforeAdviceInterceptor.java:50)
05-Feb-2018 19:56:15         at org.springframework.aop.framework.ReflectiveMethodInvocation.proceed(ReflectiveMethodInvocation.java:172)
05-Feb-2018 19:56:15         at org.springframework.aop.framework.JdkDynamicAopProxy.invoke(JdkDynamicAopProxy.java:202)
05-Feb-2018 19:56:15         at com.sun.proxy.$Proxy21.getLocales(Unknown Source)
05-Feb-2018 19:56:15         at sun.reflect.NativeMethodAccessorImpl.invoke0(Native Method)
05-Feb-2018 19:56:15         at sun.reflect.NativeMethodAccessorImpl.invoke(NativeMethodAccessorImpl.java:57)
05-Feb-2018 19:56:15         at sun.reflect.DelegatingMethodAccessorImpl.invoke(DelegatingMethodAccessorImpl.java:43)
05-Feb-2018 19:56:15         at java.lang.reflect.Method.invoke(Method.java:606)
05-Feb-2018 19:56:15         at org.springframework.aop.support.AopUtils.invokeJoinpointUsingReflection(AopUtils.java:309)
05-Feb-2018 19:56:15         at org.springframework.aop.framework.ReflectiveMethodInvocation.invokeJoinpoint(ReflectiveMethodInvocation.java:183)
05-Feb-2018 19:56:15         at org.springframework.aop.framework.ReflectiveMethodInvocation.proceed(ReflectiveMethodInvocation.java:150)
05-Feb-2018 19:56:15         at org.springframework.transaction.interceptor.TransactionInterceptor.invoke(TransactionInterceptor.java:110)
05-Feb-2018 19:56:15         at org.springframework.aop.framework.ReflectiveMethodInvocation.proceed(ReflectiveMethodInvocation.java:172)
05-Feb-2018 19:56:15         at org.springframework.aop.framework.JdkDynamicAopProxy.invoke(JdkDynamicAopProxy.java:202)
05-Feb-2018 19:56:15         at com.sun.proxy.$Proxy75.getLocales(Unknown Source)
05-Feb-2018 19:56:15         at org.openmrs.api.impl.AdministrationServiceImpl.getPresentationLocales(AdministrationServiceImpl.java:1014)
05-Feb-2018 19:56:15         at sun.reflect.NativeMethodAccessorImpl.invoke0(Native Method)
05-Feb-2018 19:56:15         at sun.reflect.NativeMethodAccessorImpl.invoke(NativeMethodAccessorImpl.java:57)
05-Feb-2018 19:56:15         at sun.reflect.DelegatingMethodAccessorImpl.invoke(DelegatingMethodAccessorImpl.java:43)
05-Feb-2018 19:56:15         at java.lang.reflect.Method.invoke(Method.java:606)
05-Feb-2018 19:56:15         at org.springframework.aop.support.AopUtils.invokeJoinpointUsingReflection(AopUtils.java:309)
05-Feb-2018 19:56:15         at org.springframework.aop.framework.ReflectiveMethodInvocation.invokeJoinpoint(ReflectiveMethodInvocation.java:183)
05-Feb-2018 19:56:15         at org.springframework.aop.framework.ReflectiveMethodInvocation.proceed(ReflectiveMethodInvocation.java:150)
05-Feb-2018 19:56:15         at org.springframework.transaction.interceptor.TransactionInterceptor.invoke(TransactionInterceptor.java:110)
05-Feb-2018 19:56:15         at org.springframework.aop.framework.ReflectiveMethodInvocation.proceed(ReflectiveMethodInvocation.java:172)
05-Feb-2018 19:56:15         at org.springframework.aop.framework.JdkDynamicAopProxy.invoke(JdkDynamicAopProxy.java:202)
05-Feb-2018 19:56:15         at com.sun.proxy.$Proxy24.getPresentationLocales(Unknown Source)
05-Feb-2018 19:56:15         at sun.reflect.NativeMethodAccessorImpl.invoke0(Native Method)
05-Feb-2018 19:56:15         at sun.reflect.NativeMethodAccessorImpl.invoke(NativeMethodAccessorImpl.java:57)
05-Feb-2018 19:56:15         at sun.reflect.DelegatingMethodAccessorImpl.invoke(DelegatingMethodAccessorImpl.java:43)
05-Feb-2018 19:56:15         at java.lang.reflect.Method.invoke(Method.java:606)
05-Feb-2018 19:56:15         at org.springframework.aop.support.AopUtils.invokeJoinpointUsingReflection(AopUtils.java:309)
05-Feb-2018 19:56:15         at org.springframework.aop.framework.ReflectiveMethodInvocation.invokeJoinpoint(ReflectiveMethodInvocation.java:183)
05-Feb-2018 19:56:15         at org.springframework.aop.framework.ReflectiveMethodInvocation.proceed(ReflectiveMethodInvocation.java:150)
05-Feb-2018 19:56:15         at org.springframework.transaction.interceptor.TransactionInterceptor.invoke(TransactionInterceptor.java:110)
05-Feb-2018 19:56:15         at org.springframework.aop.framework.ReflectiveMethodInvocation.proceed(ReflectiveMethodInvocation.java:172)
05-Feb-2018 19:56:15         at org.openmrs.aop.LoggingAdvice.invoke(LoggingAdvice.java:118)
05-Feb-2018 19:56:15         at org.springframework.aop.framework.ReflectiveMethodInvocation.proceed(ReflectiveMethodInvocation.java:172)
05-Feb-2018 19:56:15         at org.springframework.aop.framework.adapter.MethodBeforeAdviceInterceptor.invoke(MethodBeforeAdviceInterceptor.java:50)
05-Feb-2018 19:56:15         at org.springframework.aop.framework.ReflectiveMethodInvocation.proceed(ReflectiveMethodInvocation.java:172)
05-Feb-2018 19:56:15         at org.springframework.aop.framework.adapter.MethodBeforeAdviceInterceptor.invoke(MethodBeforeAdviceInterceptor.java:50)
05-Feb-2018 19:56:15         at org.springframework.aop.framework.ReflectiveMethodInvocation.proceed(ReflectiveMethodInvocation.java:172)
05-Feb-2018 19:56:15         at org.springframework.aop.framework.JdkDynamicAopProxy.invoke(JdkDynamicAopProxy.java:202)
05-Feb-2018 19:56:15         at com.sun.proxy.$Proxy43.getPresentationLocales(Unknown Source)
05-Feb-2018 19:56:15         at sun.reflect.NativeMethodAccessorImpl.invoke0(Native Method)
05-Feb-2018 19:56:15         at sun.reflect.NativeMethodAccessorImpl.invoke(NativeMethodAccessorImpl.java:57)
05-Feb-2018 19:56:15         at sun.reflect.DelegatingMethodAccessorImpl.invoke(DelegatingMethodAccessorImpl.java:43)
05-Feb-2018 19:56:15         at java.lang.reflect.Method.invoke(Method.java:606)
05-Feb-2018 19:56:15         at org.springframework.aop.support.AopUtils.invokeJoinpointUsingReflection(AopUtils.java:309)
05-Feb-2018 19:56:15         at org.springframework.aop.framework.ReflectiveMethodInvocation.invokeJoinpoint(ReflectiveMethodInvocation.java:183)
05-Feb-2018 19:56:15         at org.springframework.aop.framework.ReflectiveMethodInvocation.proceed(ReflectiveMethodInvocation.java:150)
05-Feb-2018 19:56:15         at org.springframework.transaction.interceptor.TransactionInterceptor.invoke(TransactionInterceptor.java:110)
05-Feb-2018 19:56:15         at org.springframework.aop.framework.ReflectiveMethodInvocation.proceed(ReflectiveMethodInvocation.java:172)
05-Feb-2018 19:56:15         at org.springframework.aop.framework.JdkDynamicAopProxy.invoke(JdkDynamicAopProxy.java:202)
05-Feb-2018 19:56:15         at com.sun.proxy.$Proxy43.getPresentationLocales(Unknown Source)
05-Feb-2018 19:56:15         at org.openmrs.web.controller.OptionsFormController.referenceData(OptionsFormController.java:311)
05-Feb-2018 19:56:15         at org.springframework.web.servlet.mvc.SimpleFormController.referenceData(SimpleFormController.java:218)
05-Feb-2018 19:56:15         at org.springframework.web.servlet.mvc.AbstractFormController.showForm(AbstractFormController.java:578)
05-Feb-2018 19:56:15         at org.springframework.web.servlet.mvc.SimpleFormController.showForm(SimpleFormController.java:201)
05-Feb-2018 19:56:15         at org.springframework.web.servlet.mvc.SimpleFormController.showForm(SimpleFormController.java:178)
05-Feb-2018 19:56:15         at org.springframework.web.servlet.mvc.SimpleFormController.processFormSubmission(SimpleFormController.java:263)
05-Feb-2018 19:56:15         at org.openmrs.web.controller.OptionsFormController.processFormSubmission(OptionsFormController.java:96)
05-Feb-2018 19:56:15         at org.springframework.web.servlet.mvc.AbstractFormController.handleRequestInternal(AbstractFormController.java:268)
05-Feb-2018 19:56:15         at org.springframework.web.servlet.mvc.AbstractController.handleRequest(AbstractController.java:153)
05-Feb-2018 19:56:15         at org.openmrs.web.controller.OptionsFormControllerTest.shouldRejectEmptySecretAnswer(OptionsFormControllerTest.java:71)
05-Feb-2018 19:56:15         at sun.reflect.NativeMethodAccessorImpl.invoke0(Native Method)
05-Feb-2018 19:56:15         at sun.reflect.NativeMethodAccessorImpl.invoke(NativeMethodAccessorImpl.java:57)
05-Feb-2018 19:56:15         at sun.reflect.DelegatingMethodAccessorImpl.invoke(DelegatingMethodAccessorImpl.java:43)
05-Feb-2018 19:56:15         at java.lang.reflect.Method.invoke(Method.java:606)
05-Feb-2018 19:56:15         at org.junit.runners.model.FrameworkMethod$1.runReflectiveCall(FrameworkMethod.java:47)
05-Feb-2018 19:56:15         at org.junit.internal.runners.model.ReflectiveCallable.run(ReflectiveCallable.java:12)
05-Feb-2018 19:56:15         at org.junit.runners.model.FrameworkMethod.invokeExplosively(FrameworkMethod.java:44)
05-Feb-2018 19:56:15         at org.junit.internal.runners.statements.InvokeMethod.evaluate(InvokeMethod.java:17)
05-Feb-2018 19:56:15         at org.junit.internal.runners.statements.RunBefores.evaluate(RunBefores.java:26)
05-Feb-2018 19:56:15         at org.springframework.test.context.junit4.statements.RunBeforeTestMethodCallbacks.evaluate(RunBeforeTestMethodCallbacks.java:74)
05-Feb-2018 19:56:15         at org.junit.internal.runners.statements.RunAfters.evaluate(RunAfters.java:27)
05-Feb-2018 19:56:15         at org.springframework.test.context.junit4.statements.RunAfterTestMethodCallbacks.evaluate(RunAfterTestMethodCallbacks.java:82)
05-Feb-2018 19:56:15         at org.springframework.test.context.junit4.statements.SpringRepeat.evaluate(SpringRepeat.java:72)
05-Feb-2018 19:56:15         at org.springframework.test.context.junit4.SpringJUnit4ClassRunner.runChild(SpringJUnit4ClassRunner.java:240)
05-Feb-2018 19:56:15         at org.junit.runners.BlockJUnit4ClassRunner.runChild(BlockJUnit4ClassRunner.java:50)
05-Feb-2018 19:56:15         at org.junit.runners.ParentRunner$3.run(ParentRunner.java:238)
05-Feb-2018 19:56:15         at org.junit.runners.ParentRunner$1.schedule(ParentRunner.java:63)
05-Feb-2018 19:56:15         at org.junit.runners.ParentRunner.runChildren(ParentRunner.java:236)
05-Feb-2018 19:56:15         at org.junit.runners.ParentRunner.access$000(ParentRunner.java:53)
05-Feb-2018 19:56:15         at org.junit.runners.ParentRunner$2.evaluate(ParentRunner.java:229)
05-Feb-2018 19:56:15         at org.springframework.test.context.junit4.statements.RunBeforeTestClassCallbacks.evaluate(RunBeforeTestClassCallbacks.java:61)
05-Feb-2018 19:56:15         at org.junit.internal.runners.statements.RunAfters.evaluate(RunAfters.java:27)
05-Feb-2018 19:56:15         at org.springframework.test.context.junit4.statements.RunAfterTestClassCallbacks.evaluate(RunAfterTestClassCallbacks.java:70)
05-Feb-2018 19:56:15         at org.junit.runners.ParentRunner.run(ParentRunner.java:309)
05-Feb-2018 19:56:15         at org.springframework.test.context.junit4.SpringJUnit4ClassRunner.run(SpringJUnit4ClassRunner.java:180)
05-Feb-2018 19:56:15         at org.apache.maven.surefire.junit4.JUnit4TestSet.execute(JUnit4TestSet.java:59)
05-Feb-2018 19:56:15         at org.apache.maven.surefire.suite.AbstractDirectoryTestSuite.executeTestSet(AbstractDirectoryTestSuite.java:115)
05-Feb-2018 19:56:15         at org.apache.maven.surefire.suite.AbstractDirectoryTestSuite.execute(AbstractDirectoryTestSuite.java:102)
05-Feb-2018 19:56:15         at org.apache.maven.surefire.Surefire.run(Surefire.java:180)
05-Feb-2018 19:56:15         at sun.reflect.NativeMethodAccessorImpl.invoke0(Native Method)
05-Feb-2018 19:56:15         at sun.reflect.NativeMethodAccessorImpl.invoke(NativeMethodAccessorImpl.java:57)
05-Feb-2018 19:56:15         at sun.reflect.DelegatingMethodAccessorImpl.invoke(DelegatingMethodAccessorImpl.java:43)
05-Feb-2018 19:56:15         at java.lang.reflect.Method.invoke(Method.java:606)
05-Feb-2018 19:56:15         at org.apache.maven.surefire.booter.SurefireBooter.runSuitesInProcess(SurefireBooter.java:350)
05-Feb-2018 19:56:15         at org.apache.maven.surefire.booter.SurefireBooter.main(SurefireBooter.java:1021)
05-Feb-2018 19:56:15 Tests run: 3, Failures: 0, Errors: 0, Skipped: 0, Time elapsed: 0.282 sec
05-Feb-2018 19:56:15 Running org.openmrs.web.dwr.PersonListItemTest
05-Feb-2018 19:56:16 Tests run: 8, Failures: 0, Errors: 0, Skipped: 0, Time elapsed: 0.599 sec
05-Feb-2018 19:56:16 Running org.openmrs.web.controller.encounter.EncounterTypeFormControllerTest
05-Feb-2018 19:56:16 Tests run: 2, Failures: 0, Errors: 0, Skipped: 0, Time elapsed: 0.184 sec
05-Feb-2018 19:56:16 Running org.openmrs.web.taglib.PortletTagTest
05-Feb-2018 19:56:18 SLF4J: Class path contains multiple SLF4J bindings.
05-Feb-2018 19:56:18 SLF4J: Found binding in [jar:file:/home/bamboo-agent/.m2/repository/org/slf4j/slf4j-log4j12/1.6.0/slf4j-log4j12-1.6.0.jar!/org/slf4j/impl/StaticLoggerBinder.class]
05-Feb-2018 19:56:18 SLF4J: Found binding in [jar:file:/home/bamboo-agent/.m2/repository/org/slf4j/slf4j-log4j12/1.6.0/slf4j-log4j12-1.6.0.jar!/org/slf4j/impl/StaticLoggerBinder.class]
05-Feb-2018 19:56:18 SLF4J: See http://www.slf4j.org/codes.html#multiple_bindings for an explanation.
05-Feb-2018 19:56:18 Tests run: 7, Failures: 0, Errors: 0, Skipped: 0, Time elapsed: 1.927 sec
05-Feb-2018 19:56:18 Running org.openmrs.web.obs.ObsFormControllerTest
05-Feb-2018 19:56:18 Tests run: 2, Failures: 0, Errors: 0, Skipped: 0, Time elapsed: 0.188 sec
05-Feb-2018 19:56:18 Running org.openmrs.web.controller.concept.ConceptStopWordListControllerTest
05-Feb-2018 19:56:18 ERROR - ConceptStopWordListController.handleSubmission(66) |2018-02-05 19:56:18,759| Error on deleting concept stop word
05-Feb-2018 19:56:18 org.openmrs.api.ConceptStopWordException: ConceptStopWord.error.notfound
05-Feb-2018 19:56:18         at org.openmrs.api.impl.ConceptServiceImpl.deleteConceptStopWord(ConceptServiceImpl.java:1789)
05-Feb-2018 19:56:18         at sun.reflect.NativeMethodAccessorImpl.invoke0(Native Method)
05-Feb-2018 19:56:18         at sun.reflect.NativeMethodAccessorImpl.invoke(NativeMethodAccessorImpl.java:57)
05-Feb-2018 19:56:18         at sun.reflect.DelegatingMethodAccessorImpl.invoke(DelegatingMethodAccessorImpl.java:43)
05-Feb-2018 19:56:18         at java.lang.reflect.Method.invoke(Method.java:606)
05-Feb-2018 19:56:18         at org.springframework.aop.support.AopUtils.invokeJoinpointUsingReflection(AopUtils.java:309)
05-Feb-2018 19:56:18         at org.springframework.aop.framework.ReflectiveMethodInvocation.invokeJoinpoint(ReflectiveMethodInvocation.java:183)
05-Feb-2018 19:56:18         at org.springframework.aop.framework.ReflectiveMethodInvocation.proceed(ReflectiveMethodInvocation.java:150)
05-Feb-2018 19:56:18         at org.springframework.transaction.interceptor.TransactionInterceptor.invoke(TransactionInterceptor.java:110)
05-Feb-2018 19:56:18         at org.springframework.aop.framework.ReflectiveMethodInvocation.proceed(ReflectiveMethodInvocation.java:172)
05-Feb-2018 19:56:18         at org.springframework.aop.framework.JdkDynamicAopProxy.invoke(JdkDynamicAopProxy.java:202)
05-Feb-2018 19:56:18         at com.sun.proxy.$Proxy31.deleteConceptStopWord(Unknown Source)
05-Feb-2018 19:56:18         at sun.reflect.NativeMethodAccessorImpl.invoke0(Native Method)
05-Feb-2018 19:56:18         at sun.reflect.NativeMethodAccessorImpl.invoke(NativeMethodAccessorImpl.java:57)
05-Feb-2018 19:56:18         at sun.reflect.DelegatingMethodAccessorImpl.invoke(DelegatingMethodAccessorImpl.java:43)
05-Feb-2018 19:56:18         at java.lang.reflect.Method.invoke(Method.java:606)
05-Feb-2018 19:56:18         at org.springframework.aop.support.AopUtils.invokeJoinpointUsingReflection(AopUtils.java:309)
05-Feb-2018 19:56:18         at org.springframework.aop.framework.ReflectiveMethodInvocation.invokeJoinpoint(ReflectiveMethodInvocation.java:183)
05-Feb-2018 19:56:18         at org.springframework.aop.framework.ReflectiveMethodInvocation.proceed(ReflectiveMethodInvocation.java:150)
05-Feb-2018 19:56:18         at org.springframework.transaction.interceptor.TransactionInterceptor.invoke(TransactionInterceptor.java:110)
05-Feb-2018 19:56:18         at org.springframework.aop.framework.ReflectiveMethodInvocation.proceed(ReflectiveMethodInvocation.java:172)
05-Feb-2018 19:56:18         at org.openmrs.aop.LoggingAdvice.invoke(LoggingAdvice.java:118)
05-Feb-2018 19:56:18         at org.springframework.aop.framework.ReflectiveMethodInvocation.proceed(ReflectiveMethodInvocation.java:172)
05-Feb-2018 19:56:18         at org.springframework.aop.framework.adapter.MethodBeforeAdviceInterceptor.invoke(MethodBeforeAdviceInterceptor.java:50)
05-Feb-2018 19:56:18         at org.springframework.aop.framework.ReflectiveMethodInvocation.proceed(ReflectiveMethodInvocation.java:172)
05-Feb-2018 19:56:18         at org.springframework.aop.framework.adapter.MethodBeforeAdviceInterceptor.invoke(MethodBeforeAdviceInterceptor.java:50)
05-Feb-2018 19:56:18         at org.springframework.aop.framework.ReflectiveMethodInvocation.proceed(ReflectiveMethodInvocation.java:172)
05-Feb-2018 19:56:18         at org.springframework.aop.framework.JdkDynamicAopProxy.invoke(JdkDynamicAopProxy.java:202)
05-Feb-2018 19:56:18         at com.sun.proxy.$Proxy32.deleteConceptStopWord(Unknown Source)
05-Feb-2018 19:56:18         at sun.reflect.NativeMethodAccessorImpl.invoke0(Native Method)
05-Feb-2018 19:56:18         at sun.reflect.NativeMethodAccessorImpl.invoke(NativeMethodAccessorImpl.java:57)
05-Feb-2018 19:56:18         at sun.reflect.DelegatingMethodAccessorImpl.invoke(DelegatingMethodAccessorImpl.java:43)
05-Feb-2018 19:56:18         at java.lang.reflect.Method.invoke(Method.java:606)
05-Feb-2018 19:56:18         at org.springframework.aop.support.AopUtils.invokeJoinpointUsingReflection(AopUtils.java:309)
05-Feb-2018 19:56:18         at org.springframework.aop.framework.ReflectiveMethodInvocation.invokeJoinpoint(ReflectiveMethodInvocation.java:183)
05-Feb-2018 19:56:18         at org.springframework.aop.framework.ReflectiveMethodInvocation.proceed(ReflectiveMethodInvocation.java:150)
05-Feb-2018 19:56:18         at org.springframework.transaction.interceptor.TransactionInterceptor.invoke(TransactionInterceptor.java:110)
05-Feb-2018 19:56:18         at org.springframework.aop.framework.ReflectiveMethodInvocation.proceed(ReflectiveMethodInvocation.java:172)
05-Feb-2018 19:56:18         at org.springframework.aop.framework.JdkDynamicAopProxy.invoke(JdkDynamicAopProxy.java:202)
05-Feb-2018 19:56:18         at com.sun.proxy.$Proxy32.deleteConceptStopWord(Unknown Source)
05-Feb-2018 19:56:18         at org.openmrs.web.controller.concept.ConceptStopWordListController.handleSubmission(ConceptStopWordListController.java:62)
05-Feb-2018 19:56:18         at org.openmrs.web.controller.concept.ConceptStopWordListControllerTest.handleSubmission_shouldAddTheDeleteErrorMessageInSession(ConceptStopWordListControllerTest.java:120)
05-Feb-2018 19:56:18         at sun.reflect.NativeMethodAccessorImpl.invoke0(Native Method)
05-Feb-2018 19:56:18         at sun.reflect.NativeMethodAccessorImpl.invoke(NativeMethodAccessorImpl.java:57)
05-Feb-2018 19:56:18         at sun.reflect.DelegatingMethodAccessorImpl.invoke(DelegatingMethodAccessorImpl.java:43)
05-Feb-2018 19:56:18         at java.lang.reflect.Method.invoke(Method.java:606)
05-Feb-2018 19:56:18         at org.junit.runners.model.FrameworkMethod$1.runReflectiveCall(FrameworkMethod.java:47)
05-Feb-2018 19:56:18         at org.junit.internal.runners.model.ReflectiveCallable.run(ReflectiveCallable.java:12)
05-Feb-2018 19:56:18         at org.junit.runners.model.FrameworkMethod.invokeExplosively(FrameworkMethod.java:44)
05-Feb-2018 19:56:18         at org.junit.internal.runners.statements.InvokeMethod.evaluate(InvokeMethod.java:17)
05-Feb-2018 19:56:18         at org.junit.internal.runners.statements.RunBefores.evaluate(RunBefores.java:26)
05-Feb-2018 19:56:18         at org.springframework.test.context.junit4.statements.RunBeforeTestMethodCallbacks.evaluate(RunBeforeTestMethodCallbacks.java:74)
05-Feb-2018 19:56:18         at org.junit.internal.runners.statements.RunAfters.evaluate(RunAfters.java:27)
05-Feb-2018 19:56:18         at org.springframework.test.context.junit4.statements.RunAfterTestMethodCallbacks.evaluate(RunAfterTestMethodCallbacks.java:82)
05-Feb-2018 19:56:18         at org.springframework.test.context.junit4.statements.SpringRepeat.evaluate(SpringRepeat.java:72)
05-Feb-2018 19:56:18         at org.springframework.test.context.junit4.SpringJUnit4ClassRunner.runChild(SpringJUnit4ClassRunner.java:240)
05-Feb-2018 19:56:18         at org.junit.runners.BlockJUnit4ClassRunner.runChild(BlockJUnit4ClassRunner.java:50)
05-Feb-2018 19:56:18         at org.junit.runners.ParentRunner$3.run(ParentRunner.java:238)
05-Feb-2018 19:56:18         at org.junit.runners.ParentRunner$1.schedule(ParentRunner.java:63)
05-Feb-2018 19:56:18         at org.junit.runners.ParentRunner.runChildren(ParentRunner.java:236)
05-Feb-2018 19:56:18         at org.junit.runners.ParentRunner.access$000(ParentRunner.java:53)
05-Feb-2018 19:56:18         at org.junit.runners.ParentRunner$2.evaluate(ParentRunner.java:229)
05-Feb-2018 19:56:18         at org.springframework.test.context.junit4.statements.RunBeforeTestClassCallbacks.evaluate(RunBeforeTestClassCallbacks.java:61)
05-Feb-2018 19:56:18         at org.junit.internal.runners.statements.RunAfters.evaluate(RunAfters.java:27)
05-Feb-2018 19:56:18         at org.springframework.test.context.junit4.statements.RunAfterTestClassCallbacks.evaluate(RunAfterTestClassCallbacks.java:70)
05-Feb-2018 19:56:18         at org.junit.runners.ParentRunner.run(ParentRunner.java:309)
05-Feb-2018 19:56:18         at org.springframework.test.context.junit4.SpringJUnit4ClassRunner.run(SpringJUnit4ClassRunner.java:180)
05-Feb-2018 19:56:18         at org.apache.maven.surefire.junit4.JUnit4TestSet.execute(JUnit4TestSet.java:59)
05-Feb-2018 19:56:18         at org.apache.maven.surefire.suite.AbstractDirectoryTestSuite.executeTestSet(AbstractDirectoryTestSuite.java:115)
05-Feb-2018 19:56:18         at org.apache.maven.surefire.suite.AbstractDirectoryTestSuite.execute(AbstractDirectoryTestSuite.java:102)
05-Feb-2018 19:56:18         at org.apache.maven.surefire.Surefire.run(Surefire.java:180)
05-Feb-2018 19:56:18         at sun.reflect.NativeMethodAccessorImpl.invoke0(Native Method)
05-Feb-2018 19:56:18         at sun.reflect.NativeMethodAccessorImpl.invoke(NativeMethodAccessorImpl.java:57)
05-Feb-2018 19:56:18         at sun.reflect.DelegatingMethodAccessorImpl.invoke(DelegatingMethodAccessorImpl.java:43)
05-Feb-2018 19:56:18         at java.lang.reflect.Method.invoke(Method.java:606)
05-Feb-2018 19:56:18         at org.apache.maven.surefire.booter.SurefireBooter.runSuitesInProcess(SurefireBooter.java:350)
05-Feb-2018 19:56:18         at org.apache.maven.surefire.booter.SurefireBooter.main(SurefireBooter.java:1021)
05-Feb-2018 19:56:18 Caused by: org.openmrs.api.db.DAOException: Concept Stop Word not found or already deleted
05-Feb-2018 19:56:18         at org.openmrs.api.db.hibernate.HibernateConceptDAO.deleteConceptStopWord(HibernateConceptDAO.java:1360)
05-Feb-2018 19:56:18         at org.openmrs.api.impl.ConceptServiceImpl.deleteConceptStopWord(ConceptServiceImpl.java:1785)
05-Feb-2018 19:56:18         ... 76 more
05-Feb-2018 19:56:18 Tests run: 5, Failures: 0, Errors: 0, Skipped: 0, Time elapsed: 0.34 sec
05-Feb-2018 19:56:18 Running org.openmrs.web.encounter.EncounterDisplayControllerTest
05-Feb-2018 19:56:19 Tests run: 2, Failures: 0, Errors: 0, Skipped: 0, Time elapsed: 0.22 sec
05-Feb-2018 19:56:19 Running org.openmrs.web.controller.form.FieldFormControllerTest
05-Feb-2018 19:56:19 Tests run: 3, Failures: 0, Errors: 0, Skipped: 1, Time elapsed: 0.158 sec
05-Feb-2018 19:56:19 Running org.openmrs.web.controller.form.FieldTypeListControllerTest
05-Feb-2018 19:56:19 ERROR - JDBCExceptionReporter.logExceptions(234) |2018-02-05 19:56:19,419| Referential integrity constraint violation: "FK5CEA0FA808FB57F: PUBLIC.FIELD FOREIGN KEY(FIELD_TYPE) REFERENCES PUBLIC.FIELD_TYPE(FIELD_TYPE_ID)"; SQL statement:
05-Feb-2018 19:56:19 delete from field_type where field_type_id=? [23003-135]
05-Feb-2018 19:56:19 ERROR - JDBCExceptionReporter.logExceptions(234) |2018-02-05 19:56:19,419| Referential integrity constraint violation: "FK5CEA0FA808FB57F: PUBLIC.FIELD FOREIGN KEY(FIELD_TYPE) REFERENCES PUBLIC.FIELD_TYPE(FIELD_TYPE_ID)"; SQL statement:
05-Feb-2018 19:56:19 delete from field_type where field_type_id=? [23003-135]
05-Feb-2018 19:56:19 ERROR - FieldTypeListController.onSubmit(83) |2018-02-05 19:56:19,420| Unable to delete a field type because it is in use. fieldTypeId: 1
05-Feb-2018 19:56:19 org.springframework.dao.DataIntegrityViolationException: Could not execute JDBC batch update; SQL [delete from field_type where field_type_id=?]; constraint ["FK5CEA0FA808FB57F: PUBLIC.FIELD FOREIGN KEY(FIELD_TYPE) REFERENCES PUBLIC.FIELD_TYPE(FIELD_TYPE_ID)"; SQL statement:
05-Feb-2018 19:56:19 delete from field_type where field_type_id=? [23003-135]]; nested exception is org.hibernate.exception.ConstraintViolationException: Could not execute JDBC batch update
05-Feb-2018 19:56:19         at org.springframework.orm.hibernate3.SessionFactoryUtils.convertHibernateAccessException(SessionFactoryUtils.java:637)
05-Feb-2018 19:56:19         at org.springframework.orm.hibernate3.HibernateTransactionManager.convertHibernateAccessException(HibernateTransactionManager.java:793)
05-Feb-2018 19:56:19         at org.springframework.orm.hibernate3.HibernateTransactionManager.doCommit(HibernateTransactionManager.java:664)
05-Feb-2018 19:56:19         at org.springframework.transaction.support.AbstractPlatformTransactionManager.processCommit(AbstractPlatformTransactionManager.java:754)
05-Feb-2018 19:56:19         at org.springframework.transaction.support.AbstractPlatformTransactionManager.commit(AbstractPlatformTransactionManager.java:723)
05-Feb-2018 19:56:19         at org.springframework.transaction.interceptor.TransactionAspectSupport.commitTransactionAfterReturning(TransactionAspectSupport.java:393)
05-Feb-2018 19:56:19         at org.springframework.transaction.interceptor.TransactionInterceptor.invoke(TransactionInterceptor.java:120)
05-Feb-2018 19:56:19         at org.springframework.aop.framework.ReflectiveMethodInvocation.proceed(ReflectiveMethodInvocation.java:172)
05-Feb-2018 19:56:19         at org.springframework.aop.framework.JdkDynamicAopProxy.invoke(JdkDynamicAopProxy.java:202)
05-Feb-2018 19:56:19         at com.sun.proxy.$Proxy42.purgeFieldType(Unknown Source)
05-Feb-2018 19:56:19         at org.openmrs.web.controller.form.FieldTypeListController.onSubmit(FieldTypeListController.java:71)
05-Feb-2018 19:56:19         at org.springframework.web.servlet.mvc.SimpleFormController.processFormSubmission(SimpleFormController.java:272)
05-Feb-2018 19:56:19         at org.springframework.web.servlet.mvc.AbstractFormController.handleRequestInternal(AbstractFormController.java:268)
05-Feb-2018 19:56:19         at org.springframework.web.servlet.mvc.AbstractController.handleRequest(AbstractController.java:153)
05-Feb-2018 19:56:19         at org.springframework.web.servlet.mvc.SimpleControllerHandlerAdapter.handle(SimpleControllerHandlerAdapter.java:48)
05-Feb-2018 19:56:19         at org.openmrs.web.test.WebTestHelper.handle(WebTestHelper.java:126)
05-Feb-2018 19:56:19         at org.openmrs.web.controller.form.FieldTypeListControllerTest.onSubmit_shouldDisplayAUserFriendlyErrorMessage(FieldTypeListControllerTest.java:44)
05-Feb-2018 19:56:19         at sun.reflect.NativeMethodAccessorImpl.invoke0(Native Method)
05-Feb-2018 19:56:19         at sun.reflect.NativeMethodAccessorImpl.invoke(NativeMethodAccessorImpl.java:57)
05-Feb-2018 19:56:19         at sun.reflect.DelegatingMethodAccessorImpl.invoke(DelegatingMethodAccessorImpl.java:43)
05-Feb-2018 19:56:19         at java.lang.reflect.Method.invoke(Method.java:606)
05-Feb-2018 19:56:19         at org.junit.runners.model.FrameworkMethod$1.runReflectiveCall(FrameworkMethod.java:47)
05-Feb-2018 19:56:19         at org.junit.internal.runners.model.ReflectiveCallable.run(ReflectiveCallable.java:12)
05-Feb-2018 19:56:19         at org.junit.runners.model.FrameworkMethod.invokeExplosively(FrameworkMethod.java:44)
05-Feb-2018 19:56:19         at org.junit.internal.runners.statements.InvokeMethod.evaluate(InvokeMethod.java:17)
05-Feb-2018 19:56:19         at org.junit.internal.runners.statements.RunBefores.evaluate(RunBefores.java:26)
05-Feb-2018 19:56:19         at org.springframework.test.context.junit4.statements.RunBeforeTestMethodCallbacks.evaluate(RunBeforeTestMethodCallbacks.java:74)
05-Feb-2018 19:56:19         at org.junit.internal.runners.statements.RunAfters.evaluate(RunAfters.java:27)
05-Feb-2018 19:56:19         at org.springframework.test.context.junit4.statements.RunAfterTestMethodCallbacks.evaluate(RunAfterTestMethodCallbacks.java:82)
05-Feb-2018 19:56:19         at org.springframework.test.context.junit4.statements.SpringRepeat.evaluate(SpringRepeat.java:72)
05-Feb-2018 19:56:19         at org.springframework.test.context.junit4.SpringJUnit4ClassRunner.runChild(SpringJUnit4ClassRunner.java:240)
05-Feb-2018 19:56:19         at org.junit.runners.BlockJUnit4ClassRunner.runChild(BlockJUnit4ClassRunner.java:50)
05-Feb-2018 19:56:19         at org.junit.runners.ParentRunner$3.run(ParentRunner.java:238)
05-Feb-2018 19:56:19         at org.junit.runners.ParentRunner$1.schedule(ParentRunner.java:63)
05-Feb-2018 19:56:19         at org.junit.runners.ParentRunner.runChildren(ParentRunner.java:236)
05-Feb-2018 19:56:19         at org.junit.runners.ParentRunner.access$000(ParentRunner.java:53)
05-Feb-2018 19:56:19         at org.junit.runners.ParentRunner$2.evaluate(ParentRunner.java:229)
05-Feb-2018 19:56:19         at org.springframework.test.context.junit4.statements.RunBeforeTestClassCallbacks.evaluate(RunBeforeTestClassCallbacks.java:61)
05-Feb-2018 19:56:19         at org.junit.internal.runners.statements.RunAfters.evaluate(RunAfters.java:27)
05-Feb-2018 19:56:19         at org.springframework.test.context.junit4.statements.RunAfterTestClassCallbacks.evaluate(RunAfterTestClassCallbacks.java:70)
05-Feb-2018 19:56:19         at org.junit.runners.ParentRunner.run(ParentRunner.java:309)
05-Feb-2018 19:56:19         at org.springframework.test.context.junit4.SpringJUnit4ClassRunner.run(SpringJUnit4ClassRunner.java:180)
05-Feb-2018 19:56:19         at org.apache.maven.surefire.junit4.JUnit4TestSet.execute(JUnit4TestSet.java:59)
05-Feb-2018 19:56:19         at org.apache.maven.surefire.suite.AbstractDirectoryTestSuite.executeTestSet(AbstractDirectoryTestSuite.java:115)
05-Feb-2018 19:56:19         at org.apache.maven.surefire.suite.AbstractDirectoryTestSuite.execute(AbstractDirectoryTestSuite.java:102)
05-Feb-2018 19:56:19         at org.apache.maven.surefire.Surefire.run(Surefire.java:180)
05-Feb-2018 19:56:19         at sun.reflect.NativeMethodAccessorImpl.invoke0(Native Method)
05-Feb-2018 19:56:19         at sun.reflect.NativeMethodAccessorImpl.invoke(NativeMethodAccessorImpl.java:57)
05-Feb-2018 19:56:19         at sun.reflect.DelegatingMethodAccessorImpl.invoke(DelegatingMethodAccessorImpl.java:43)
05-Feb-2018 19:56:19         at java.lang.reflect.Method.invoke(Method.java:606)
05-Feb-2018 19:56:19         at org.apache.maven.surefire.booter.SurefireBooter.runSuitesInProcess(SurefireBooter.java:350)
05-Feb-2018 19:56:19         at org.apache.maven.surefire.booter.SurefireBooter.main(SurefireBooter.java:1021)
05-Feb-2018 19:56:19 Caused by: org.hibernate.exception.ConstraintViolationException: Could not execute JDBC batch update
05-Feb-2018 19:56:19         at org.hibernate.exception.SQLStateConverter.convert(SQLStateConverter.java:96)
05-Feb-2018 19:56:19         at org.hibernate.exception.JDBCExceptionHelper.convert(JDBCExceptionHelper.java:66)
05-Feb-2018 19:56:19         at org.hibernate.jdbc.AbstractBatcher.executeBatch(AbstractBatcher.java:275)
05-Feb-2018 19:56:19         at org.hibernate.engine.ActionQueue.executeActions(ActionQueue.java:268)
05-Feb-2018 19:56:19         at org.hibernate.engine.ActionQueue.executeActions(ActionQueue.java:189)
05-Feb-2018 19:56:19         at org.hibernate.event.def.AbstractFlushingEventListener.performExecutions(AbstractFlushingEventListener.java:321)
05-Feb-2018 19:56:19         at org.hibernate.event.def.DefaultFlushEventListener.onFlush(DefaultFlushEventListener.java:51)
05-Feb-2018 19:56:19         at org.hibernate.impl.SessionImpl.flush(SessionImpl.java:1216)
05-Feb-2018 19:56:19         at org.hibernate.impl.SessionImpl.managedFlush(SessionImpl.java:383)
05-Feb-2018 19:56:19         at org.hibernate.transaction.JDBCTransaction.commit(JDBCTransaction.java:133)
05-Feb-2018 19:56:19         at org.springframework.orm.hibernate3.HibernateTransactionManager.doCommit(HibernateTransactionManager.java:656)
05-Feb-2018 19:56:19         ... 49 more
05-Feb-2018 19:56:19 Caused by: org.h2.jdbc.JdbcBatchUpdateException: Referential integrity constraint violation: "FK5CEA0FA808FB57F: PUBLIC.FIELD FOREIGN KEY(FIELD_TYPE) REFERENCES PUBLIC.FIELD_TYPE(FIELD_TYPE_ID)"; SQL statement:
05-Feb-2018 19:56:19 delete from field_type where field_type_id=? [23003-135]
05-Feb-2018 19:56:19         at org.h2.jdbc.JdbcPreparedStatement.executeBatch(JdbcPreparedStatement.java:1098)
05-Feb-2018 19:56:19         at com.mchange.v2.c3p0.impl.NewProxyPreparedStatement.executeBatch(NewProxyPreparedStatement.java:1723)
05-Feb-2018 19:56:19         at org.hibernate.jdbc.BatchingBatcher.doExecuteBatch(BatchingBatcher.java:70)
05-Feb-2018 19:56:19         at org.hibernate.jdbc.AbstractBatcher.executeBatch(AbstractBatcher.java:268)
05-Feb-2018 19:56:19         ... 57 more
05-Feb-2018 19:56:19 Tests run: 1, Failures: 0, Errors: 0, Skipped: 0, Time elapsed: 0.095 sec
05-Feb-2018 19:56:19 Running org.openmrs.web.controller.maintenance.GlobalPropertyControllerTest
05-Feb-2018 19:56:19 Tests run: 2, Failures: 0, Errors: 0, Skipped: 0, Time elapsed: 0.156 sec
05-Feb-2018 19:56:19 Running org.openmrs.web.controller.PortletControllerTest
05-Feb-2018 19:56:19 Tests run: 2, Failures: 0, Errors: 0, Skipped: 0, Time elapsed: 0.206 sec
05-Feb-2018 19:56:19 Running org.openmrs.web.controller.program.ProgramFormControllerTest
05-Feb-2018 19:56:19 Tests run: 1, Failures: 0, Errors: 0, Skipped: 0, Time elapsed: 0.083 sec
05-Feb-2018 19:56:19 Running org.openmrs.web.taglib.FormatTagTest
05-Feb-2018 19:56:19 Tests run: 1, Failures: 0, Errors: 0, Skipped: 0, Time elapsed: 0.085 sec
05-Feb-2018 19:56:19 Running org.openmrs.web.controller.maintenance.SystemInformationControllerTest
05-Feb-2018 19:56:20 Tests run: 5, Failures: 0, Errors: 0, Skipped: 0, Time elapsed: 0.334 sec
05-Feb-2018 19:56:20 Running org.openmrs.web.controller.encounter.EncounterTypeListControllerTest
05-Feb-2018 19:56:20 Tests run: 1, Failures: 0, Errors: 0, Skipped: 0, Time elapsed: 0.115 sec
05-Feb-2018 19:56:20 Running org.openmrs.web.controller.GlobalPropertyPortletControllerTest
05-Feb-2018 19:56:20 Tests run: 4, Failures: 0, Errors: 0, Skipped: 0, Time elapsed: 0.311 sec
05-Feb-2018 19:56:20 Running org.openmrs.module.web.controller.ModuleListControllerTest
05-Feb-2018 19:56:20 Tests run: 1, Failures: 0, Errors: 0, Skipped: 0, Time elapsed: 0.002 sec
05-Feb-2018 19:56:20 Running org.openmrs.web.controller.ConceptFormControllerTest
05-Feb-2018 19:56:23 Tests run: 26, Failures: 0, Errors: 0, Skipped: 0, Time elapsed: 2.424 sec
05-Feb-2018 19:56:23 Running org.openmrs.web.dwr.ConceptListItemTest
05-Feb-2018 19:56:23 Tests run: 4, Failures: 0, Errors: 0, Skipped: 0, Time elapsed: 0.002 sec
05-Feb-2018 19:56:23 Running org.openmrs.module.web.extension.ExtensionUtilTest
05-Feb-2018 19:56:24 SLF4J: Class path contains multiple SLF4J bindings.
05-Feb-2018 19:56:24 SLF4J: Found binding in [jar:file:/home/bamboo-agent/.m2/repository/org/slf4j/slf4j-log4j12/1.6.0/slf4j-log4j12-1.6.0.jar!/org/slf4j/impl/StaticLoggerBinder.class]
05-Feb-2018 19:56:24 SLF4J: Found binding in [jar:file:/home/bamboo-agent/.m2/repository/org/slf4j/slf4j-log4j12/1.6.0/slf4j-log4j12-1.6.0.jar!/org/slf4j/impl/StaticLoggerBinder.class]
05-Feb-2018 19:56:24 SLF4J: See http://www.slf4j.org/codes.html#multiple_bindings for an explanation.
05-Feb-2018 19:56:24 Tests run: 2, Failures: 0, Errors: 0, Skipped: 0, Time elapsed: 1.703 sec
05-Feb-2018 19:56:24 Running org.openmrs.web.dwr.DWRProgramWorkflowServiceTest
05-Feb-2018 19:56:24 Tests run: 1, Failures: 0, Errors: 0, Skipped: 0, Time elapsed: 0.092 sec
05-Feb-2018 19:56:24 Running org.openmrs.web.dwr.DWRProviderServiceTest
05-Feb-2018 19:56:25 Tests run: 4, Failures: 0, Errors: 0, Skipped: 1, Time elapsed: 0.251 sec
05-Feb-2018 19:56:25 Running org.openmrs.web.dwr.DWRPersonServiceTest
05-Feb-2018 19:56:25 Tests run: 2, Failures: 0, Errors: 0, Skipped: 0, Time elapsed: 0.203 sec
05-Feb-2018 19:56:25 Running org.openmrs.web.controller.encounter.EncounterRoleFormControllerTest
05-Feb-2018 19:56:26 Tests run: 8, Failures: 0, Errors: 0, Skipped: 0, Time elapsed: 0.784 sec
05-Feb-2018 19:56:26 Running org.openmrs.web.controller.concept.ConceptProposalFormControllerTest
05-Feb-2018 19:56:26 Tests run: 1, Failures: 0, Errors: 0, Skipped: 0, Time elapsed: 0.159 sec
05-Feb-2018 19:56:26 Running org.openmrs.web.taglib.OpenmrsMessageTagTest
05-Feb-2018 19:56:26 Tests run: 8, Failures: 0, Errors: 0, Skipped: 0, Time elapsed: 0.615 sec
05-Feb-2018 19:56:26 Running org.openmrs.web.controller.provider.ProviderFormControllerTest
05-Feb-2018 19:56:27 Tests run: 2, Failures: 0, Errors: 0, Skipped: 0, Time elapsed: 0.185 sec
05-Feb-2018 19:56:27 Running org.openmrs.web.controller.user.UserListControllerTest
05-Feb-2018 19:56:27 Tests run: 4, Failures: 0, Errors: 0, Skipped: 0, Time elapsed: 0.331 sec
05-Feb-2018 19:56:27
05-Feb-2018 19:56:27 Results :
05-Feb-2018 19:56:27
05-Feb-2018 19:56:27 Tests run: 253, Failures: 0, Errors: 0, Skipped: 6
05-Feb-2018 19:56:27
05-Feb-2018 19:56:27 [INFO]
05-Feb-2018 19:56:27 [INFO] --- maven-jar-plugin:2.3.2:jar (default-jar) @ openmrs-web ---
05-Feb-2018 19:56:27 [INFO] Building jar: /home/bamboo-agent/bamboo-agent/xml-data/build-dir/TRUNK-LATEST-JOB1/web/target/openmrs-web-1.9.13-SNAPSHOT.jar
05-Feb-2018 19:56:27 [INFO]
05-Feb-2018 19:56:27 [INFO] --- maven-jar-plugin:2.3.2:test-jar (default) @ openmrs-web ---
05-Feb-2018 19:56:27 [INFO] Building jar: /home/bamboo-agent/bamboo-agent/xml-data/build-dir/TRUNK-LATEST-JOB1/web/target/openmrs-web-1.9.13-SNAPSHOT-tests.jar
05-Feb-2018 19:56:27 [INFO]
05-Feb-2018 19:56:27 [INFO] --- license-maven-plugin:2.6:check (default) @ openmrs-web ---
05-Feb-2018 19:56:27 [INFO] Checking licenses...
05-Feb-2018 19:56:28 [INFO]
05-Feb-2018 19:56:28 [INFO] --- maven-install-plugin:2.4:install (default-install) @ openmrs-web ---
05-Feb-2018 19:56:28 [INFO] Installing /home/bamboo-agent/bamboo-agent/xml-data/build-dir/TRUNK-LATEST-JOB1/web/target/openmrs-web-1.9.13-SNAPSHOT.jar to /home/bamboo-agent/.m2/repository/org/openmrs/web/openmrs-web/1.9.13-SNAPSHOT/openmrs-web-1.9.13-SNAPSHOT.jar
05-Feb-2018 19:56:28 [INFO] Installing /home/bamboo-agent/bamboo-agent/xml-data/build-dir/TRUNK-LATEST-JOB1/web/pom.xml to /home/bamboo-agent/.m2/repository/org/openmrs/web/openmrs-web/1.9.13-SNAPSHOT/openmrs-web-1.9.13-SNAPSHOT.pom
05-Feb-2018 19:56:28 [INFO] Installing /home/bamboo-agent/bamboo-agent/xml-data/build-dir/TRUNK-LATEST-JOB1/web/target/openmrs-web-1.9.13-SNAPSHOT-tests.jar to /home/bamboo-agent/.m2/repository/org/openmrs/web/openmrs-web/1.9.13-SNAPSHOT/openmrs-web-1.9.13-SNAPSHOT-tests.jar
05-Feb-2018 19:56:28 [INFO]
05-Feb-2018 19:56:28 [INFO] --- maven-deploy-plugin:2.7:deploy (default-deploy) @ openmrs-web ---
05-Feb-2018 19:56:28 [INFO] Downloading: http://mavenrepo.openmrs.org/nexus/content/repositories/snapshots/org/openmrs/web/openmrs-web/1.9.13-SNAPSHOT/maven-metadata.xml
05-Feb-2018 19:56:28 [INFO] Downloaded: http://mavenrepo.openmrs.org/nexus/content/repositories/snapshots/org/openmrs/web/openmrs-web/1.9.13-SNAPSHOT/maven-metadata.xml (992 B at 4.2 KB/sec)
05-Feb-2018 19:56:28 [INFO] Uploading: http://mavenrepo.openmrs.org/nexus/content/repositories/snapshots/org/openmrs/web/openmrs-web/1.9.13-SNAPSHOT/openmrs-web-1.9.13-20180205.195628-2.jar
05-Feb-2018 19:56:29 [INFO] Uploaded: http://mavenrepo.openmrs.org/nexus/content/repositories/snapshots/org/openmrs/web/openmrs-web/1.9.13-SNAPSHOT/openmrs-web-1.9.13-20180205.195628-2.jar (863 KB at 806.3 KB/sec)
05-Feb-2018 19:56:29 [INFO] Uploading: http://mavenrepo.openmrs.org/nexus/content/repositories/snapshots/org/openmrs/web/openmrs-web/1.9.13-SNAPSHOT/openmrs-web-1.9.13-20180205.195628-2.pom
05-Feb-2018 19:56:29 [INFO] Uploaded: http://mavenrepo.openmrs.org/nexus/content/repositories/snapshots/org/openmrs/web/openmrs-web/1.9.13-SNAPSHOT/openmrs-web-1.9.13-20180205.195628-2.pom (6 KB at 13.5 KB/sec)
05-Feb-2018 19:56:29 [INFO] Downloading: http://mavenrepo.openmrs.org/nexus/content/repositories/snapshots/org/openmrs/web/openmrs-web/maven-metadata.xml
05-Feb-2018 19:56:30 [INFO] Downloaded: http://mavenrepo.openmrs.org/nexus/content/repositories/snapshots/org/openmrs/web/openmrs-web/maven-metadata.xml (2 KB at 5.1 KB/sec)
05-Feb-2018 19:56:30 [INFO] Uploading: http://mavenrepo.openmrs.org/nexus/content/repositories/snapshots/org/openmrs/web/openmrs-web/1.9.13-SNAPSHOT/maven-metadata.xml
05-Feb-2018 19:56:30 [INFO] Uploaded: http://mavenrepo.openmrs.org/nexus/content/repositories/snapshots/org/openmrs/web/openmrs-web/1.9.13-SNAPSHOT/maven-metadata.xml (992 B at 2.8 KB/sec)
05-Feb-2018 19:56:30 [INFO] Uploading: http://mavenrepo.openmrs.org/nexus/content/repositories/snapshots/org/openmrs/web/openmrs-web/maven-metadata.xml
05-Feb-2018 19:56:30 [INFO] Uploaded: http://mavenrepo.openmrs.org/nexus/content/repositories/snapshots/org/openmrs/web/openmrs-web/maven-metadata.xml (2 KB at 3.0 KB/sec)
05-Feb-2018 19:56:30 [INFO] Uploading: http://mavenrepo.openmrs.org/nexus/content/repositories/snapshots/org/openmrs/web/openmrs-web/1.9.13-SNAPSHOT/openmrs-web-1.9.13-20180205.195628-2-tests.jar
05-Feb-2018 19:56:31 [INFO] Uploaded: http://mavenrepo.openmrs.org/nexus/content/repositories/snapshots/org/openmrs/web/openmrs-web/1.9.13-SNAPSHOT/openmrs-web-1.9.13-20180205.195628-2-tests.jar (157 KB at 335.8 KB/sec)
05-Feb-2018 19:56:31 [INFO] Uploading: http://mavenrepo.openmrs.org/nexus/content/repositories/snapshots/org/openmrs/web/openmrs-web/1.9.13-SNAPSHOT/maven-metadata.xml
05-Feb-2018 19:56:31 [INFO] Uploaded: http://mavenrepo.openmrs.org/nexus/content/repositories/snapshots/org/openmrs/web/openmrs-web/1.9.13-SNAPSHOT/maven-metadata.xml (992 B at 2.7 KB/sec)
05-Feb-2018 19:56:31 [INFO]                                                                         
05-Feb-2018 19:56:31 [INFO] ------------------------------------------------------------------------
05-Feb-2018 19:56:31 [INFO] Building openmrs-webapp 1.9.13-SNAPSHOT
05-Feb-2018 19:56:31 [INFO] ------------------------------------------------------------------------
05-Feb-2018 19:56:31 [INFO]
05-Feb-2018 19:56:31 [INFO] --- maven-clean-plugin:2.5:clean (default-clean) @ openmrs-webapp ---
05-Feb-2018 19:56:31 [INFO]
05-Feb-2018 19:56:31 [INFO] --- buildnumber-maven-plugin:1.1:create (default) @ openmrs-webapp ---
05-Feb-2018 19:56:31 [INFO]
05-Feb-2018 19:56:31 [INFO] --- build-helper-maven-plugin:1.5:parse-version (parse-version) @ openmrs-webapp ---
05-Feb-2018 19:56:31 [INFO]
05-Feb-2018 19:56:31 [INFO] --- maven-resources-plugin:2.4:resources (default-resources) @ openmrs-webapp ---
05-Feb-2018 19:56:31 [INFO] Using 'UTF-8' encoding to copy filtered resources.
05-Feb-2018 19:56:31 [INFO] Copying 7 resources
05-Feb-2018 19:56:31 [INFO] Copying 1 resource to ../jetty
05-Feb-2018 19:56:31 [INFO]
05-Feb-2018 19:56:31 [INFO] --- maven-antrun-plugin:1.4:run (default) @ openmrs-webapp ---
05-Feb-2018 19:56:32 project.artifactId
05-Feb-2018 19:56:32 [INFO] Executing tasks
05-Feb-2018 19:56:32     [unzip] Expanding: /home/bamboo-agent/bamboo-agent/xml-data/build-dir/TRUNK-LATEST-JOB1/webapp/src/main/resources/liquibase-demo-data.zip into /home/bamboo-agent/bamboo-agent/xml-data/build-dir/TRUNK-LATEST-JOB1/webapp/target/classes
05-Feb-2018 19:56:32 [INFO] Executed tasks
05-Feb-2018 19:56:32 [INFO]
05-Feb-2018 19:56:32 [INFO] --- maven-compiler-plugin:2.1:compile (default-compile) @ openmrs-webapp ---
05-Feb-2018 19:56:32 [INFO] No sources to compile
05-Feb-2018 19:56:32 [INFO]
05-Feb-2018 19:56:32 [INFO] --- maven-resources-plugin:2.4:testResources (default-testResources) @ openmrs-webapp ---
05-Feb-2018 19:56:32 [INFO] Using 'UTF-8' encoding to copy filtered resources.
05-Feb-2018 19:56:32 [INFO] Copying 1 resource
05-Feb-2018 19:56:32 [INFO]
05-Feb-2018 19:56:32 [INFO] --- maven-compiler-plugin:2.1:testCompile (default-testCompile) @ openmrs-webapp ---
05-Feb-2018 19:56:32 [INFO] No sources to compile
05-Feb-2018 19:56:32 [INFO]
05-Feb-2018 19:56:32 [INFO] --- maven-surefire-plugin:2.5:test (default-test) @ openmrs-webapp ---
05-Feb-2018 19:56:32 [INFO] Surefire report directory: /home/bamboo-agent/bamboo-agent/xml-data/build-dir/TRUNK-LATEST-JOB1/webapp/target/surefire-reports
05-Feb-2018 19:56:32
05-Feb-2018 19:56:32 -------------------------------------------------------
05-Feb-2018 19:56:32 T E S T S
05-Feb-2018 19:56:32 -------------------------------------------------------
05-Feb-2018 19:56:32 There are no tests to run.
05-Feb-2018 19:56:32
05-Feb-2018 19:56:32 Results :
05-Feb-2018 19:56:32
05-Feb-2018 19:56:32 Tests run: 0, Failures: 0, Errors: 0, Skipped: 0
05-Feb-2018 19:56:32
05-Feb-2018 19:56:32 [INFO]
05-Feb-2018 19:56:32 [INFO] --- maven-war-plugin:2.4:war (default-war) @ openmrs-webapp ---
05-Feb-2018 19:56:32 [INFO] Packaging webapp
05-Feb-2018 19:56:32 [INFO] Assembling webapp [openmrs-webapp] in [/home/bamboo-agent/bamboo-agent/xml-data/build-dir/TRUNK-LATEST-JOB1/webapp/target/openmrs]
05-Feb-2018 19:56:32 [INFO] Processing war project
05-Feb-2018 19:56:32 [INFO] Copying webapp webResources [/home/bamboo-agent/bamboo-agent/xml-data/build-dir/TRUNK-LATEST-JOB1/webapp/src/main/webapp] to [/home/bamboo-agent/bamboo-agent/xml-data/build-dir/TRUNK-LATEST-JOB1/webapp/target/openmrs]
05-Feb-2018 19:56:32 [INFO] Copying webapp resources [/home/bamboo-agent/bamboo-agent/xml-data/build-dir/TRUNK-LATEST-JOB1/webapp/src/main/webapp]
05-Feb-2018 19:56:34 [INFO] Webapp assembled in [1460 msecs]
05-Feb-2018 19:56:34 [INFO] Building war: /home/bamboo-agent/bamboo-agent/xml-data/build-dir/TRUNK-LATEST-JOB1/webapp/target/openmrs.war
05-Feb-2018 19:56:36 [INFO]
05-Feb-2018 19:56:36 [INFO] --- license-maven-plugin:2.6:check (default) @ openmrs-webapp ---
05-Feb-2018 19:56:36 [INFO] Checking licenses...
05-Feb-2018 19:56:36 [INFO]
05-Feb-2018 19:56:36 [INFO] --- maven-install-plugin:2.4:install (default-install) @ openmrs-webapp ---
05-Feb-2018 19:56:36 [INFO] Installing /home/bamboo-agent/bamboo-agent/xml-data/build-dir/TRUNK-LATEST-JOB1/webapp/target/openmrs.war to /home/bamboo-agent/.m2/repository/org/openmrs/web/openmrs-webapp/1.9.13-SNAPSHOT/openmrs-webapp-1.9.13-SNAPSHOT.war
05-Feb-2018 19:56:36 [INFO] Installing /home/bamboo-agent/bamboo-agent/xml-data/build-dir/TRUNK-LATEST-JOB1/webapp/pom.xml to /home/bamboo-agent/.m2/repository/org/openmrs/web/openmrs-webapp/1.9.13-SNAPSHOT/openmrs-webapp-1.9.13-SNAPSHOT.pom
05-Feb-2018 19:56:36 [INFO]
05-Feb-2018 19:56:36 [INFO] --- maven-deploy-plugin:2.7:deploy (default-deploy) @ openmrs-webapp ---
05-Feb-2018 19:56:36 [INFO] Downloading: http://mavenrepo.openmrs.org/nexus/content/repositories/snapshots/org/openmrs/web/openmrs-webapp/1.9.13-SNAPSHOT/maven-metadata.xml
05-Feb-2018 19:56:36 [INFO] Downloaded: http://mavenrepo.openmrs.org/nexus/content/repositories/snapshots/org/openmrs/web/openmrs-webapp/1.9.13-SNAPSHOT/maven-metadata.xml (782 B at 2.8 KB/sec)
05-Feb-2018 19:56:36 [INFO] Uploading: http://mavenrepo.openmrs.org/nexus/content/repositories/snapshots/org/openmrs/web/openmrs-webapp/1.9.13-SNAPSHOT/openmrs-webapp-1.9.13-20180205.195636-2.war
05-Feb-2018 19:56:41 [INFO] Uploaded: http://mavenrepo.openmrs.org/nexus/content/repositories/snapshots/org/openmrs/web/openmrs-webapp/1.9.13-SNAPSHOT/openmrs-webapp-1.9.13-20180205.195636-2.war (36389 KB at 8240.1 KB/sec)
05-Feb-2018 19:56:41 [INFO] Uploading: http://mavenrepo.openmrs.org/nexus/content/repositories/snapshots/org/openmrs/web/openmrs-webapp/1.9.13-SNAPSHOT/openmrs-webapp-1.9.13-20180205.195636-2.pom
05-Feb-2018 19:56:41 [INFO] Uploaded: http://mavenrepo.openmrs.org/nexus/content/repositories/snapshots/org/openmrs/web/openmrs-webapp/1.9.13-SNAPSHOT/openmrs-webapp-1.9.13-20180205.195636-2.pom (10 KB at 22.5 KB/sec)
05-Feb-2018 19:56:41 [INFO] Downloading: http://mavenrepo.openmrs.org/nexus/content/repositories/snapshots/org/openmrs/web/openmrs-webapp/maven-metadata.xml
05-Feb-2018 19:56:41 [INFO] Downloaded: http://mavenrepo.openmrs.org/nexus/content/repositories/snapshots/org/openmrs/web/openmrs-webapp/maven-metadata.xml (2 KB at 5.2 KB/sec)
05-Feb-2018 19:56:41 [INFO] Uploading: http://mavenrepo.openmrs.org/nexus/content/repositories/snapshots/org/openmrs/web/openmrs-webapp/1.9.13-SNAPSHOT/maven-metadata.xml
05-Feb-2018 19:56:42 [INFO] Uploaded: http://mavenrepo.openmrs.org/nexus/content/repositories/snapshots/org/openmrs/web/openmrs-webapp/1.9.13-SNAPSHOT/maven-metadata.xml (782 B at 2.2 KB/sec)
05-Feb-2018 19:56:42 [INFO] Uploading: http://mavenrepo.openmrs.org/nexus/content/repositories/snapshots/org/openmrs/web/openmrs-webapp/maven-metadata.xml
05-Feb-2018 19:56:42 [INFO] Uploaded: http://mavenrepo.openmrs.org/nexus/content/repositories/snapshots/org/openmrs/web/openmrs-webapp/maven-metadata.xml (2 KB at 3.1 KB/sec)
05-Feb-2018 19:56:42 [INFO] ------------------------------------------------------------------------
05-Feb-2018 19:56:42 [INFO] Reactor Summary:
05-Feb-2018 19:56:42 [INFO]
05-Feb-2018 19:56:42 [INFO] OpenMRS ............................................ SUCCESS [  4.551 s]
05-Feb-2018 19:56:42 [INFO] openmrs-tools ...................................... SUCCESS [  5.041 s]
05-Feb-2018 19:56:42 [INFO] openmrs-test ....................................... SUCCESS [  1.839 s]
05-Feb-2018 19:56:42 [INFO] openmrs-api ........................................ SUCCESS [03:28 min]
05-Feb-2018 19:56:42 [INFO] openmrs-web ........................................ SUCCESS [ 55.717 s]
05-Feb-2018 19:56:42 [INFO] openmrs-webapp ..................................... SUCCESS [ 10.869 s]
05-Feb-2018 19:56:42 [INFO] ------------------------------------------------------------------------
05-Feb-2018 19:56:42 [INFO] BUILD SUCCESS
05-Feb-2018 19:56:42 [INFO] ------------------------------------------------------------------------
05-Feb-2018 19:56:42 [INFO] Total time: 04:47 min
05-Feb-2018 19:56:42 [INFO] Finished at: 2018-02-05T19:56:42+00:00
05-Feb-2018 19:56:42 [INFO] Final Memory: 70M/412M
05-Feb-2018 19:56:42 [INFO] ------------------------------------------------------------------------
05-Feb-2018 19:56:42 Parsing test results under /home/bamboo-agent/bamboo-agent/xml-data/build-dir/TRUNK-LATEST-JOB1...
05-Feb-2018 19:56:43 Finished task 'Maven 3.x' with result: Success
05-Feb-2018 19:56:43 Running post build plugin 'Docker Container Cleanup'
05-Feb-2018 19:56:43 Running post build plugin 'NCover Results Collector'
05-Feb-2018 19:56:43 Running post build plugin 'Clover Results Collector'
05-Feb-2018 19:56:43 Running post build plugin 'Sauce OnDemand Post Runner'
05-Feb-2018 19:56:43 Running post build plugin 'npm Cache Cleanup'
05-Feb-2018 19:56:43 Running post build plugin 'Artifact Copier'
05-Feb-2018 19:56:43 Publishing an artifact: openmrs 1.9x war
05-Feb-2018 19:56:45 Finished publishing of artifact Shared artifact: [openmrs 1.9x war], pattern: [**/openmrs.war] anchored at: [webapp/target] in 2.508 s
05-Feb-2018 19:56:45 Publishing an artifact: openmrs 1.9x api jar
05-Feb-2018 19:56:46 Finished publishing of artifact Shared artifact: [openmrs 1.9x api jar], pattern: [**/openmrs-api*.jar] anchored at: [webapp/target/openmrs/WEB-INF/lib] in 911.1 ms
05-Feb-2018 19:56:46 Finalising the build...
05-Feb-2018 19:56:46 Stopping timer.
05-Feb-2018 19:56:46 Build TRUNK-LATEST-JOB1-267 completed.
05-Feb-2018 19:56:47 Running on server: post build plugin 'NCover Results Collector'
05-Feb-2018 19:56:47 Running on server: post build plugin 'Build Hanging Detection Configuration'
05-Feb-2018 19:56:47 Running on server: post build plugin 'Clover Delta Calculator'
05-Feb-2018 19:56:48 Running on server: post build plugin 'Maven Dependencies Postprocessor'
05-Feb-2018 19:56:48 All post build plugins have finished
05-Feb-2018 19:56:48 Generating build results summary...
05-Feb-2018 19:56:50 Saving build results to disk...
05-Feb-2018 19:56:50 Logging substituted variables...
05-Feb-2018 19:56:50 Indexing build results...
05-Feb-2018 19:56:50 Finished building TRUNK-LATEST-JOB1-267.