Build: #1203 failed

Job: Integration Test failed

Stages & jobs

  1. Build and Test

  2. Deploy

  3. Release

    Requires a user to start manually

Job result summary

Completed
Duration
3 minutes
Revision
819a3aff3cd12f71461aedc302bf6936fd72a681 819a3aff3cd12f71461aedc302bf6936fd72a681
Total tests
51
Fixed in
#1205 (Code changes detected)

Tests

  • 51 tests in total
  • 1 test failed
  • 1 failure is new
  • 3 tests were quarantined / skipped
  • 2 minutes taken in total.
New test failures 1
Status Test Duration
Collapse Failed Database1_9_7UpgradeIT shouldFailMigratingDrugOrdersIfUnitsToConceptsMappingsIsNotSet History
3 secs
java.lang.AssertionError: 
Expected: (an instance of java.io.IOException and exception with message a string containing "liquibase.exception.MigrationFailedException: Migration failed for change set liquibase-update-to-latest.xml::201401101647-TRUNK-4187::wyclif" and exception with message a string containing "upgrade.settings.file.not.have.mapping")
     but: exception with message a string containing "upgrade.settings.file.not.have.mapping" message was "liquibase.exception.MigrationFailedException: Migration failed for change set liquibase-update-to-latest.xml::201401101647-TRUNK-4187::wyclif:
     Reason: 
          liquibase-update-to-latest.xml : Your order entry upgrade settings file does not have mapping for mg. Please refer to upgrade instructions for more details.
:
          Caused By: Precondition Error"
Stacktrace was: java.io.IOException: liquibase.exception.MigrationFailedException: Migration failed for change set liquibase-update-to-latest.xml::201401101647-TRUNK-4187::wyclif:
(157 more lines...)