Build: #721 failed

Job: Integration Test failed

Stages & jobs

  1. Build and Test

Job result summary

Completed
Duration
2 minutes
Revision
a97a4783e1fd6aca7c2f459060d944d198ed15c5 a97a4783e1fd6aca7c2f459060d944d198ed15c5
Total tests
48
Failing since
#718 (Code changes detected – )
Fixed in
#723 (Code changes detected)

Tests

  • 48 tests in total
  • 2 tests failed
  • 1 minute taken in total.
Existing test failures 2
Status Test Failing since Duration
java.lang.AssertionError:  Expected: (an instance of java.io.IOException and exception with message a string containing "liquibase.exception.MigrationFailedException: Migration failed for change set liquibase-update-to-latest.xml::201401101647-TRUNK-4187::wyclif" and exception with message a string containing "For input string: \"invalid\"")      but: exception with message a string containing "For input string: \"invalid\"" message was "liquibase.exception.MigrationFailedException: Migration failed for change set liquibase-update-to-latest.xml::201401101647-TRUNK-4187::wyclif:      Reason:            liquibase-update-to-latest.xml : A user context must first be passed to setUserContext()...use Context.openSession() (and closeSession() to prevent memory leaks!) before using the API :           Caused By: Precondition Error" Stacktrace was: java.io.IOException: liquibase.exception.MigrationFailedException: Migration failed for change set liquibase-update-to-latest.xml::201401101647-TRUNK-4187::wyclif:      Reason:            liquibase-update-to-latest.xml : A user context must first be passed to setUserContext()...use Context.openSession() (and closeSession() to prevent memory leaks!) before using the API :           Caused By: Precondition Error  at org.openmrs.util.databasechange.DatabaseUpgradeTestUtil.upgrade(DatabaseUpgradeTestUtil.java:233)  at org.openmrs.util.databasechange.Database1_9_7UpgradeIT.shouldFailMigratingDrugOrdersIfUnitsToConceptsMappingsDoesNotPointToValidCodedDoseUnits(Database1_9_7UpgradeIT.java:184)  at sun.reflect.NativeMethodAccessorImpl.invoke0(Native Method)  at sun.reflect.NativeMethodAccessorImpl.invoke(NativeMethodAccessorImpl.java:57)  at sun.reflect.DelegatingMethodAccessorImpl.invoke(DelegatingMethodAccessorImpl.java:43)  at java.lang.reflect.Method.invoke(Method.java:606)  at org.junit.runners.model.FrameworkMethod$1.runReflectiveCall(FrameworkMethod.java:47)  at org.junit.internal.runners.model.ReflectiveCallable.run(ReflectiveCallable.java:12)  at org.junit.runners.model.FrameworkMethod.invokeExplosively(FrameworkMethod.java:44)  at org.junit.internal.runners.statements.InvokeMethod.evaluate(InvokeMethod.java:17)  at org.junit.internal.runners.statements.RunBefores.evaluate(RunBefores.java:26)  at org.junit.internal.runners.statements.RunAfters.evaluate(RunAfters.java:27)  at org.junit.rules.ExpectedException$ExpectedExceptionStatement.evaluate(ExpectedException.java:168)  at org.junit.rules.RunRules.evaluate(RunRules.java:20)  at org.junit.runners.ParentRunner.runLeaf(ParentRunner.java:271)  at org.junit.runners.BlockJUnit4ClassRunner.runChild(BlockJUnit4ClassRunner.java:70)  at org.junit.runners.BlockJUnit4ClassRunner.runChild(BlockJUnit4ClassRunner.java:50)  at org.junit.runners.ParentRunner$3.run(ParentRunner.java:238)  at org.junit.runners.ParentRunner$1.schedule(ParentRunner.java:63)  at org.junit.runners.ParentRunner.runChildren(ParentRunner.java:236)  at org.junit.runners.ParentRunner.access$000(ParentRunner.java:53)  at org.junit.runners.ParentRunner$2.evaluate(ParentRunner.java:229)  at org.junit.internal.runners.statements.RunBefores.evaluate(RunBefores.java:26)  at org.junit.internal.runners.statements.RunAfters.evaluate(RunAfters.java:27)  at org.junit.runners.ParentRunner.run(ParentRunner.java:309)  at org.apache.maven.surefire.junit4.JUnit4TestSet.execute(JUnit4TestSet.java:59)  at org.apache.maven.surefire.suite.AbstractDirectoryTestSuite.executeTestSet(AbstractDirectoryTestSuite.java:115)  at org.apache.maven.surefire.suite.AbstractDirectoryTestSuite.execute(AbstractDirectoryTestSuite.java:102)  at org.apache.maven.surefire.Surefire.run(Surefire.java:180)  at sun.reflect.NativeMethodAccessorImpl.invoke0(Native Method)  at sun.reflect.NativeMethodAccessorImpl.invoke(NativeMethodAccessorImpl.java:57)  at sun.reflect.DelegatingMethodAccessorImpl.invoke(DelegatingMethodAccessorImpl.java:43)  at java.lang.reflect.Method.invoke(Method.java:606)  at org.apache.maven.surefire.booter.SurefireBooter.runSuitesInProcess(SurefireBooter.java:350)  at org.apache.maven.surefire.booter.SurefireBooter.main(SurefireBooter.java:1021) Caused by: liquibase.exception.MigrationFailedException: Migration failed for change set liquibase-update-to-latest.xml::201401101647-TRUNK-4187::wyclif:      Reason:            liquibase-update-to-latest.xml : A user context must first be passed to setUserContext()...use Context.openSession() (and closeSession() to prevent memory leaks!) before using the API :           Caused By: Precondition Error  at liquibase.changelog.ChangeSet.execute(ChangeSet.java:285)  at liquibase.changelog.visitor.UpdateVisitor.visit(UpdateVisitor.java:27)  at liquibase.changelog.ChangeLogIterator.run(ChangeLogIterator.java:58)  at liquibase.Liquibase.update(Liquibase.java:114)  at org.openmrs.util.databasechange.DatabaseUpgradeTestUtil.upgrade(DatabaseUpgradeTestUtil.java:228)  ... 34 more Caused by: liquibase.exception.PreconditionErrorException: Precondition Error  at liquibase.precondition.CustomPreconditionWrapper.check(CustomPreconditionWrapper.java:79)  at liquibase.precondition.core.AndPrecondition.check(AndPrecondition.java:34)  at liquibase.precondition.core.PreconditionContainer.check(PreconditionContainer.java:199)  at liquibase.changelog.ChangeSet.execute(ChangeSet.java:249)  ... 38 more 
java.lang.AssertionError: 
Expected: (an instance of java.io.IOException and exception with message a string containing "liquibase.exception.MigrationFailedException: Migration failed for change set liquibase-update-to-latest.xml::201401101647-TRUNK-4187::wyclif" and exception with message a string containing "For input string: \"invalid\"")
     but: exception with message a string containing "For input string: \"invalid\"" message was "liquibase.exception.MigrationFailedException: Migration failed for change set liquibase-update-to-latest.xml::201401101647-TRUNK-4187::wyclif:
     Reason: 
          liquibase-update-to-latest.xml : A user context must first be passed to setUserContext()...use Context.openSession() (and closeSession() to prevent memory leaks!) before using the API
:
          Caused By: Precondition Error"
(86 more lines...)
java.lang.AssertionError:  Expected: (an instance of java.io.IOException and exception with message a string containing "liquibase.exception.MigrationFailedException: Migration failed for change set liquibase-update-to-latest.xml::201401101647-TRUNK-4187::wyclif" and exception with message a string containing "Your order entry upgrade settings file does not have mapping for mg")      but: exception with message a string containing "Your order entry upgrade settings file does not have mapping for mg" message was "liquibase.exception.MigrationFailedException: Migration failed for change set liquibase-update-to-latest.xml::201401101647-TRUNK-4187::wyclif:      Reason:            liquibase-update-to-latest.xml : A user context must first be passed to setUserContext()...use Context.openSession() (and closeSession() to prevent memory leaks!) before using the API :           Caused By: Precondition Error" Stacktrace was: java.io.IOException: liquibase.exception.MigrationFailedException: Migration failed for change set liquibase-update-to-latest.xml::201401101647-TRUNK-4187::wyclif:      Reason:            liquibase-update-to-latest.xml : A user context must first be passed to setUserContext()...use Context.openSession() (and closeSession() to prevent memory leaks!) before using the API :           Caused By: Precondition Error  at org.openmrs.util.databasechange.DatabaseUpgradeTestUtil.upgrade(DatabaseUpgradeTestUtil.java:233)  at org.openmrs.util.databasechange.Database1_9_7UpgradeIT.shouldFailMigratingDrugOrdersIfUnitsToConceptsMappingsIsNotSet(Database1_9_7UpgradeIT.java:169)  at sun.reflect.NativeMethodAccessorImpl.invoke0(Native Method)  at sun.reflect.NativeMethodAccessorImpl.invoke(NativeMethodAccessorImpl.java:57)  at sun.reflect.DelegatingMethodAccessorImpl.invoke(DelegatingMethodAccessorImpl.java:43)  at java.lang.reflect.Method.invoke(Method.java:606)  at org.junit.runners.model.FrameworkMethod$1.runReflectiveCall(FrameworkMethod.java:47)  at org.junit.internal.runners.model.ReflectiveCallable.run(ReflectiveCallable.java:12)  at org.junit.runners.model.FrameworkMethod.invokeExplosively(FrameworkMethod.java:44)  at org.junit.internal.runners.statements.InvokeMethod.evaluate(InvokeMethod.java:17)  at org.junit.internal.runners.statements.RunBefores.evaluate(RunBefores.java:26)  at org.junit.internal.runners.statements.RunAfters.evaluate(RunAfters.java:27)  at org.junit.rules.ExpectedException$ExpectedExceptionStatement.evaluate(ExpectedException.java:168)  at org.junit.rules.RunRules.evaluate(RunRules.java:20)  at org.junit.runners.ParentRunner.runLeaf(ParentRunner.java:271)  at org.junit.runners.BlockJUnit4ClassRunner.runChild(BlockJUnit4ClassRunner.java:70)  at org.junit.runners.BlockJUnit4ClassRunner.runChild(BlockJUnit4ClassRunner.java:50)  at org.junit.runners.ParentRunner$3.run(ParentRunner.java:238)  at org.junit.runners.ParentRunner$1.schedule(ParentRunner.java:63)  at org.junit.runners.ParentRunner.runChildren(ParentRunner.java:236)  at org.junit.runners.ParentRunner.access$000(ParentRunner.java:53)  at org.junit.runners.ParentRunner$2.evaluate(ParentRunner.java:229)  at org.junit.internal.runners.statements.RunBefores.evaluate(RunBefores.java:26)  at org.junit.internal.runners.statements.RunAfters.evaluate(RunAfters.java:27)  at org.junit.runners.ParentRunner.run(ParentRunner.java:309)  at org.apache.maven.surefire.junit4.JUnit4TestSet.execute(JUnit4TestSet.java:59)  at org.apache.maven.surefire.suite.AbstractDirectoryTestSuite.executeTestSet(AbstractDirectoryTestSuite.java:115)  at org.apache.maven.surefire.suite.AbstractDirectoryTestSuite.execute(AbstractDirectoryTestSuite.java:102)  at org.apache.maven.surefire.Surefire.run(Surefire.java:180)  at sun.reflect.NativeMethodAccessorImpl.invoke0(Native Method)  at sun.reflect.NativeMethodAccessorImpl.invoke(NativeMethodAccessorImpl.java:57)  at sun.reflect.DelegatingMethodAccessorImpl.invoke(DelegatingMethodAccessorImpl.java:43)  at java.lang.reflect.Method.invoke(Method.java:606)  at org.apache.maven.surefire.booter.SurefireBooter.runSuitesInProcess(SurefireBooter.java:350)  at org.apache.maven.surefire.booter.SurefireBooter.main(SurefireBooter.java:1021) Caused by: liquibase.exception.MigrationFailedException: Migration failed for change set liquibase-update-to-latest.xml::201401101647-TRUNK-4187::wyclif:      Reason:            liquibase-update-to-latest.xml : A user context must first be passed to setUserContext()...use Context.openSession() (and closeSession() to prevent memory leaks!) before using the API :           Caused By: Precondition Error  at liquibase.changelog.ChangeSet.execute(ChangeSet.java:285)  at liquibase.changelog.visitor.UpdateVisitor.visit(UpdateVisitor.java:27)  at liquibase.changelog.ChangeLogIterator.run(ChangeLogIterator.java:58)  at liquibase.Liquibase.update(Liquibase.java:114)  at org.openmrs.util.databasechange.DatabaseUpgradeTestUtil.upgrade(DatabaseUpgradeTestUtil.java:228)  ... 34 more Caused by: liquibase.exception.PreconditionErrorException: Precondition Error  at liquibase.precondition.CustomPreconditionWrapper.check(CustomPreconditionWrapper.java:79)  at liquibase.precondition.core.AndPrecondition.check(AndPrecondition.java:34)  at liquibase.precondition.core.PreconditionContainer.check(PreconditionContainer.java:199)  at liquibase.changelog.ChangeSet.execute(ChangeSet.java:249)  ... 38 more 
java.lang.AssertionError: 
Expected: (an instance of java.io.IOException and exception with message a string containing "liquibase.exception.MigrationFailedException: Migration failed for change set liquibase-update-to-latest.xml::201401101647-TRUNK-4187::wyclif" and exception with message a string containing "Your order entry upgrade settings file does not have mapping for mg")
     but: exception with message a string containing "Your order entry upgrade settings file does not have mapping for mg" message was "liquibase.exception.MigrationFailedException: Migration failed for change set liquibase-update-to-latest.xml::201401101647-TRUNK-4187::wyclif:
     Reason: 
          liquibase-update-to-latest.xml : A user context must first be passed to setUserContext()...use Context.openSession() (and closeSession() to prevent memory leaks!) before using the API
:
          Caused By: Precondition Error"
(86 more lines...)