Plan for OpenMRS Core 1.11.x

Build: #378 was successful

Job: Build and Test was successful

Stages & jobs

  1. Build and Test

  2. Deploy

  3. Release

    Requires a user to start manually

Build log

The build generated 5,817 lines of output.The output is too long and has been truncated to the last 1,000 lines. Download or view full build log

14-Jun-2018 16:16:37         at java.lang.reflect.Method.invoke(Method.java:606)
14-Jun-2018 16:16:37         at org.springframework.aop.support.AopUtils.invokeJoinpointUsingReflection(AopUtils.java:317)
14-Jun-2018 16:16:37         at org.springframework.aop.framework.ReflectiveMethodInvocation.invokeJoinpoint(ReflectiveMethodInvocation.java:183)
14-Jun-2018 16:16:37         at org.springframework.aop.framework.ReflectiveMethodInvocation.proceed(ReflectiveMethodInvocation.java:150)
14-Jun-2018 16:16:37         at org.openmrs.aop.LoggingAdvice.invoke(LoggingAdvice.java:121)
14-Jun-2018 16:16:37         at org.springframework.aop.framework.ReflectiveMethodInvocation.proceed(ReflectiveMethodInvocation.java:172)
14-Jun-2018 16:16:37         at org.springframework.aop.framework.adapter.MethodBeforeAdviceInterceptor.invoke(MethodBeforeAdviceInterceptor.java:51)
14-Jun-2018 16:16:37         at org.springframework.aop.framework.ReflectiveMethodInvocation.proceed(ReflectiveMethodInvocation.java:172)
14-Jun-2018 16:16:37         at org.springframework.aop.framework.adapter.MethodBeforeAdviceInterceptor.invoke(MethodBeforeAdviceInterceptor.java:51)
14-Jun-2018 16:16:37         at org.springframework.aop.framework.ReflectiveMethodInvocation.proceed(ReflectiveMethodInvocation.java:172)
14-Jun-2018 16:16:37         at org.springframework.aop.framework.JdkDynamicAopProxy.invoke(JdkDynamicAopProxy.java:204)
14-Jun-2018 16:16:37         at com.sun.proxy.$Proxy54.retirePatientIdentifierType(Unknown Source)
14-Jun-2018 16:16:37         at org.openmrs.web.controller.patient.PatientIdentifierTypeFormController.onSubmit(PatientIdentifierTypeFormController.java:95)
14-Jun-2018 16:16:37         at org.springframework.web.servlet.mvc.SimpleFormController.processFormSubmission(SimpleFormController.java:272)
14-Jun-2018 16:16:37         at org.springframework.web.servlet.mvc.AbstractFormController.handleRequestInternal(AbstractFormController.java:268)
14-Jun-2018 16:16:37         at org.springframework.web.servlet.mvc.AbstractController.handleRequest(AbstractController.java:153)
14-Jun-2018 16:16:37         at org.openmrs.web.controller.patient.PatientIdentifierTypeFormControllerTest.shouldNotRetirePatientIdentifierTypeWhenPatientIdentifierTypesAreLocked(PatientIdentifierTypeFormControllerTest.java:65)
14-Jun-2018 16:16:37         at sun.reflect.NativeMethodAccessorImpl.invoke0(Native Method)
14-Jun-2018 16:16:37         at sun.reflect.NativeMethodAccessorImpl.invoke(NativeMethodAccessorImpl.java:57)
14-Jun-2018 16:16:37         at sun.reflect.DelegatingMethodAccessorImpl.invoke(DelegatingMethodAccessorImpl.java:43)
14-Jun-2018 16:16:37         at java.lang.reflect.Method.invoke(Method.java:606)
14-Jun-2018 16:16:37         at org.junit.runners.model.FrameworkMethod$1.runReflectiveCall(FrameworkMethod.java:47)
14-Jun-2018 16:16:37         at org.junit.internal.runners.model.ReflectiveCallable.run(ReflectiveCallable.java:12)
14-Jun-2018 16:16:37         at org.junit.runners.model.FrameworkMethod.invokeExplosively(FrameworkMethod.java:44)
14-Jun-2018 16:16:37         at org.junit.internal.runners.statements.InvokeMethod.evaluate(InvokeMethod.java:17)
14-Jun-2018 16:16:37         at org.junit.internal.runners.statements.RunBefores.evaluate(RunBefores.java:26)
14-Jun-2018 16:16:37         at org.springframework.test.context.junit4.statements.RunBeforeTestMethodCallbacks.evaluate(RunBeforeTestMethodCallbacks.java:74)
14-Jun-2018 16:16:37         at org.junit.internal.runners.statements.RunAfters.evaluate(RunAfters.java:27)
14-Jun-2018 16:16:37         at org.springframework.test.context.junit4.statements.RunAfterTestMethodCallbacks.evaluate(RunAfterTestMethodCallbacks.java:83)
14-Jun-2018 16:16:37         at org.springframework.test.context.junit4.statements.SpringRepeat.evaluate(SpringRepeat.java:72)
14-Jun-2018 16:16:37         at org.springframework.test.context.junit4.SpringJUnit4ClassRunner.runChild(SpringJUnit4ClassRunner.java:231)
14-Jun-2018 16:16:37         at org.springframework.test.context.junit4.SpringJUnit4ClassRunner.runChild(SpringJUnit4ClassRunner.java:88)
14-Jun-2018 16:16:37         at org.junit.runners.ParentRunner$3.run(ParentRunner.java:238)
14-Jun-2018 16:16:37         at org.junit.runners.ParentRunner$1.schedule(ParentRunner.java:63)
14-Jun-2018 16:16:37         at org.junit.runners.ParentRunner.runChildren(ParentRunner.java:236)
14-Jun-2018 16:16:37         at org.junit.runners.ParentRunner.access$000(ParentRunner.java:53)
14-Jun-2018 16:16:37         at org.junit.runners.ParentRunner$2.evaluate(ParentRunner.java:229)
14-Jun-2018 16:16:37         at org.springframework.test.context.junit4.statements.RunBeforeTestClassCallbacks.evaluate(RunBeforeTestClassCallbacks.java:61)
14-Jun-2018 16:16:37         at org.junit.internal.runners.statements.RunAfters.evaluate(RunAfters.java:27)
14-Jun-2018 16:16:37         at org.springframework.test.context.junit4.statements.RunAfterTestClassCallbacks.evaluate(RunAfterTestClassCallbacks.java:71)
14-Jun-2018 16:16:37         at org.junit.runners.ParentRunner.run(ParentRunner.java:309)
14-Jun-2018 16:16:37         at org.springframework.test.context.junit4.SpringJUnit4ClassRunner.run(SpringJUnit4ClassRunner.java:174)
14-Jun-2018 16:16:37         at org.apache.maven.surefire.junit4.JUnit4TestSet.execute(JUnit4TestSet.java:59)
14-Jun-2018 16:16:37         at org.apache.maven.surefire.suite.AbstractDirectoryTestSuite.executeTestSet(AbstractDirectoryTestSuite.java:115)
14-Jun-2018 16:16:37         at org.apache.maven.surefire.suite.AbstractDirectoryTestSuite.execute(AbstractDirectoryTestSuite.java:102)
14-Jun-2018 16:16:37         at org.apache.maven.surefire.Surefire.run(Surefire.java:180)
14-Jun-2018 16:16:37         at sun.reflect.NativeMethodAccessorImpl.invoke0(Native Method)
14-Jun-2018 16:16:37         at sun.reflect.NativeMethodAccessorImpl.invoke(NativeMethodAccessorImpl.java:57)
14-Jun-2018 16:16:37         at sun.reflect.DelegatingMethodAccessorImpl.invoke(DelegatingMethodAccessorImpl.java:43)
14-Jun-2018 16:16:37         at java.lang.reflect.Method.invoke(Method.java:606)
14-Jun-2018 16:16:37         at org.apache.maven.surefire.booter.SurefireBooter.runSuitesInProcess(SurefireBooter.java:350)
14-Jun-2018 16:16:37         at org.apache.maven.surefire.booter.SurefireBooter.main(SurefireBooter.java:1021)
14-Jun-2018 16:16:37 ERROR - PatientServiceImpl.getDefaultIdentifierValidator(1471) |2018-06-14 16:16:37,899| Global Property patient.defaultPatientIdentifierValidator not set to an actual class.
14-Jun-2018 16:16:37 java.lang.ClassNotFoundException:
14-Jun-2018 16:16:37         at java.lang.Class.forName0(Native Method)
14-Jun-2018 16:16:37         at java.lang.Class.forName(Class.java:195)
14-Jun-2018 16:16:37         at org.openmrs.api.impl.PatientServiceImpl.getDefaultIdentifierValidator(PatientServiceImpl.java:1468)
14-Jun-2018 16:16:37         at sun.reflect.NativeMethodAccessorImpl.invoke0(Native Method)
14-Jun-2018 16:16:37         at sun.reflect.NativeMethodAccessorImpl.invoke(NativeMethodAccessorImpl.java:57)
14-Jun-2018 16:16:37         at sun.reflect.DelegatingMethodAccessorImpl.invoke(DelegatingMethodAccessorImpl.java:43)
14-Jun-2018 16:16:37         at java.lang.reflect.Method.invoke(Method.java:606)
14-Jun-2018 16:16:37         at org.springframework.aop.support.AopUtils.invokeJoinpointUsingReflection(AopUtils.java:317)
14-Jun-2018 16:16:37         at org.springframework.aop.framework.ReflectiveMethodInvocation.invokeJoinpoint(ReflectiveMethodInvocation.java:183)
14-Jun-2018 16:16:37         at org.springframework.aop.framework.ReflectiveMethodInvocation.proceed(ReflectiveMethodInvocation.java:150)
14-Jun-2018 16:16:37         at org.springframework.transaction.interceptor.TransactionInterceptor$1.proceedWithInvocation(TransactionInterceptor.java:96)
14-Jun-2018 16:16:37         at org.springframework.transaction.interceptor.TransactionAspectSupport.invokeWithinTransaction(TransactionAspectSupport.java:260)
14-Jun-2018 16:16:37         at org.springframework.transaction.interceptor.TransactionInterceptor.invoke(TransactionInterceptor.java:94)
14-Jun-2018 16:16:37         at org.springframework.aop.framework.ReflectiveMethodInvocation.proceed(ReflectiveMethodInvocation.java:172)
14-Jun-2018 16:16:37         at org.springframework.aop.framework.JdkDynamicAopProxy.invoke(JdkDynamicAopProxy.java:204)
14-Jun-2018 16:16:37         at com.sun.proxy.$Proxy53.getDefaultIdentifierValidator(Unknown Source)
14-Jun-2018 16:16:37         at sun.reflect.NativeMethodAccessorImpl.invoke0(Native Method)
14-Jun-2018 16:16:37         at sun.reflect.NativeMethodAccessorImpl.invoke(NativeMethodAccessorImpl.java:57)
14-Jun-2018 16:16:37         at sun.reflect.DelegatingMethodAccessorImpl.invoke(DelegatingMethodAccessorImpl.java:43)
14-Jun-2018 16:16:37         at java.lang.reflect.Method.invoke(Method.java:606)
14-Jun-2018 16:16:37         at org.springframework.aop.support.AopUtils.invokeJoinpointUsingReflection(AopUtils.java:317)
14-Jun-2018 16:16:37         at org.springframework.aop.framework.ReflectiveMethodInvocation.invokeJoinpoint(ReflectiveMethodInvocation.java:183)
14-Jun-2018 16:16:37         at org.springframework.aop.framework.ReflectiveMethodInvocation.proceed(ReflectiveMethodInvocation.java:150)
14-Jun-2018 16:16:37         at org.openmrs.aop.LoggingAdvice.invoke(LoggingAdvice.java:121)
14-Jun-2018 16:16:37         at org.springframework.aop.framework.ReflectiveMethodInvocation.proceed(ReflectiveMethodInvocation.java:172)
14-Jun-2018 16:16:37         at org.springframework.aop.framework.adapter.MethodBeforeAdviceInterceptor.invoke(MethodBeforeAdviceInterceptor.java:51)
14-Jun-2018 16:16:37         at org.springframework.aop.framework.ReflectiveMethodInvocation.proceed(ReflectiveMethodInvocation.java:172)
14-Jun-2018 16:16:37         at org.springframework.aop.framework.adapter.MethodBeforeAdviceInterceptor.invoke(MethodBeforeAdviceInterceptor.java:51)
14-Jun-2018 16:16:37         at org.springframework.aop.framework.ReflectiveMethodInvocation.proceed(ReflectiveMethodInvocation.java:172)
14-Jun-2018 16:16:37         at org.springframework.aop.framework.JdkDynamicAopProxy.invoke(JdkDynamicAopProxy.java:204)
14-Jun-2018 16:16:37         at com.sun.proxy.$Proxy54.getDefaultIdentifierValidator(Unknown Source)
14-Jun-2018 16:16:37         at org.openmrs.web.controller.patient.PatientIdentifierTypeFormController.referenceData(PatientIdentifierTypeFormController.java:170)
14-Jun-2018 16:16:37         at org.springframework.web.servlet.mvc.AbstractFormController.showForm(AbstractFormController.java:578)
14-Jun-2018 16:16:37         at org.springframework.web.servlet.mvc.SimpleFormController.showForm(SimpleFormController.java:201)
14-Jun-2018 16:16:37         at org.springframework.web.servlet.mvc.SimpleFormController.showForm(SimpleFormController.java:178)
14-Jun-2018 16:16:37         at org.openmrs.web.controller.patient.PatientIdentifierTypeFormController.onSubmit(PatientIdentifierTypeFormController.java:122)
14-Jun-2018 16:16:37         at org.springframework.web.servlet.mvc.SimpleFormController.processFormSubmission(SimpleFormController.java:272)
14-Jun-2018 16:16:37         at org.springframework.web.servlet.mvc.AbstractFormController.handleRequestInternal(AbstractFormController.java:268)
14-Jun-2018 16:16:37         at org.springframework.web.servlet.mvc.AbstractController.handleRequest(AbstractController.java:153)
14-Jun-2018 16:16:37         at org.openmrs.web.controller.patient.PatientIdentifierTypeFormControllerTest.shouldNotRetirePatientIdentifierTypeWhenPatientIdentifierTypesAreLocked(PatientIdentifierTypeFormControllerTest.java:65)
14-Jun-2018 16:16:37         at sun.reflect.NativeMethodAccessorImpl.invoke0(Native Method)
14-Jun-2018 16:16:37         at sun.reflect.NativeMethodAccessorImpl.invoke(NativeMethodAccessorImpl.java:57)
14-Jun-2018 16:16:37         at sun.reflect.DelegatingMethodAccessorImpl.invoke(DelegatingMethodAccessorImpl.java:43)
14-Jun-2018 16:16:37         at java.lang.reflect.Method.invoke(Method.java:606)
14-Jun-2018 16:16:37         at org.junit.runners.model.FrameworkMethod$1.runReflectiveCall(FrameworkMethod.java:47)
14-Jun-2018 16:16:37         at org.junit.internal.runners.model.ReflectiveCallable.run(ReflectiveCallable.java:12)
14-Jun-2018 16:16:37         at org.junit.runners.model.FrameworkMethod.invokeExplosively(FrameworkMethod.java:44)
14-Jun-2018 16:16:37         at org.junit.internal.runners.statements.InvokeMethod.evaluate(InvokeMethod.java:17)
14-Jun-2018 16:16:37         at org.junit.internal.runners.statements.RunBefores.evaluate(RunBefores.java:26)
14-Jun-2018 16:16:37         at org.springframework.test.context.junit4.statements.RunBeforeTestMethodCallbacks.evaluate(RunBeforeTestMethodCallbacks.java:74)
14-Jun-2018 16:16:37         at org.junit.internal.runners.statements.RunAfters.evaluate(RunAfters.java:27)
14-Jun-2018 16:16:37         at org.springframework.test.context.junit4.statements.RunAfterTestMethodCallbacks.evaluate(RunAfterTestMethodCallbacks.java:83)
14-Jun-2018 16:16:37         at org.springframework.test.context.junit4.statements.SpringRepeat.evaluate(SpringRepeat.java:72)
14-Jun-2018 16:16:37         at org.springframework.test.context.junit4.SpringJUnit4ClassRunner.runChild(SpringJUnit4ClassRunner.java:231)
14-Jun-2018 16:16:37         at org.springframework.test.context.junit4.SpringJUnit4ClassRunner.runChild(SpringJUnit4ClassRunner.java:88)
14-Jun-2018 16:16:37         at org.junit.runners.ParentRunner$3.run(ParentRunner.java:238)
14-Jun-2018 16:16:37         at org.junit.runners.ParentRunner$1.schedule(ParentRunner.java:63)
14-Jun-2018 16:16:37         at org.junit.runners.ParentRunner.runChildren(ParentRunner.java:236)
14-Jun-2018 16:16:37         at org.junit.runners.ParentRunner.access$000(ParentRunner.java:53)
14-Jun-2018 16:16:37         at org.junit.runners.ParentRunner$2.evaluate(ParentRunner.java:229)
14-Jun-2018 16:16:37         at org.springframework.test.context.junit4.statements.RunBeforeTestClassCallbacks.evaluate(RunBeforeTestClassCallbacks.java:61)
14-Jun-2018 16:16:37         at org.junit.internal.runners.statements.RunAfters.evaluate(RunAfters.java:27)
14-Jun-2018 16:16:37         at org.springframework.test.context.junit4.statements.RunAfterTestClassCallbacks.evaluate(RunAfterTestClassCallbacks.java:71)
14-Jun-2018 16:16:37         at org.junit.runners.ParentRunner.run(ParentRunner.java:309)
14-Jun-2018 16:16:37         at org.springframework.test.context.junit4.SpringJUnit4ClassRunner.run(SpringJUnit4ClassRunner.java:174)
14-Jun-2018 16:16:37         at org.apache.maven.surefire.junit4.JUnit4TestSet.execute(JUnit4TestSet.java:59)
14-Jun-2018 16:16:37         at org.apache.maven.surefire.suite.AbstractDirectoryTestSuite.executeTestSet(AbstractDirectoryTestSuite.java:115)
14-Jun-2018 16:16:37         at org.apache.maven.surefire.suite.AbstractDirectoryTestSuite.execute(AbstractDirectoryTestSuite.java:102)
14-Jun-2018 16:16:37         at org.apache.maven.surefire.Surefire.run(Surefire.java:180)
14-Jun-2018 16:16:37         at sun.reflect.NativeMethodAccessorImpl.invoke0(Native Method)
14-Jun-2018 16:16:37         at sun.reflect.NativeMethodAccessorImpl.invoke(NativeMethodAccessorImpl.java:57)
14-Jun-2018 16:16:37         at sun.reflect.DelegatingMethodAccessorImpl.invoke(DelegatingMethodAccessorImpl.java:43)
14-Jun-2018 16:16:37         at java.lang.reflect.Method.invoke(Method.java:606)
14-Jun-2018 16:16:37         at org.apache.maven.surefire.booter.SurefireBooter.runSuitesInProcess(SurefireBooter.java:350)
14-Jun-2018 16:16:37         at org.apache.maven.surefire.booter.SurefireBooter.main(SurefireBooter.java:1021)
14-Jun-2018 16:16:37 Tests run: 4, Failures: 0, Errors: 0, Skipped: 0, Time elapsed: 0.128 sec
14-Jun-2018 16:16:37 Running org.openmrs.scheduler.web.controller.SchedulerFormTest
14-Jun-2018 16:16:37 Tests run: 1, Failures: 0, Errors: 0, Skipped: 0, Time elapsed: 0.018 sec
14-Jun-2018 16:16:37 Running org.openmrs.web.dwr.ProviderListItemTest
14-Jun-2018 16:16:37 Tests run: 4, Failures: 0, Errors: 0, Skipped: 0, Time elapsed: 0.007 sec
14-Jun-2018 16:16:37 Running org.openmrs.web.controller.user.UserFormControllerTest
14-Jun-2018 16:16:38 Tests run: 2, Failures: 0, Errors: 0, Skipped: 0, Time elapsed: 0.075 sec
14-Jun-2018 16:16:38 Running org.openmrs.web.controller.person.PersonAttributeTypeFormControllerTest
14-Jun-2018 16:16:38 ERROR - PersonAttributeTypeFormController.onSubmit(120) |2018-06-14 16:16:38,024| PersonAttributeType.locked
14-Jun-2018 16:16:38 org.openmrs.api.PersonAttributeTypeLockedException: PersonAtttributeType.locked
14-Jun-2018 16:16:38         at org.openmrs.api.impl.PersonServiceImpl.checkIfPersonAttributeTypesAreLocked(PersonServiceImpl.java:1243)
14-Jun-2018 16:16:38         at org.openmrs.api.impl.PersonServiceImpl.unretirePersonAttributeType(PersonServiceImpl.java:302)
14-Jun-2018 16:16:38         at sun.reflect.NativeMethodAccessorImpl.invoke0(Native Method)
14-Jun-2018 16:16:38         at sun.reflect.NativeMethodAccessorImpl.invoke(NativeMethodAccessorImpl.java:57)
14-Jun-2018 16:16:38         at sun.reflect.DelegatingMethodAccessorImpl.invoke(DelegatingMethodAccessorImpl.java:43)
14-Jun-2018 16:16:38         at java.lang.reflect.Method.invoke(Method.java:606)
14-Jun-2018 16:16:38         at org.springframework.aop.support.AopUtils.invokeJoinpointUsingReflection(AopUtils.java:317)
14-Jun-2018 16:16:38         at org.springframework.aop.framework.ReflectiveMethodInvocation.invokeJoinpoint(ReflectiveMethodInvocation.java:183)
14-Jun-2018 16:16:38         at org.springframework.aop.framework.ReflectiveMethodInvocation.proceed(ReflectiveMethodInvocation.java:150)
14-Jun-2018 16:16:38         at org.springframework.transaction.interceptor.TransactionInterceptor$1.proceedWithInvocation(TransactionInterceptor.java:96)
14-Jun-2018 16:16:38         at org.springframework.transaction.interceptor.TransactionAspectSupport.invokeWithinTransaction(TransactionAspectSupport.java:260)
14-Jun-2018 16:16:38         at org.springframework.transaction.interceptor.TransactionInterceptor.invoke(TransactionInterceptor.java:94)
14-Jun-2018 16:16:38         at org.springframework.aop.framework.ReflectiveMethodInvocation.proceed(ReflectiveMethodInvocation.java:172)
14-Jun-2018 16:16:38         at org.springframework.aop.framework.JdkDynamicAopProxy.invoke(JdkDynamicAopProxy.java:204)
14-Jun-2018 16:16:38         at com.sun.proxy.$Proxy57.unretirePersonAttributeType(Unknown Source)
14-Jun-2018 16:16:38         at sun.reflect.NativeMethodAccessorImpl.invoke0(Native Method)
14-Jun-2018 16:16:38         at sun.reflect.NativeMethodAccessorImpl.invoke(NativeMethodAccessorImpl.java:57)
14-Jun-2018 16:16:38         at sun.reflect.DelegatingMethodAccessorImpl.invoke(DelegatingMethodAccessorImpl.java:43)
14-Jun-2018 16:16:38         at java.lang.reflect.Method.invoke(Method.java:606)
14-Jun-2018 16:16:38         at org.springframework.aop.support.AopUtils.invokeJoinpointUsingReflection(AopUtils.java:317)
14-Jun-2018 16:16:38         at org.springframework.aop.framework.ReflectiveMethodInvocation.invokeJoinpoint(ReflectiveMethodInvocation.java:183)
14-Jun-2018 16:16:38         at org.springframework.aop.framework.ReflectiveMethodInvocation.proceed(ReflectiveMethodInvocation.java:150)
14-Jun-2018 16:16:38         at org.openmrs.aop.LoggingAdvice.invoke(LoggingAdvice.java:121)
14-Jun-2018 16:16:38         at org.springframework.aop.framework.ReflectiveMethodInvocation.proceed(ReflectiveMethodInvocation.java:172)
14-Jun-2018 16:16:38         at org.springframework.aop.framework.adapter.MethodBeforeAdviceInterceptor.invoke(MethodBeforeAdviceInterceptor.java:51)
14-Jun-2018 16:16:38         at org.springframework.aop.framework.ReflectiveMethodInvocation.proceed(ReflectiveMethodInvocation.java:172)
14-Jun-2018 16:16:38         at org.springframework.aop.framework.adapter.MethodBeforeAdviceInterceptor.invoke(MethodBeforeAdviceInterceptor.java:51)
14-Jun-2018 16:16:38         at org.springframework.aop.framework.ReflectiveMethodInvocation.proceed(ReflectiveMethodInvocation.java:172)
14-Jun-2018 16:16:38         at org.springframework.aop.framework.JdkDynamicAopProxy.invoke(JdkDynamicAopProxy.java:204)
14-Jun-2018 16:16:38         at com.sun.proxy.$Proxy58.unretirePersonAttributeType(Unknown Source)
14-Jun-2018 16:16:38         at org.openmrs.web.controller.person.PersonAttributeTypeFormController.onSubmit(PersonAttributeTypeFormController.java:114)
14-Jun-2018 16:16:38         at org.springframework.web.servlet.mvc.SimpleFormController.processFormSubmission(SimpleFormController.java:272)
14-Jun-2018 16:16:38         at org.springframework.web.servlet.mvc.AbstractFormController.handleRequestInternal(AbstractFormController.java:268)
14-Jun-2018 16:16:38         at org.springframework.web.servlet.mvc.AbstractController.handleRequest(AbstractController.java:153)
14-Jun-2018 16:16:38         at org.openmrs.web.controller.person.PersonAttributeTypeFormControllerTest.shouldNotUnretirePersonAttributeTypeWhenPersonAttributeTypesAreLocked(PersonAttributeTypeFormControllerTest.java:84)
14-Jun-2018 16:16:38         at sun.reflect.NativeMethodAccessorImpl.invoke0(Native Method)
14-Jun-2018 16:16:38         at sun.reflect.NativeMethodAccessorImpl.invoke(NativeMethodAccessorImpl.java:57)
14-Jun-2018 16:16:38         at sun.reflect.DelegatingMethodAccessorImpl.invoke(DelegatingMethodAccessorImpl.java:43)
14-Jun-2018 16:16:38         at java.lang.reflect.Method.invoke(Method.java:606)
14-Jun-2018 16:16:38         at org.junit.runners.model.FrameworkMethod$1.runReflectiveCall(FrameworkMethod.java:47)
14-Jun-2018 16:16:38         at org.junit.internal.runners.model.ReflectiveCallable.run(ReflectiveCallable.java:12)
14-Jun-2018 16:16:38         at org.junit.runners.model.FrameworkMethod.invokeExplosively(FrameworkMethod.java:44)
14-Jun-2018 16:16:38         at org.junit.internal.runners.statements.InvokeMethod.evaluate(InvokeMethod.java:17)
14-Jun-2018 16:16:38         at org.junit.internal.runners.statements.RunBefores.evaluate(RunBefores.java:26)
14-Jun-2018 16:16:38         at org.springframework.test.context.junit4.statements.RunBeforeTestMethodCallbacks.evaluate(RunBeforeTestMethodCallbacks.java:74)
14-Jun-2018 16:16:38         at org.junit.internal.runners.statements.RunAfters.evaluate(RunAfters.java:27)
14-Jun-2018 16:16:38         at org.springframework.test.context.junit4.statements.RunAfterTestMethodCallbacks.evaluate(RunAfterTestMethodCallbacks.java:83)
14-Jun-2018 16:16:38         at org.springframework.test.context.junit4.statements.SpringRepeat.evaluate(SpringRepeat.java:72)
14-Jun-2018 16:16:38         at org.springframework.test.context.junit4.SpringJUnit4ClassRunner.runChild(SpringJUnit4ClassRunner.java:231)
14-Jun-2018 16:16:38         at org.springframework.test.context.junit4.SpringJUnit4ClassRunner.runChild(SpringJUnit4ClassRunner.java:88)
14-Jun-2018 16:16:38         at org.junit.runners.ParentRunner$3.run(ParentRunner.java:238)
14-Jun-2018 16:16:38         at org.junit.runners.ParentRunner$1.schedule(ParentRunner.java:63)
14-Jun-2018 16:16:38         at org.junit.runners.ParentRunner.runChildren(ParentRunner.java:236)
14-Jun-2018 16:16:38         at org.junit.runners.ParentRunner.access$000(ParentRunner.java:53)
14-Jun-2018 16:16:38         at org.junit.runners.ParentRunner$2.evaluate(ParentRunner.java:229)
14-Jun-2018 16:16:38         at org.springframework.test.context.junit4.statements.RunBeforeTestClassCallbacks.evaluate(RunBeforeTestClassCallbacks.java:61)
14-Jun-2018 16:16:38         at org.junit.internal.runners.statements.RunAfters.evaluate(RunAfters.java:27)
14-Jun-2018 16:16:38         at org.springframework.test.context.junit4.statements.RunAfterTestClassCallbacks.evaluate(RunAfterTestClassCallbacks.java:71)
14-Jun-2018 16:16:38         at org.junit.runners.ParentRunner.run(ParentRunner.java:309)
14-Jun-2018 16:16:38         at org.springframework.test.context.junit4.SpringJUnit4ClassRunner.run(SpringJUnit4ClassRunner.java:174)
14-Jun-2018 16:16:38         at org.apache.maven.surefire.junit4.JUnit4TestSet.execute(JUnit4TestSet.java:59)
14-Jun-2018 16:16:38         at org.apache.maven.surefire.suite.AbstractDirectoryTestSuite.executeTestSet(AbstractDirectoryTestSuite.java:115)
14-Jun-2018 16:16:38         at org.apache.maven.surefire.suite.AbstractDirectoryTestSuite.execute(AbstractDirectoryTestSuite.java:102)
14-Jun-2018 16:16:38         at org.apache.maven.surefire.Surefire.run(Surefire.java:180)
14-Jun-2018 16:16:38         at sun.reflect.NativeMethodAccessorImpl.invoke0(Native Method)
14-Jun-2018 16:16:38         at sun.reflect.NativeMethodAccessorImpl.invoke(NativeMethodAccessorImpl.java:57)
14-Jun-2018 16:16:38         at sun.reflect.DelegatingMethodAccessorImpl.invoke(DelegatingMethodAccessorImpl.java:43)
14-Jun-2018 16:16:38         at java.lang.reflect.Method.invoke(Method.java:606)
14-Jun-2018 16:16:38         at org.apache.maven.surefire.booter.SurefireBooter.runSuitesInProcess(SurefireBooter.java:350)
14-Jun-2018 16:16:38         at org.apache.maven.surefire.booter.SurefireBooter.main(SurefireBooter.java:1021)
14-Jun-2018 16:16:38 ERROR - PersonAttributeTypeFormController.onSubmit(120) |2018-06-14 16:16:38,041| PersonAttributeType.locked
14-Jun-2018 16:16:38 org.openmrs.api.PersonAttributeTypeLockedException: PersonAtttributeType.locked
14-Jun-2018 16:16:38         at org.openmrs.api.impl.PersonServiceImpl.checkIfPersonAttributeTypesAreLocked(PersonServiceImpl.java:1243)
14-Jun-2018 16:16:38         at org.openmrs.api.impl.PersonServiceImpl.purgePersonAttributeType(PersonServiceImpl.java:200)
14-Jun-2018 16:16:38         at sun.reflect.NativeMethodAccessorImpl.invoke0(Native Method)
14-Jun-2018 16:16:38         at sun.reflect.NativeMethodAccessorImpl.invoke(NativeMethodAccessorImpl.java:57)
14-Jun-2018 16:16:38         at sun.reflect.DelegatingMethodAccessorImpl.invoke(DelegatingMethodAccessorImpl.java:43)
14-Jun-2018 16:16:38         at java.lang.reflect.Method.invoke(Method.java:606)
14-Jun-2018 16:16:38         at org.springframework.aop.support.AopUtils.invokeJoinpointUsingReflection(AopUtils.java:317)
14-Jun-2018 16:16:38         at org.springframework.aop.framework.ReflectiveMethodInvocation.invokeJoinpoint(ReflectiveMethodInvocation.java:183)
14-Jun-2018 16:16:38         at org.springframework.aop.framework.ReflectiveMethodInvocation.proceed(ReflectiveMethodInvocation.java:150)
14-Jun-2018 16:16:38         at org.springframework.transaction.interceptor.TransactionInterceptor$1.proceedWithInvocation(TransactionInterceptor.java:96)
14-Jun-2018 16:16:38         at org.springframework.transaction.interceptor.TransactionAspectSupport.invokeWithinTransaction(TransactionAspectSupport.java:260)
14-Jun-2018 16:16:38         at org.springframework.transaction.interceptor.TransactionInterceptor.invoke(TransactionInterceptor.java:94)
14-Jun-2018 16:16:38         at org.springframework.aop.framework.ReflectiveMethodInvocation.proceed(ReflectiveMethodInvocation.java:172)
14-Jun-2018 16:16:38         at org.springframework.aop.framework.JdkDynamicAopProxy.invoke(JdkDynamicAopProxy.java:204)
14-Jun-2018 16:16:38         at com.sun.proxy.$Proxy57.purgePersonAttributeType(Unknown Source)
14-Jun-2018 16:16:38         at sun.reflect.NativeMethodAccessorImpl.invoke0(Native Method)
14-Jun-2018 16:16:38         at sun.reflect.NativeMethodAccessorImpl.invoke(NativeMethodAccessorImpl.java:57)
14-Jun-2018 16:16:38         at sun.reflect.DelegatingMethodAccessorImpl.invoke(DelegatingMethodAccessorImpl.java:43)
14-Jun-2018 16:16:38         at java.lang.reflect.Method.invoke(Method.java:606)
14-Jun-2018 16:16:38         at org.springframework.aop.support.AopUtils.invokeJoinpointUsingReflection(AopUtils.java:317)
14-Jun-2018 16:16:38         at org.springframework.aop.framework.ReflectiveMethodInvocation.invokeJoinpoint(ReflectiveMethodInvocation.java:183)
14-Jun-2018 16:16:38         at org.springframework.aop.framework.ReflectiveMethodInvocation.proceed(ReflectiveMethodInvocation.java:150)
14-Jun-2018 16:16:38         at org.openmrs.aop.LoggingAdvice.invoke(LoggingAdvice.java:121)
14-Jun-2018 16:16:38         at org.springframework.aop.framework.ReflectiveMethodInvocation.proceed(ReflectiveMethodInvocation.java:172)
14-Jun-2018 16:16:38         at org.springframework.aop.framework.adapter.MethodBeforeAdviceInterceptor.invoke(MethodBeforeAdviceInterceptor.java:51)
14-Jun-2018 16:16:38         at org.springframework.aop.framework.ReflectiveMethodInvocation.proceed(ReflectiveMethodInvocation.java:172)
14-Jun-2018 16:16:38         at org.springframework.aop.framework.adapter.MethodBeforeAdviceInterceptor.invoke(MethodBeforeAdviceInterceptor.java:51)
14-Jun-2018 16:16:38         at org.springframework.aop.framework.ReflectiveMethodInvocation.proceed(ReflectiveMethodInvocation.java:172)
14-Jun-2018 16:16:38         at org.springframework.aop.framework.JdkDynamicAopProxy.invoke(JdkDynamicAopProxy.java:204)
14-Jun-2018 16:16:38         at com.sun.proxy.$Proxy58.purgePersonAttributeType(Unknown Source)
14-Jun-2018 16:16:38         at org.openmrs.web.controller.person.PersonAttributeTypeFormController.onSubmit(PersonAttributeTypeFormController.java:105)
14-Jun-2018 16:16:38         at org.springframework.web.servlet.mvc.SimpleFormController.processFormSubmission(SimpleFormController.java:272)
14-Jun-2018 16:16:38         at org.springframework.web.servlet.mvc.AbstractFormController.handleRequestInternal(AbstractFormController.java:268)
14-Jun-2018 16:16:38         at org.springframework.web.servlet.mvc.AbstractController.handleRequest(AbstractController.java:153)
14-Jun-2018 16:16:38         at org.openmrs.web.controller.person.PersonAttributeTypeFormControllerTest.shouldNotDeletePersonAttributeTypeWhenPersonAttributeTypesAreLocked(PersonAttributeTypeFormControllerTest.java:63)
14-Jun-2018 16:16:38         at sun.reflect.NativeMethodAccessorImpl.invoke0(Native Method)
14-Jun-2018 16:16:38         at sun.reflect.NativeMethodAccessorImpl.invoke(NativeMethodAccessorImpl.java:57)
14-Jun-2018 16:16:38         at sun.reflect.DelegatingMethodAccessorImpl.invoke(DelegatingMethodAccessorImpl.java:43)
14-Jun-2018 16:16:38         at java.lang.reflect.Method.invoke(Method.java:606)
14-Jun-2018 16:16:38         at org.junit.runners.model.FrameworkMethod$1.runReflectiveCall(FrameworkMethod.java:47)
14-Jun-2018 16:16:38         at org.junit.internal.runners.model.ReflectiveCallable.run(ReflectiveCallable.java:12)
14-Jun-2018 16:16:38         at org.junit.runners.model.FrameworkMethod.invokeExplosively(FrameworkMethod.java:44)
14-Jun-2018 16:16:38         at org.junit.internal.runners.statements.InvokeMethod.evaluate(InvokeMethod.java:17)
14-Jun-2018 16:16:38         at org.junit.internal.runners.statements.RunBefores.evaluate(RunBefores.java:26)
14-Jun-2018 16:16:38         at org.springframework.test.context.junit4.statements.RunBeforeTestMethodCallbacks.evaluate(RunBeforeTestMethodCallbacks.java:74)
14-Jun-2018 16:16:38         at org.junit.internal.runners.statements.RunAfters.evaluate(RunAfters.java:27)
14-Jun-2018 16:16:38         at org.springframework.test.context.junit4.statements.RunAfterTestMethodCallbacks.evaluate(RunAfterTestMethodCallbacks.java:83)
14-Jun-2018 16:16:38         at org.springframework.test.context.junit4.statements.SpringRepeat.evaluate(SpringRepeat.java:72)
14-Jun-2018 16:16:38         at org.springframework.test.context.junit4.SpringJUnit4ClassRunner.runChild(SpringJUnit4ClassRunner.java:231)
14-Jun-2018 16:16:38         at org.springframework.test.context.junit4.SpringJUnit4ClassRunner.runChild(SpringJUnit4ClassRunner.java:88)
14-Jun-2018 16:16:38         at org.junit.runners.ParentRunner$3.run(ParentRunner.java:238)
14-Jun-2018 16:16:38         at org.junit.runners.ParentRunner$1.schedule(ParentRunner.java:63)
14-Jun-2018 16:16:38         at org.junit.runners.ParentRunner.runChildren(ParentRunner.java:236)
14-Jun-2018 16:16:38         at org.junit.runners.ParentRunner.access$000(ParentRunner.java:53)
14-Jun-2018 16:16:38         at org.junit.runners.ParentRunner$2.evaluate(ParentRunner.java:229)
14-Jun-2018 16:16:38         at org.springframework.test.context.junit4.statements.RunBeforeTestClassCallbacks.evaluate(RunBeforeTestClassCallbacks.java:61)
14-Jun-2018 16:16:38         at org.junit.internal.runners.statements.RunAfters.evaluate(RunAfters.java:27)
14-Jun-2018 16:16:38         at org.springframework.test.context.junit4.statements.RunAfterTestClassCallbacks.evaluate(RunAfterTestClassCallbacks.java:71)
14-Jun-2018 16:16:38         at org.junit.runners.ParentRunner.run(ParentRunner.java:309)
14-Jun-2018 16:16:38         at org.springframework.test.context.junit4.SpringJUnit4ClassRunner.run(SpringJUnit4ClassRunner.java:174)
14-Jun-2018 16:16:38         at org.apache.maven.surefire.junit4.JUnit4TestSet.execute(JUnit4TestSet.java:59)
14-Jun-2018 16:16:38         at org.apache.maven.surefire.suite.AbstractDirectoryTestSuite.executeTestSet(AbstractDirectoryTestSuite.java:115)
14-Jun-2018 16:16:38         at org.apache.maven.surefire.suite.AbstractDirectoryTestSuite.execute(AbstractDirectoryTestSuite.java:102)
14-Jun-2018 16:16:38         at org.apache.maven.surefire.Surefire.run(Surefire.java:180)
14-Jun-2018 16:16:38         at sun.reflect.NativeMethodAccessorImpl.invoke0(Native Method)
14-Jun-2018 16:16:38         at sun.reflect.NativeMethodAccessorImpl.invoke(NativeMethodAccessorImpl.java:57)
14-Jun-2018 16:16:38         at sun.reflect.DelegatingMethodAccessorImpl.invoke(DelegatingMethodAccessorImpl.java:43)
14-Jun-2018 16:16:38         at java.lang.reflect.Method.invoke(Method.java:606)
14-Jun-2018 16:16:38         at org.apache.maven.surefire.booter.SurefireBooter.runSuitesInProcess(SurefireBooter.java:350)
14-Jun-2018 16:16:38         at org.apache.maven.surefire.booter.SurefireBooter.main(SurefireBooter.java:1021)
14-Jun-2018 16:16:38 ERROR - PersonAttributeTypeFormController.onSubmit(120) |2018-06-14 16:16:38,058| PersonAttributeType.locked
14-Jun-2018 16:16:38 org.openmrs.api.PersonAttributeTypeLockedException: PersonAtttributeType.locked
14-Jun-2018 16:16:38         at org.openmrs.api.impl.PersonServiceImpl.checkIfPersonAttributeTypesAreLocked(PersonServiceImpl.java:1243)
14-Jun-2018 16:16:38         at org.openmrs.api.impl.PersonServiceImpl.savePersonAttributeType(PersonServiceImpl.java:208)
14-Jun-2018 16:16:38         at sun.reflect.NativeMethodAccessorImpl.invoke0(Native Method)
14-Jun-2018 16:16:38         at sun.reflect.NativeMethodAccessorImpl.invoke(NativeMethodAccessorImpl.java:57)
14-Jun-2018 16:16:38         at sun.reflect.DelegatingMethodAccessorImpl.invoke(DelegatingMethodAccessorImpl.java:43)
14-Jun-2018 16:16:38         at java.lang.reflect.Method.invoke(Method.java:606)
14-Jun-2018 16:16:38         at org.springframework.aop.support.AopUtils.invokeJoinpointUsingReflection(AopUtils.java:317)
14-Jun-2018 16:16:38         at org.springframework.aop.framework.ReflectiveMethodInvocation.invokeJoinpoint(ReflectiveMethodInvocation.java:183)
14-Jun-2018 16:16:38         at org.springframework.aop.framework.ReflectiveMethodInvocation.proceed(ReflectiveMethodInvocation.java:150)
14-Jun-2018 16:16:38         at org.springframework.transaction.interceptor.TransactionInterceptor$1.proceedWithInvocation(TransactionInterceptor.java:96)
14-Jun-2018 16:16:38         at org.springframework.transaction.interceptor.TransactionAspectSupport.invokeWithinTransaction(TransactionAspectSupport.java:260)
14-Jun-2018 16:16:38         at org.springframework.transaction.interceptor.TransactionInterceptor.invoke(TransactionInterceptor.java:94)
14-Jun-2018 16:16:38         at org.springframework.aop.framework.ReflectiveMethodInvocation.proceed(ReflectiveMethodInvocation.java:172)
14-Jun-2018 16:16:38         at org.springframework.aop.framework.JdkDynamicAopProxy.invoke(JdkDynamicAopProxy.java:204)
14-Jun-2018 16:16:38         at com.sun.proxy.$Proxy57.savePersonAttributeType(Unknown Source)
14-Jun-2018 16:16:38         at sun.reflect.NativeMethodAccessorImpl.invoke0(Native Method)
14-Jun-2018 16:16:38         at sun.reflect.NativeMethodAccessorImpl.invoke(NativeMethodAccessorImpl.java:57)
14-Jun-2018 16:16:38         at sun.reflect.DelegatingMethodAccessorImpl.invoke(DelegatingMethodAccessorImpl.java:43)
14-Jun-2018 16:16:38         at java.lang.reflect.Method.invoke(Method.java:606)
14-Jun-2018 16:16:38         at org.springframework.aop.support.AopUtils.invokeJoinpointUsingReflection(AopUtils.java:317)
14-Jun-2018 16:16:38         at org.springframework.aop.framework.ReflectiveMethodInvocation.invokeJoinpoint(ReflectiveMethodInvocation.java:183)
14-Jun-2018 16:16:38         at org.springframework.aop.framework.ReflectiveMethodInvocation.proceed(ReflectiveMethodInvocation.java:150)
14-Jun-2018 16:16:38         at org.openmrs.aop.LoggingAdvice.invoke(LoggingAdvice.java:121)
14-Jun-2018 16:16:38         at org.springframework.aop.framework.ReflectiveMethodInvocation.proceed(ReflectiveMethodInvocation.java:172)
14-Jun-2018 16:16:38         at org.springframework.aop.framework.adapter.MethodBeforeAdviceInterceptor.invoke(MethodBeforeAdviceInterceptor.java:51)
14-Jun-2018 16:16:38         at org.springframework.aop.framework.ReflectiveMethodInvocation.proceed(ReflectiveMethodInvocation.java:172)
14-Jun-2018 16:16:38         at org.springframework.aop.framework.adapter.MethodBeforeAdviceInterceptor.invoke(MethodBeforeAdviceInterceptor.java:51)
14-Jun-2018 16:16:38         at org.springframework.aop.framework.ReflectiveMethodInvocation.proceed(ReflectiveMethodInvocation.java:172)
14-Jun-2018 16:16:38         at org.springframework.aop.framework.JdkDynamicAopProxy.invoke(JdkDynamicAopProxy.java:204)
14-Jun-2018 16:16:38         at com.sun.proxy.$Proxy58.savePersonAttributeType(Unknown Source)
14-Jun-2018 16:16:38         at org.openmrs.web.controller.person.PersonAttributeTypeFormController.onSubmit(PersonAttributeTypeFormController.java:87)
14-Jun-2018 16:16:38         at org.springframework.web.servlet.mvc.SimpleFormController.processFormSubmission(SimpleFormController.java:272)
14-Jun-2018 16:16:38         at org.springframework.web.servlet.mvc.AbstractFormController.handleRequestInternal(AbstractFormController.java:268)
14-Jun-2018 16:16:38         at org.springframework.web.servlet.mvc.AbstractController.handleRequest(AbstractController.java:153)
14-Jun-2018 16:16:38         at org.openmrs.web.controller.person.PersonAttributeTypeFormControllerTest.shouldNotSavePersonAttributeTypeWhenPersonAttributeTypesAreLocked(PersonAttributeTypeFormControllerTest.java:53)
14-Jun-2018 16:16:38         at sun.reflect.NativeMethodAccessorImpl.invoke0(Native Method)
14-Jun-2018 16:16:38         at sun.reflect.NativeMethodAccessorImpl.invoke(NativeMethodAccessorImpl.java:57)
14-Jun-2018 16:16:38         at sun.reflect.DelegatingMethodAccessorImpl.invoke(DelegatingMethodAccessorImpl.java:43)
14-Jun-2018 16:16:38         at java.lang.reflect.Method.invoke(Method.java:606)
14-Jun-2018 16:16:38         at org.junit.runners.model.FrameworkMethod$1.runReflectiveCall(FrameworkMethod.java:47)
14-Jun-2018 16:16:38         at org.junit.internal.runners.model.ReflectiveCallable.run(ReflectiveCallable.java:12)
14-Jun-2018 16:16:38         at org.junit.runners.model.FrameworkMethod.invokeExplosively(FrameworkMethod.java:44)
14-Jun-2018 16:16:38         at org.junit.internal.runners.statements.InvokeMethod.evaluate(InvokeMethod.java:17)
14-Jun-2018 16:16:38         at org.junit.internal.runners.statements.RunBefores.evaluate(RunBefores.java:26)
14-Jun-2018 16:16:38         at org.springframework.test.context.junit4.statements.RunBeforeTestMethodCallbacks.evaluate(RunBeforeTestMethodCallbacks.java:74)
14-Jun-2018 16:16:38         at org.junit.internal.runners.statements.RunAfters.evaluate(RunAfters.java:27)
14-Jun-2018 16:16:38         at org.springframework.test.context.junit4.statements.RunAfterTestMethodCallbacks.evaluate(RunAfterTestMethodCallbacks.java:83)
14-Jun-2018 16:16:38         at org.springframework.test.context.junit4.statements.SpringRepeat.evaluate(SpringRepeat.java:72)
14-Jun-2018 16:16:38         at org.springframework.test.context.junit4.SpringJUnit4ClassRunner.runChild(SpringJUnit4ClassRunner.java:231)
14-Jun-2018 16:16:38         at org.springframework.test.context.junit4.SpringJUnit4ClassRunner.runChild(SpringJUnit4ClassRunner.java:88)
14-Jun-2018 16:16:38         at org.junit.runners.ParentRunner$3.run(ParentRunner.java:238)
14-Jun-2018 16:16:38         at org.junit.runners.ParentRunner$1.schedule(ParentRunner.java:63)
14-Jun-2018 16:16:38         at org.junit.runners.ParentRunner.runChildren(ParentRunner.java:236)
14-Jun-2018 16:16:38         at org.junit.runners.ParentRunner.access$000(ParentRunner.java:53)
14-Jun-2018 16:16:38         at org.junit.runners.ParentRunner$2.evaluate(ParentRunner.java:229)
14-Jun-2018 16:16:38         at org.springframework.test.context.junit4.statements.RunBeforeTestClassCallbacks.evaluate(RunBeforeTestClassCallbacks.java:61)
14-Jun-2018 16:16:38         at org.junit.internal.runners.statements.RunAfters.evaluate(RunAfters.java:27)
14-Jun-2018 16:16:38         at org.springframework.test.context.junit4.statements.RunAfterTestClassCallbacks.evaluate(RunAfterTestClassCallbacks.java:71)
14-Jun-2018 16:16:38         at org.junit.runners.ParentRunner.run(ParentRunner.java:309)
14-Jun-2018 16:16:38         at org.springframework.test.context.junit4.SpringJUnit4ClassRunner.run(SpringJUnit4ClassRunner.java:174)
14-Jun-2018 16:16:38         at org.apache.maven.surefire.junit4.JUnit4TestSet.execute(JUnit4TestSet.java:59)
14-Jun-2018 16:16:38         at org.apache.maven.surefire.suite.AbstractDirectoryTestSuite.executeTestSet(AbstractDirectoryTestSuite.java:115)
14-Jun-2018 16:16:38         at org.apache.maven.surefire.suite.AbstractDirectoryTestSuite.execute(AbstractDirectoryTestSuite.java:102)
14-Jun-2018 16:16:38         at org.apache.maven.surefire.Surefire.run(Surefire.java:180)
14-Jun-2018 16:16:38         at sun.reflect.NativeMethodAccessorImpl.invoke0(Native Method)
14-Jun-2018 16:16:38         at sun.reflect.NativeMethodAccessorImpl.invoke(NativeMethodAccessorImpl.java:57)
14-Jun-2018 16:16:38         at sun.reflect.DelegatingMethodAccessorImpl.invoke(DelegatingMethodAccessorImpl.java:43)
14-Jun-2018 16:16:38         at java.lang.reflect.Method.invoke(Method.java:606)
14-Jun-2018 16:16:38         at org.apache.maven.surefire.booter.SurefireBooter.runSuitesInProcess(SurefireBooter.java:350)
14-Jun-2018 16:16:38         at org.apache.maven.surefire.booter.SurefireBooter.main(SurefireBooter.java:1021)
14-Jun-2018 16:16:38 ERROR - PersonAttributeTypeFormController.onSubmit(120) |2018-06-14 16:16:38,073| PersonAttributeType.locked
14-Jun-2018 16:16:38 org.openmrs.api.PersonAttributeTypeLockedException: PersonAtttributeType.locked
14-Jun-2018 16:16:38         at org.openmrs.api.impl.PersonServiceImpl.checkIfPersonAttributeTypesAreLocked(PersonServiceImpl.java:1243)
14-Jun-2018 16:16:38         at org.openmrs.api.impl.PersonServiceImpl.retirePersonAttributeType(PersonServiceImpl.java:250)
14-Jun-2018 16:16:38         at sun.reflect.NativeMethodAccessorImpl.invoke0(Native Method)
14-Jun-2018 16:16:38         at sun.reflect.NativeMethodAccessorImpl.invoke(NativeMethodAccessorImpl.java:57)
14-Jun-2018 16:16:38         at sun.reflect.DelegatingMethodAccessorImpl.invoke(DelegatingMethodAccessorImpl.java:43)
14-Jun-2018 16:16:38         at java.lang.reflect.Method.invoke(Method.java:606)
14-Jun-2018 16:16:38         at org.springframework.aop.support.AopUtils.invokeJoinpointUsingReflection(AopUtils.java:317)
14-Jun-2018 16:16:38         at org.springframework.aop.framework.ReflectiveMethodInvocation.invokeJoinpoint(ReflectiveMethodInvocation.java:183)
14-Jun-2018 16:16:38         at org.springframework.aop.framework.ReflectiveMethodInvocation.proceed(ReflectiveMethodInvocation.java:150)
14-Jun-2018 16:16:38         at org.springframework.transaction.interceptor.TransactionInterceptor$1.proceedWithInvocation(TransactionInterceptor.java:96)
14-Jun-2018 16:16:38         at org.springframework.transaction.interceptor.TransactionAspectSupport.invokeWithinTransaction(TransactionAspectSupport.java:260)
14-Jun-2018 16:16:38         at org.springframework.transaction.interceptor.TransactionInterceptor.invoke(TransactionInterceptor.java:94)
14-Jun-2018 16:16:38         at org.springframework.aop.framework.ReflectiveMethodInvocation.proceed(ReflectiveMethodInvocation.java:172)
14-Jun-2018 16:16:38         at org.springframework.aop.framework.JdkDynamicAopProxy.invoke(JdkDynamicAopProxy.java:204)
14-Jun-2018 16:16:38         at com.sun.proxy.$Proxy57.retirePersonAttributeType(Unknown Source)
14-Jun-2018 16:16:38         at sun.reflect.NativeMethodAccessorImpl.invoke0(Native Method)
14-Jun-2018 16:16:38         at sun.reflect.NativeMethodAccessorImpl.invoke(NativeMethodAccessorImpl.java:57)
14-Jun-2018 16:16:38         at sun.reflect.DelegatingMethodAccessorImpl.invoke(DelegatingMethodAccessorImpl.java:43)
14-Jun-2018 16:16:38         at java.lang.reflect.Method.invoke(Method.java:606)
14-Jun-2018 16:16:38         at org.springframework.aop.support.AopUtils.invokeJoinpointUsingReflection(AopUtils.java:317)
14-Jun-2018 16:16:38         at org.springframework.aop.framework.ReflectiveMethodInvocation.invokeJoinpoint(ReflectiveMethodInvocation.java:183)
14-Jun-2018 16:16:38         at org.springframework.aop.framework.ReflectiveMethodInvocation.proceed(ReflectiveMethodInvocation.java:150)
14-Jun-2018 16:16:38         at org.openmrs.aop.LoggingAdvice.invoke(LoggingAdvice.java:121)
14-Jun-2018 16:16:38         at org.springframework.aop.framework.ReflectiveMethodInvocation.proceed(ReflectiveMethodInvocation.java:172)
14-Jun-2018 16:16:38         at org.springframework.aop.framework.adapter.MethodBeforeAdviceInterceptor.invoke(MethodBeforeAdviceInterceptor.java:51)
14-Jun-2018 16:16:38         at org.springframework.aop.framework.ReflectiveMethodInvocation.proceed(ReflectiveMethodInvocation.java:172)
14-Jun-2018 16:16:38         at org.springframework.aop.framework.adapter.MethodBeforeAdviceInterceptor.invoke(MethodBeforeAdviceInterceptor.java:51)
14-Jun-2018 16:16:38         at org.springframework.aop.framework.ReflectiveMethodInvocation.proceed(ReflectiveMethodInvocation.java:172)
14-Jun-2018 16:16:38         at org.springframework.aop.framework.JdkDynamicAopProxy.invoke(JdkDynamicAopProxy.java:204)
14-Jun-2018 16:16:38         at com.sun.proxy.$Proxy58.retirePersonAttributeType(Unknown Source)
14-Jun-2018 16:16:38         at org.openmrs.web.controller.person.PersonAttributeTypeFormController.onSubmit(PersonAttributeTypeFormController.java:98)
14-Jun-2018 16:16:38         at org.springframework.web.servlet.mvc.SimpleFormController.processFormSubmission(SimpleFormController.java:272)
14-Jun-2018 16:16:38         at org.springframework.web.servlet.mvc.AbstractFormController.handleRequestInternal(AbstractFormController.java:268)
14-Jun-2018 16:16:38         at org.springframework.web.servlet.mvc.AbstractController.handleRequest(AbstractController.java:153)
14-Jun-2018 16:16:38         at org.openmrs.web.controller.person.PersonAttributeTypeFormControllerTest.shouldNotRetirePersonAttributeTypeWhenPersonAttributeTypesAreLocked(PersonAttributeTypeFormControllerTest.java:74)
14-Jun-2018 16:16:38         at sun.reflect.NativeMethodAccessorImpl.invoke0(Native Method)
14-Jun-2018 16:16:38         at sun.reflect.NativeMethodAccessorImpl.invoke(NativeMethodAccessorImpl.java:57)
14-Jun-2018 16:16:38         at sun.reflect.DelegatingMethodAccessorImpl.invoke(DelegatingMethodAccessorImpl.java:43)
14-Jun-2018 16:16:38         at java.lang.reflect.Method.invoke(Method.java:606)
14-Jun-2018 16:16:38         at org.junit.runners.model.FrameworkMethod$1.runReflectiveCall(FrameworkMethod.java:47)
14-Jun-2018 16:16:38         at org.junit.internal.runners.model.ReflectiveCallable.run(ReflectiveCallable.java:12)
14-Jun-2018 16:16:38         at org.junit.runners.model.FrameworkMethod.invokeExplosively(FrameworkMethod.java:44)
14-Jun-2018 16:16:38         at org.junit.internal.runners.statements.InvokeMethod.evaluate(InvokeMethod.java:17)
14-Jun-2018 16:16:38         at org.junit.internal.runners.statements.RunBefores.evaluate(RunBefores.java:26)
14-Jun-2018 16:16:38         at org.springframework.test.context.junit4.statements.RunBeforeTestMethodCallbacks.evaluate(RunBeforeTestMethodCallbacks.java:74)
14-Jun-2018 16:16:38         at org.junit.internal.runners.statements.RunAfters.evaluate(RunAfters.java:27)
14-Jun-2018 16:16:38         at org.springframework.test.context.junit4.statements.RunAfterTestMethodCallbacks.evaluate(RunAfterTestMethodCallbacks.java:83)
14-Jun-2018 16:16:38         at org.springframework.test.context.junit4.statements.SpringRepeat.evaluate(SpringRepeat.java:72)
14-Jun-2018 16:16:38         at org.springframework.test.context.junit4.SpringJUnit4ClassRunner.runChild(SpringJUnit4ClassRunner.java:231)
14-Jun-2018 16:16:38         at org.springframework.test.context.junit4.SpringJUnit4ClassRunner.runChild(SpringJUnit4ClassRunner.java:88)
14-Jun-2018 16:16:38         at org.junit.runners.ParentRunner$3.run(ParentRunner.java:238)
14-Jun-2018 16:16:38         at org.junit.runners.ParentRunner$1.schedule(ParentRunner.java:63)
14-Jun-2018 16:16:38         at org.junit.runners.ParentRunner.runChildren(ParentRunner.java:236)
14-Jun-2018 16:16:38         at org.junit.runners.ParentRunner.access$000(ParentRunner.java:53)
14-Jun-2018 16:16:38         at org.junit.runners.ParentRunner$2.evaluate(ParentRunner.java:229)
14-Jun-2018 16:16:38         at org.springframework.test.context.junit4.statements.RunBeforeTestClassCallbacks.evaluate(RunBeforeTestClassCallbacks.java:61)
14-Jun-2018 16:16:38         at org.junit.internal.runners.statements.RunAfters.evaluate(RunAfters.java:27)
14-Jun-2018 16:16:38         at org.springframework.test.context.junit4.statements.RunAfterTestClassCallbacks.evaluate(RunAfterTestClassCallbacks.java:71)
14-Jun-2018 16:16:38         at org.junit.runners.ParentRunner.run(ParentRunner.java:309)
14-Jun-2018 16:16:38         at org.springframework.test.context.junit4.SpringJUnit4ClassRunner.run(SpringJUnit4ClassRunner.java:174)
14-Jun-2018 16:16:38         at org.apache.maven.surefire.junit4.JUnit4TestSet.execute(JUnit4TestSet.java:59)
14-Jun-2018 16:16:38         at org.apache.maven.surefire.suite.AbstractDirectoryTestSuite.executeTestSet(AbstractDirectoryTestSuite.java:115)
14-Jun-2018 16:16:38         at org.apache.maven.surefire.suite.AbstractDirectoryTestSuite.execute(AbstractDirectoryTestSuite.java:102)
14-Jun-2018 16:16:38         at org.apache.maven.surefire.Surefire.run(Surefire.java:180)
14-Jun-2018 16:16:38         at sun.reflect.NativeMethodAccessorImpl.invoke0(Native Method)
14-Jun-2018 16:16:38         at sun.reflect.NativeMethodAccessorImpl.invoke(NativeMethodAccessorImpl.java:57)
14-Jun-2018 16:16:38         at sun.reflect.DelegatingMethodAccessorImpl.invoke(DelegatingMethodAccessorImpl.java:43)
14-Jun-2018 16:16:38         at java.lang.reflect.Method.invoke(Method.java:606)
14-Jun-2018 16:16:38         at org.apache.maven.surefire.booter.SurefireBooter.runSuitesInProcess(SurefireBooter.java:350)
14-Jun-2018 16:16:38         at org.apache.maven.surefire.booter.SurefireBooter.main(SurefireBooter.java:1021)
14-Jun-2018 16:16:38 Tests run: 4, Failures: 0, Errors: 0, Skipped: 0, Time elapsed: 0.072 sec
14-Jun-2018 16:16:38 Running org.openmrs.web.controller.user.ChangePasswordFormControllerTest
14-Jun-2018 16:16:38 Tests run: 13, Failures: 0, Errors: 0, Skipped: 0, Time elapsed: 0.304 sec
14-Jun-2018 16:16:38 Running org.openmrs.web.controller.form.FormFormControllerTest
14-Jun-2018 16:16:38 ERROR - FormFormController.onSubmit(93) |2018-06-14 16:16:38,453| Error while saving form null
14-Jun-2018 16:16:38 org.openmrs.api.FormsLockedException: Form.forms.locked
14-Jun-2018 16:16:38         at org.openmrs.api.impl.FormServiceImpl.checkIfFormsAreLocked(FormServiceImpl.java:1021)
14-Jun-2018 16:16:38         at org.openmrs.api.impl.FormServiceImpl.saveForm(FormServiceImpl.java:753)
14-Jun-2018 16:16:38         at sun.reflect.NativeMethodAccessorImpl.invoke0(Native Method)
14-Jun-2018 16:16:38         at sun.reflect.NativeMethodAccessorImpl.invoke(NativeMethodAccessorImpl.java:57)
14-Jun-2018 16:16:38         at sun.reflect.DelegatingMethodAccessorImpl.invoke(DelegatingMethodAccessorImpl.java:43)
14-Jun-2018 16:16:38         at java.lang.reflect.Method.invoke(Method.java:606)
14-Jun-2018 16:16:38         at org.springframework.aop.support.AopUtils.invokeJoinpointUsingReflection(AopUtils.java:317)
14-Jun-2018 16:16:38         at org.springframework.aop.framework.ReflectiveMethodInvocation.invokeJoinpoint(ReflectiveMethodInvocation.java:183)
14-Jun-2018 16:16:38         at org.springframework.aop.framework.ReflectiveMethodInvocation.proceed(ReflectiveMethodInvocation.java:150)
14-Jun-2018 16:16:38         at org.springframework.transaction.interceptor.TransactionInterceptor$1.proceedWithInvocation(TransactionInterceptor.java:96)
14-Jun-2018 16:16:38         at org.springframework.transaction.interceptor.TransactionAspectSupport.invokeWithinTransaction(TransactionAspectSupport.java:260)
14-Jun-2018 16:16:38         at org.springframework.transaction.interceptor.TransactionInterceptor.invoke(TransactionInterceptor.java:94)
14-Jun-2018 16:16:38         at org.springframework.aop.framework.ReflectiveMethodInvocation.proceed(ReflectiveMethodInvocation.java:172)
14-Jun-2018 16:16:38         at org.springframework.aop.framework.JdkDynamicAopProxy.invoke(JdkDynamicAopProxy.java:204)
14-Jun-2018 16:16:38         at com.sun.proxy.$Proxy68.saveForm(Unknown Source)
14-Jun-2018 16:16:38         at sun.reflect.NativeMethodAccessorImpl.invoke0(Native Method)
14-Jun-2018 16:16:38         at sun.reflect.NativeMethodAccessorImpl.invoke(NativeMethodAccessorImpl.java:57)
14-Jun-2018 16:16:38         at sun.reflect.DelegatingMethodAccessorImpl.invoke(DelegatingMethodAccessorImpl.java:43)
14-Jun-2018 16:16:38         at java.lang.reflect.Method.invoke(Method.java:606)
14-Jun-2018 16:16:38         at org.springframework.aop.support.AopUtils.invokeJoinpointUsingReflection(AopUtils.java:317)
14-Jun-2018 16:16:38         at org.springframework.aop.framework.ReflectiveMethodInvocation.invokeJoinpoint(ReflectiveMethodInvocation.java:183)
14-Jun-2018 16:16:38         at org.springframework.aop.framework.ReflectiveMethodInvocation.proceed(ReflectiveMethodInvocation.java:150)
14-Jun-2018 16:16:38         at org.openmrs.aop.LoggingAdvice.invoke(LoggingAdvice.java:121)
14-Jun-2018 16:16:38         at org.springframework.aop.framework.ReflectiveMethodInvocation.proceed(ReflectiveMethodInvocation.java:172)
14-Jun-2018 16:16:38         at org.springframework.aop.framework.adapter.MethodBeforeAdviceInterceptor.invoke(MethodBeforeAdviceInterceptor.java:51)
14-Jun-2018 16:16:38         at org.springframework.aop.framework.ReflectiveMethodInvocation.proceed(ReflectiveMethodInvocation.java:172)
14-Jun-2018 16:16:38         at org.springframework.aop.framework.adapter.MethodBeforeAdviceInterceptor.invoke(MethodBeforeAdviceInterceptor.java:51)
14-Jun-2018 16:16:38         at org.springframework.aop.framework.ReflectiveMethodInvocation.proceed(ReflectiveMethodInvocation.java:172)
14-Jun-2018 16:16:38         at org.springframework.aop.framework.JdkDynamicAopProxy.invoke(JdkDynamicAopProxy.java:204)
14-Jun-2018 16:16:38         at com.sun.proxy.$Proxy69.saveForm(Unknown Source)
14-Jun-2018 16:16:38         at org.openmrs.web.controller.form.FormFormController.onSubmit(FormFormController.java:89)
14-Jun-2018 16:16:38         at org.springframework.web.servlet.mvc.SimpleFormController.processFormSubmission(SimpleFormController.java:272)
14-Jun-2018 16:16:38         at org.springframework.web.servlet.mvc.AbstractFormController.handleRequestInternal(AbstractFormController.java:268)
14-Jun-2018 16:16:38         at org.springframework.web.servlet.mvc.AbstractController.handleRequest(AbstractController.java:153)
14-Jun-2018 16:16:38         at org.openmrs.web.controller.form.FormFormControllerTest.shouldNotSaveAFormWhenFormsAreLocked(FormFormControllerTest.java:67)
14-Jun-2018 16:16:38         at sun.reflect.NativeMethodAccessorImpl.invoke0(Native Method)
14-Jun-2018 16:16:38         at sun.reflect.NativeMethodAccessorImpl.invoke(NativeMethodAccessorImpl.java:57)
14-Jun-2018 16:16:38         at sun.reflect.DelegatingMethodAccessorImpl.invoke(DelegatingMethodAccessorImpl.java:43)
14-Jun-2018 16:16:38         at java.lang.reflect.Method.invoke(Method.java:606)
14-Jun-2018 16:16:38         at org.junit.runners.model.FrameworkMethod$1.runReflectiveCall(FrameworkMethod.java:47)
14-Jun-2018 16:16:38         at org.junit.internal.runners.model.ReflectiveCallable.run(ReflectiveCallable.java:12)
14-Jun-2018 16:16:38         at org.junit.runners.model.FrameworkMethod.invokeExplosively(FrameworkMethod.java:44)
14-Jun-2018 16:16:38         at org.junit.internal.runners.statements.InvokeMethod.evaluate(InvokeMethod.java:17)
14-Jun-2018 16:16:38         at org.junit.internal.runners.statements.RunBefores.evaluate(RunBefores.java:26)
14-Jun-2018 16:16:38         at org.springframework.test.context.junit4.statements.RunBeforeTestMethodCallbacks.evaluate(RunBeforeTestMethodCallbacks.java:74)
14-Jun-2018 16:16:38         at org.junit.internal.runners.statements.RunAfters.evaluate(RunAfters.java:27)
14-Jun-2018 16:16:38         at org.springframework.test.context.junit4.statements.RunAfterTestMethodCallbacks.evaluate(RunAfterTestMethodCallbacks.java:83)
14-Jun-2018 16:16:38         at org.springframework.test.context.junit4.statements.SpringRepeat.evaluate(SpringRepeat.java:72)
14-Jun-2018 16:16:38         at org.springframework.test.context.junit4.SpringJUnit4ClassRunner.runChild(SpringJUnit4ClassRunner.java:231)
14-Jun-2018 16:16:38         at org.springframework.test.context.junit4.SpringJUnit4ClassRunner.runChild(SpringJUnit4ClassRunner.java:88)
14-Jun-2018 16:16:38         at org.junit.runners.ParentRunner$3.run(ParentRunner.java:238)
14-Jun-2018 16:16:38         at org.junit.runners.ParentRunner$1.schedule(ParentRunner.java:63)
14-Jun-2018 16:16:38         at org.junit.runners.ParentRunner.runChildren(ParentRunner.java:236)
14-Jun-2018 16:16:38         at org.junit.runners.ParentRunner.access$000(ParentRunner.java:53)
14-Jun-2018 16:16:38         at org.junit.runners.ParentRunner$2.evaluate(ParentRunner.java:229)
14-Jun-2018 16:16:38         at org.springframework.test.context.junit4.statements.RunBeforeTestClassCallbacks.evaluate(RunBeforeTestClassCallbacks.java:61)
14-Jun-2018 16:16:38         at org.junit.internal.runners.statements.RunAfters.evaluate(RunAfters.java:27)
14-Jun-2018 16:16:38         at org.springframework.test.context.junit4.statements.RunAfterTestClassCallbacks.evaluate(RunAfterTestClassCallbacks.java:71)
14-Jun-2018 16:16:38         at org.junit.runners.ParentRunner.run(ParentRunner.java:309)
14-Jun-2018 16:16:38         at org.springframework.test.context.junit4.SpringJUnit4ClassRunner.run(SpringJUnit4ClassRunner.java:174)
14-Jun-2018 16:16:38         at org.apache.maven.surefire.junit4.JUnit4TestSet.execute(JUnit4TestSet.java:59)
14-Jun-2018 16:16:38         at org.apache.maven.surefire.suite.AbstractDirectoryTestSuite.executeTestSet(AbstractDirectoryTestSuite.java:115)
14-Jun-2018 16:16:38         at org.apache.maven.surefire.suite.AbstractDirectoryTestSuite.execute(AbstractDirectoryTestSuite.java:102)
14-Jun-2018 16:16:38         at org.apache.maven.surefire.Surefire.run(Surefire.java:180)
14-Jun-2018 16:16:38         at sun.reflect.NativeMethodAccessorImpl.invoke0(Native Method)
14-Jun-2018 16:16:38         at sun.reflect.NativeMethodAccessorImpl.invoke(NativeMethodAccessorImpl.java:57)
14-Jun-2018 16:16:38         at sun.reflect.DelegatingMethodAccessorImpl.invoke(DelegatingMethodAccessorImpl.java:43)
14-Jun-2018 16:16:38         at java.lang.reflect.Method.invoke(Method.java:606)
14-Jun-2018 16:16:38         at org.apache.maven.surefire.booter.SurefireBooter.runSuitesInProcess(SurefireBooter.java:350)
14-Jun-2018 16:16:38         at org.apache.maven.surefire.booter.SurefireBooter.main(SurefireBooter.java:1021)
14-Jun-2018 16:16:38 Tests run: 1, Failures: 0, Errors: 0, Skipped: 0, Time elapsed: 0.075 sec
14-Jun-2018 16:16:38 Running org.openmrs.web.servlet.DownloadDictionaryServletTest
14-Jun-2018 16:16:38 Tests run: 5, Failures: 0, Errors: 0, Skipped: 0, Time elapsed: 0.265 sec
14-Jun-2018 16:16:38 Running org.openmrs.web.controller.patient.ShortPatientFormValidatorTest
14-Jun-2018 16:16:39 Tests run: 14, Failures: 0, Errors: 0, Skipped: 0, Time elapsed: 0.318 sec
14-Jun-2018 16:16:39 Running org.openmrs.web.filter.update.util.FilterUtilTest
14-Jun-2018 16:16:39 Tests run: 2, Failures: 0, Errors: 0, Skipped: 2, Time elapsed: 0.002 sec
14-Jun-2018 16:16:39 Running org.openmrs.web.dwr.DWRConceptServiceTest
14-Jun-2018 16:16:40 ERROR - DWRConceptService.findBatchOfConcepts(222) |2018-06-14 16:16:40,994| Error while finding concepts + null
14-Jun-2018 16:16:40 java.lang.NullPointerException
14-Jun-2018 16:16:40         at org.openmrs.api.db.hibernate.HibernateConceptDAO.transformToIds(HibernateConceptDAO.java:1418)
14-Jun-2018 16:16:40         at org.openmrs.api.db.hibernate.HibernateConceptDAO.newConceptNameLuceneQuery(HibernateConceptDAO.java:1384)
14-Jun-2018 16:16:40         at org.openmrs.api.db.hibernate.HibernateConceptDAO.getConcepts(HibernateConceptDAO.java:1340)
14-Jun-2018 16:16:40         at org.openmrs.api.impl.ConceptServiceImpl.getConcepts(ConceptServiceImpl.java:1654)
14-Jun-2018 16:16:40         at sun.reflect.NativeMethodAccessorImpl.invoke0(Native Method)
14-Jun-2018 16:16:40         at sun.reflect.NativeMethodAccessorImpl.invoke(NativeMethodAccessorImpl.java:57)
14-Jun-2018 16:16:40         at sun.reflect.DelegatingMethodAccessorImpl.invoke(DelegatingMethodAccessorImpl.java:43)
14-Jun-2018 16:16:40         at java.lang.reflect.Method.invoke(Method.java:606)
14-Jun-2018 16:16:40         at org.springframework.aop.support.AopUtils.invokeJoinpointUsingReflection(AopUtils.java:317)
14-Jun-2018 16:16:40         at org.springframework.aop.framework.ReflectiveMethodInvocation.invokeJoinpoint(ReflectiveMethodInvocation.java:183)
14-Jun-2018 16:16:40         at org.springframework.aop.framework.ReflectiveMethodInvocation.proceed(ReflectiveMethodInvocation.java:150)
14-Jun-2018 16:16:40         at org.springframework.transaction.interceptor.TransactionInterceptor$1.proceedWithInvocation(TransactionInterceptor.java:96)
14-Jun-2018 16:16:40         at org.springframework.transaction.interceptor.TransactionAspectSupport.invokeWithinTransaction(TransactionAspectSupport.java:260)
14-Jun-2018 16:16:40         at org.springframework.transaction.interceptor.TransactionInterceptor.invoke(TransactionInterceptor.java:94)
14-Jun-2018 16:16:40         at org.springframework.aop.framework.ReflectiveMethodInvocation.proceed(ReflectiveMethodInvocation.java:172)
14-Jun-2018 16:16:40         at org.springframework.aop.framework.JdkDynamicAopProxy.invoke(JdkDynamicAopProxy.java:204)
14-Jun-2018 16:16:40         at com.sun.proxy.$Proxy59.getConcepts(Unknown Source)
14-Jun-2018 16:16:40         at sun.reflect.NativeMethodAccessorImpl.invoke0(Native Method)
14-Jun-2018 16:16:40         at sun.reflect.NativeMethodAccessorImpl.invoke(NativeMethodAccessorImpl.java:57)
14-Jun-2018 16:16:40         at sun.reflect.DelegatingMethodAccessorImpl.invoke(DelegatingMethodAccessorImpl.java:43)
14-Jun-2018 16:16:40         at java.lang.reflect.Method.invoke(Method.java:606)
14-Jun-2018 16:16:40         at org.springframework.aop.support.AopUtils.invokeJoinpointUsingReflection(AopUtils.java:317)
14-Jun-2018 16:16:40         at org.springframework.aop.framework.ReflectiveMethodInvocation.invokeJoinpoint(ReflectiveMethodInvocation.java:183)
14-Jun-2018 16:16:40         at org.springframework.aop.framework.ReflectiveMethodInvocation.proceed(ReflectiveMethodInvocation.java:150)
14-Jun-2018 16:16:40         at org.openmrs.aop.LoggingAdvice.invoke(LoggingAdvice.java:121)
14-Jun-2018 16:16:40         at org.springframework.aop.framework.ReflectiveMethodInvocation.proceed(ReflectiveMethodInvocation.java:172)
14-Jun-2018 16:16:40         at org.springframework.aop.framework.adapter.MethodBeforeAdviceInterceptor.invoke(MethodBeforeAdviceInterceptor.java:51)
14-Jun-2018 16:16:40         at org.springframework.aop.framework.ReflectiveMethodInvocation.proceed(ReflectiveMethodInvocation.java:172)
14-Jun-2018 16:16:40         at org.springframework.aop.framework.adapter.MethodBeforeAdviceInterceptor.invoke(MethodBeforeAdviceInterceptor.java:51)
14-Jun-2018 16:16:40         at org.springframework.aop.framework.ReflectiveMethodInvocation.proceed(ReflectiveMethodInvocation.java:172)
14-Jun-2018 16:16:40         at org.springframework.aop.framework.JdkDynamicAopProxy.invoke(JdkDynamicAopProxy.java:204)
14-Jun-2018 16:16:40         at com.sun.proxy.$Proxy60.getConcepts(Unknown Source)
14-Jun-2018 16:16:40         at org.openmrs.web.dwr.DWRConceptService.findBatchOfConcepts(DWRConceptService.java:199)
14-Jun-2018 16:16:40         at org.openmrs.web.dwr.DWRConceptServiceTest.findBatchOfConcepts_shouldNotReturnConceptByGivenIdIfDatatypeIsNotIncluded(DWRConceptServiceTest.java:151)
14-Jun-2018 16:16:40         at sun.reflect.NativeMethodAccessorImpl.invoke0(Native Method)
14-Jun-2018 16:16:40         at sun.reflect.NativeMethodAccessorImpl.invoke(NativeMethodAccessorImpl.java:57)
14-Jun-2018 16:16:40         at sun.reflect.DelegatingMethodAccessorImpl.invoke(DelegatingMethodAccessorImpl.java:43)
14-Jun-2018 16:16:40         at java.lang.reflect.Method.invoke(Method.java:606)
14-Jun-2018 16:16:40         at org.junit.runners.model.FrameworkMethod$1.runReflectiveCall(FrameworkMethod.java:47)
14-Jun-2018 16:16:40         at org.junit.internal.runners.model.ReflectiveCallable.run(ReflectiveCallable.java:12)
14-Jun-2018 16:16:40         at org.junit.runners.model.FrameworkMethod.invokeExplosively(FrameworkMethod.java:44)
14-Jun-2018 16:16:40         at org.junit.internal.runners.statements.InvokeMethod.evaluate(InvokeMethod.java:17)
14-Jun-2018 16:16:40         at org.junit.internal.runners.statements.RunBefores.evaluate(RunBefores.java:26)
14-Jun-2018 16:16:40         at org.springframework.test.context.junit4.statements.RunBeforeTestMethodCallbacks.evaluate(RunBeforeTestMethodCallbacks.java:74)
14-Jun-2018 16:16:40         at org.junit.internal.runners.statements.RunAfters.evaluate(RunAfters.java:27)
14-Jun-2018 16:16:40         at org.springframework.test.context.junit4.statements.RunAfterTestMethodCallbacks.evaluate(RunAfterTestMethodCallbacks.java:83)
14-Jun-2018 16:16:40         at org.springframework.test.context.junit4.statements.SpringRepeat.evaluate(SpringRepeat.java:72)
14-Jun-2018 16:16:40         at org.springframework.test.context.junit4.SpringJUnit4ClassRunner.runChild(SpringJUnit4ClassRunner.java:231)
14-Jun-2018 16:16:40         at org.springframework.test.context.junit4.SpringJUnit4ClassRunner.runChild(SpringJUnit4ClassRunner.java:88)
14-Jun-2018 16:16:40         at org.junit.runners.ParentRunner$3.run(ParentRunner.java:238)
14-Jun-2018 16:16:40         at org.junit.runners.ParentRunner$1.schedule(ParentRunner.java:63)
14-Jun-2018 16:16:40         at org.junit.runners.ParentRunner.runChildren(ParentRunner.java:236)
14-Jun-2018 16:16:40         at org.junit.runners.ParentRunner.access$000(ParentRunner.java:53)
14-Jun-2018 16:16:40         at org.junit.runners.ParentRunner$2.evaluate(ParentRunner.java:229)
14-Jun-2018 16:16:40         at org.springframework.test.context.junit4.statements.RunBeforeTestClassCallbacks.evaluate(RunBeforeTestClassCallbacks.java:61)
14-Jun-2018 16:16:40         at org.junit.internal.runners.statements.RunAfters.evaluate(RunAfters.java:27)
14-Jun-2018 16:16:40         at org.springframework.test.context.junit4.statements.RunAfterTestClassCallbacks.evaluate(RunAfterTestClassCallbacks.java:71)
14-Jun-2018 16:16:40         at org.junit.runners.ParentRunner.run(ParentRunner.java:309)
14-Jun-2018 16:16:40         at org.springframework.test.context.junit4.SpringJUnit4ClassRunner.run(SpringJUnit4ClassRunner.java:174)
14-Jun-2018 16:16:40         at org.apache.maven.surefire.junit4.JUnit4TestSet.execute(JUnit4TestSet.java:59)
14-Jun-2018 16:16:40         at org.apache.maven.surefire.suite.AbstractDirectoryTestSuite.executeTestSet(AbstractDirectoryTestSuite.java:115)
14-Jun-2018 16:16:40         at org.apache.maven.surefire.suite.AbstractDirectoryTestSuite.execute(AbstractDirectoryTestSuite.java:102)
14-Jun-2018 16:16:40         at org.apache.maven.surefire.Surefire.run(Surefire.java:180)
14-Jun-2018 16:16:40         at sun.reflect.NativeMethodAccessorImpl.invoke0(Native Method)
14-Jun-2018 16:16:40         at sun.reflect.NativeMethodAccessorImpl.invoke(NativeMethodAccessorImpl.java:57)
14-Jun-2018 16:16:40         at sun.reflect.DelegatingMethodAccessorImpl.invoke(DelegatingMethodAccessorImpl.java:43)
14-Jun-2018 16:16:40         at java.lang.reflect.Method.invoke(Method.java:606)
14-Jun-2018 16:16:40         at org.apache.maven.surefire.booter.SurefireBooter.runSuitesInProcess(SurefireBooter.java:350)
14-Jun-2018 16:16:40         at org.apache.maven.surefire.booter.SurefireBooter.main(SurefireBooter.java:1021)
14-Jun-2018 16:16:41 ERROR - DWRConceptService.findBatchOfConcepts(222) |2018-06-14 16:16:41,132| Error while finding concepts + null
14-Jun-2018 16:16:41 java.lang.NullPointerException
14-Jun-2018 16:16:41         at org.openmrs.api.db.hibernate.HibernateConceptDAO.transformToIds(HibernateConceptDAO.java:1418)
14-Jun-2018 16:16:41         at org.openmrs.api.db.hibernate.HibernateConceptDAO.newConceptNameLuceneQuery(HibernateConceptDAO.java:1384)
14-Jun-2018 16:16:41         at org.openmrs.api.db.hibernate.HibernateConceptDAO.getConcepts(HibernateConceptDAO.java:1340)
14-Jun-2018 16:16:41         at org.openmrs.api.impl.ConceptServiceImpl.getConcepts(ConceptServiceImpl.java:1654)
14-Jun-2018 16:16:41         at sun.reflect.NativeMethodAccessorImpl.invoke0(Native Method)
14-Jun-2018 16:16:41         at sun.reflect.NativeMethodAccessorImpl.invoke(NativeMethodAccessorImpl.java:57)
14-Jun-2018 16:16:41         at sun.reflect.DelegatingMethodAccessorImpl.invoke(DelegatingMethodAccessorImpl.java:43)
14-Jun-2018 16:16:41         at java.lang.reflect.Method.invoke(Method.java:606)
14-Jun-2018 16:16:41         at org.springframework.aop.support.AopUtils.invokeJoinpointUsingReflection(AopUtils.java:317)
14-Jun-2018 16:16:41         at org.springframework.aop.framework.ReflectiveMethodInvocation.invokeJoinpoint(ReflectiveMethodInvocation.java:183)
14-Jun-2018 16:16:41         at org.springframework.aop.framework.ReflectiveMethodInvocation.proceed(ReflectiveMethodInvocation.java:150)
14-Jun-2018 16:16:41         at org.springframework.transaction.interceptor.TransactionInterceptor$1.proceedWithInvocation(TransactionInterceptor.java:96)
14-Jun-2018 16:16:41         at org.springframework.transaction.interceptor.TransactionAspectSupport.invokeWithinTransaction(TransactionAspectSupport.java:260)
14-Jun-2018 16:16:41         at org.springframework.transaction.interceptor.TransactionInterceptor.invoke(TransactionInterceptor.java:94)
14-Jun-2018 16:16:41         at org.springframework.aop.framework.ReflectiveMethodInvocation.proceed(ReflectiveMethodInvocation.java:172)
14-Jun-2018 16:16:41         at org.springframework.aop.framework.JdkDynamicAopProxy.invoke(JdkDynamicAopProxy.java:204)
14-Jun-2018 16:16:41         at com.sun.proxy.$Proxy59.getConcepts(Unknown Source)
14-Jun-2018 16:16:41         at sun.reflect.NativeMethodAccessorImpl.invoke0(Native Method)
14-Jun-2018 16:16:41         at sun.reflect.NativeMethodAccessorImpl.invoke(NativeMethodAccessorImpl.java:57)
14-Jun-2018 16:16:41         at sun.reflect.DelegatingMethodAccessorImpl.invoke(DelegatingMethodAccessorImpl.java:43)
14-Jun-2018 16:16:41         at java.lang.reflect.Method.invoke(Method.java:606)
14-Jun-2018 16:16:41         at org.springframework.aop.support.AopUtils.invokeJoinpointUsingReflection(AopUtils.java:317)
14-Jun-2018 16:16:41         at org.springframework.aop.framework.ReflectiveMethodInvocation.invokeJoinpoint(ReflectiveMethodInvocation.java:183)
14-Jun-2018 16:16:41         at org.springframework.aop.framework.ReflectiveMethodInvocation.proceed(ReflectiveMethodInvocation.java:150)
14-Jun-2018 16:16:41         at org.openmrs.aop.LoggingAdvice.invoke(LoggingAdvice.java:121)
14-Jun-2018 16:16:41         at org.springframework.aop.framework.ReflectiveMethodInvocation.proceed(ReflectiveMethodInvocation.java:172)
14-Jun-2018 16:16:41         at org.springframework.aop.framework.adapter.MethodBeforeAdviceInterceptor.invoke(MethodBeforeAdviceInterceptor.java:51)
14-Jun-2018 16:16:41         at org.springframework.aop.framework.ReflectiveMethodInvocation.proceed(ReflectiveMethodInvocation.java:172)
14-Jun-2018 16:16:41         at org.springframework.aop.framework.adapter.MethodBeforeAdviceInterceptor.invoke(MethodBeforeAdviceInterceptor.java:51)
14-Jun-2018 16:16:41         at org.springframework.aop.framework.ReflectiveMethodInvocation.proceed(ReflectiveMethodInvocation.java:172)
14-Jun-2018 16:16:41         at org.springframework.aop.framework.JdkDynamicAopProxy.invoke(JdkDynamicAopProxy.java:204)
14-Jun-2018 16:16:41         at com.sun.proxy.$Proxy60.getConcepts(Unknown Source)
14-Jun-2018 16:16:41         at org.openmrs.web.dwr.DWRConceptService.findBatchOfConcepts(DWRConceptService.java:199)
14-Jun-2018 16:16:41         at org.openmrs.web.dwr.DWRConceptServiceTest.findBatchOfConcepts_shouldNotReturnConceptByGivenIdIfClassnameIsNotIncluded(DWRConceptServiceTest.java:96)
14-Jun-2018 16:16:41         at sun.reflect.NativeMethodAccessorImpl.invoke0(Native Method)
14-Jun-2018 16:16:41         at sun.reflect.NativeMethodAccessorImpl.invoke(NativeMethodAccessorImpl.java:57)
14-Jun-2018 16:16:41         at sun.reflect.DelegatingMethodAccessorImpl.invoke(DelegatingMethodAccessorImpl.java:43)
14-Jun-2018 16:16:41         at java.lang.reflect.Method.invoke(Method.java:606)
14-Jun-2018 16:16:41         at org.junit.runners.model.FrameworkMethod$1.runReflectiveCall(FrameworkMethod.java:47)
14-Jun-2018 16:16:41         at org.junit.internal.runners.model.ReflectiveCallable.run(ReflectiveCallable.java:12)
14-Jun-2018 16:16:41         at org.junit.runners.model.FrameworkMethod.invokeExplosively(FrameworkMethod.java:44)
14-Jun-2018 16:16:41         at org.junit.internal.runners.statements.InvokeMethod.evaluate(InvokeMethod.java:17)
14-Jun-2018 16:16:41         at org.junit.internal.runners.statements.RunBefores.evaluate(RunBefores.java:26)
14-Jun-2018 16:16:41         at org.springframework.test.context.junit4.statements.RunBeforeTestMethodCallbacks.evaluate(RunBeforeTestMethodCallbacks.java:74)
14-Jun-2018 16:16:41         at org.junit.internal.runners.statements.RunAfters.evaluate(RunAfters.java:27)
14-Jun-2018 16:16:41         at org.springframework.test.context.junit4.statements.RunAfterTestMethodCallbacks.evaluate(RunAfterTestMethodCallbacks.java:83)
14-Jun-2018 16:16:41         at org.springframework.test.context.junit4.statements.SpringRepeat.evaluate(SpringRepeat.java:72)
14-Jun-2018 16:16:41         at org.springframework.test.context.junit4.SpringJUnit4ClassRunner.runChild(SpringJUnit4ClassRunner.java:231)
14-Jun-2018 16:16:41         at org.springframework.test.context.junit4.SpringJUnit4ClassRunner.runChild(SpringJUnit4ClassRunner.java:88)
14-Jun-2018 16:16:41         at org.junit.runners.ParentRunner$3.run(ParentRunner.java:238)
14-Jun-2018 16:16:41         at org.junit.runners.ParentRunner$1.schedule(ParentRunner.java:63)
14-Jun-2018 16:16:41         at org.junit.runners.ParentRunner.runChildren(ParentRunner.java:236)
14-Jun-2018 16:16:41         at org.junit.runners.ParentRunner.access$000(ParentRunner.java:53)
14-Jun-2018 16:16:41         at org.junit.runners.ParentRunner$2.evaluate(ParentRunner.java:229)
14-Jun-2018 16:16:41         at org.springframework.test.context.junit4.statements.RunBeforeTestClassCallbacks.evaluate(RunBeforeTestClassCallbacks.java:61)
14-Jun-2018 16:16:41         at org.junit.internal.runners.statements.RunAfters.evaluate(RunAfters.java:27)
14-Jun-2018 16:16:41         at org.springframework.test.context.junit4.statements.RunAfterTestClassCallbacks.evaluate(RunAfterTestClassCallbacks.java:71)
14-Jun-2018 16:16:41         at org.junit.runners.ParentRunner.run(ParentRunner.java:309)
14-Jun-2018 16:16:41         at org.springframework.test.context.junit4.SpringJUnit4ClassRunner.run(SpringJUnit4ClassRunner.java:174)
14-Jun-2018 16:16:41         at org.apache.maven.surefire.junit4.JUnit4TestSet.execute(JUnit4TestSet.java:59)
14-Jun-2018 16:16:41         at org.apache.maven.surefire.suite.AbstractDirectoryTestSuite.executeTestSet(AbstractDirectoryTestSuite.java:115)
14-Jun-2018 16:16:41         at org.apache.maven.surefire.suite.AbstractDirectoryTestSuite.execute(AbstractDirectoryTestSuite.java:102)
14-Jun-2018 16:16:41         at org.apache.maven.surefire.Surefire.run(Surefire.java:180)
14-Jun-2018 16:16:41         at sun.reflect.NativeMethodAccessorImpl.invoke0(Native Method)
14-Jun-2018 16:16:41         at sun.reflect.NativeMethodAccessorImpl.invoke(NativeMethodAccessorImpl.java:57)
14-Jun-2018 16:16:41         at sun.reflect.DelegatingMethodAccessorImpl.invoke(DelegatingMethodAccessorImpl.java:43)
14-Jun-2018 16:16:41         at java.lang.reflect.Method.invoke(Method.java:606)
14-Jun-2018 16:16:41         at org.apache.maven.surefire.booter.SurefireBooter.runSuitesInProcess(SurefireBooter.java:350)
14-Jun-2018 16:16:41         at org.apache.maven.surefire.booter.SurefireBooter.main(SurefireBooter.java:1021)
14-Jun-2018 16:16:41 Tests run: 11, Failures: 0, Errors: 0, Skipped: 0, Time elapsed: 2.182 sec
14-Jun-2018 16:16:41 Running org.openmrs.web.controller.patient.ShortPatientFormControllerTest
14-Jun-2018 16:16:41 Tests run: 14, Failures: 0, Errors: 0, Skipped: 0, Time elapsed: 0.541 sec
14-Jun-2018 16:16:41 Running org.openmrs.web.controller.UserPropertiesTest
14-Jun-2018 16:16:41 Tests run: 6, Failures: 0, Errors: 0, Skipped: 0, Time elapsed: 0.003 sec
14-Jun-2018 16:16:41 Running org.openmrs.web.controller.OptionsFormControllerTest
14-Jun-2018 16:16:42 Tests run: 12, Failures: 0, Errors: 0, Skipped: 0, Time elapsed: 0.28 sec
14-Jun-2018 16:16:42 Running org.openmrs.web.dwr.PersonListItemTest
14-Jun-2018 16:16:42 Tests run: 8, Failures: 0, Errors: 0, Skipped: 0, Time elapsed: 0.094 sec
14-Jun-2018 16:16:42 Running org.openmrs.web.controller.encounter.EncounterTypeFormControllerTest
14-Jun-2018 16:16:42 Tests run: 2, Failures: 0, Errors: 0, Skipped: 0, Time elapsed: 0.03 sec
14-Jun-2018 16:16:42 Running org.openmrs.web.taglib.PortletTagTest
14-Jun-2018 16:16:42 SLF4J: Class path contains multiple SLF4J bindings.
14-Jun-2018 16:16:42 SLF4J: Found binding in [jar:file:/home/bamboo-agent/.m2/repository/org/slf4j/slf4j-log4j12/1.6.0/slf4j-log4j12-1.6.0.jar!/org/slf4j/impl/StaticLoggerBinder.class]
14-Jun-2018 16:16:42 SLF4J: Found binding in [jar:file:/home/bamboo-agent/.m2/repository/org/slf4j/slf4j-log4j12/1.6.0/slf4j-log4j12-1.6.0.jar!/org/slf4j/impl/StaticLoggerBinder.class]
14-Jun-2018 16:16:42 SLF4J: See http://www.slf4j.org/codes.html#multiple_bindings for an explanation.
14-Jun-2018 16:16:43 Tests run: 7, Failures: 0, Errors: 0, Skipped: 0, Time elapsed: 1.109 sec
14-Jun-2018 16:16:43 Running org.openmrs.web.obs.ObsFormControllerTest
14-Jun-2018 16:16:43 Tests run: 2, Failures: 0, Errors: 0, Skipped: 0, Time elapsed: 0.055 sec
14-Jun-2018 16:16:43 Running org.openmrs.web.encounter.EncounterDisplayControllerTest
14-Jun-2018 16:16:43 Tests run: 2, Failures: 0, Errors: 0, Skipped: 0, Time elapsed: 0.11 sec
14-Jun-2018 16:16:43 Running org.openmrs.web.controller.concept.ConceptStopWordListControllerTest
14-Jun-2018 16:16:43 Tests run: 5, Failures: 0, Errors: 0, Skipped: 0, Time elapsed: 0.042 sec
14-Jun-2018 16:16:43 Running org.openmrs.web.controller.maintenance.SearchIndexControllerTest
14-Jun-2018 16:16:43 Tests run: 3, Failures: 0, Errors: 0, Skipped: 0, Time elapsed: 0.021 sec
14-Jun-2018 16:16:43 Running org.openmrs.web.controller.form.FieldFormControllerTest
14-Jun-2018 16:16:43 Tests run: 3, Failures: 0, Errors: 0, Skipped: 0, Time elapsed: 0.045 sec
14-Jun-2018 16:16:43 Running org.openmrs.web.controller.form.FieldTypeListControllerTest
14-Jun-2018 16:16:43 ERROR - JDBCExceptionReporter.logExceptions(234) |2018-06-14 16:16:43,581| Referential integrity constraint violation: "FK5CEA0FA808FB57F: PUBLIC.FIELD FOREIGN KEY(FIELD_TYPE) REFERENCES PUBLIC.FIELD_TYPE(FIELD_TYPE_ID) (1)"; SQL statement:
14-Jun-2018 16:16:43 delete from field_type where field_type_id=? [23503-187]
14-Jun-2018 16:16:43 ERROR - JDBCExceptionReporter.logExceptions(234) |2018-06-14 16:16:43,582| Referential integrity constraint violation: "FK5CEA0FA808FB57F: PUBLIC.FIELD FOREIGN KEY(FIELD_TYPE) REFERENCES PUBLIC.FIELD_TYPE(FIELD_TYPE_ID) (1)"; SQL statement:
14-Jun-2018 16:16:43 delete from field_type where field_type_id=? [23503-187]
14-Jun-2018 16:16:43 ERROR - FieldTypeListController.onSubmit(85) |2018-06-14 16:16:43,583| Unable to delete a field type because it is in use. fieldTypeId: 1
14-Jun-2018 16:16:43 org.springframework.dao.DataIntegrityViolationException: Could not execute JDBC batch update; SQL [delete from field_type where field_type_id=?]; constraint ["FK5CEA0FA808FB57F: PUBLIC.FIELD FOREIGN KEY(FIELD_TYPE) REFERENCES PUBLIC.FIELD_TYPE(FIELD_TYPE_ID) (1)"; SQL statement:
14-Jun-2018 16:16:43 delete from field_type where field_type_id=? [23503-187]]; nested exception is org.hibernate.exception.ConstraintViolationException: Could not execute JDBC batch update
14-Jun-2018 16:16:43         at org.springframework.orm.hibernate3.SessionFactoryUtils.convertHibernateAccessException(SessionFactoryUtils.java:645)
14-Jun-2018 16:16:43         at org.springframework.orm.hibernate3.HibernateTransactionManager.convertHibernateAccessException(HibernateTransactionManager.java:794)
14-Jun-2018 16:16:43         at org.springframework.orm.hibernate3.HibernateTransactionManager.doCommit(HibernateTransactionManager.java:665)
14-Jun-2018 16:16:43         at org.springframework.transaction.support.AbstractPlatformTransactionManager.processCommit(AbstractPlatformTransactionManager.java:755)
14-Jun-2018 16:16:43         at org.springframework.transaction.support.AbstractPlatformTransactionManager.commit(AbstractPlatformTransactionManager.java:724)
14-Jun-2018 16:16:43         at org.springframework.transaction.interceptor.TransactionAspectSupport.commitTransactionAfterReturning(TransactionAspectSupport.java:475)
14-Jun-2018 16:16:43         at org.springframework.transaction.interceptor.TransactionAspectSupport.invokeWithinTransaction(TransactionAspectSupport.java:270)
14-Jun-2018 16:16:43         at org.springframework.transaction.interceptor.TransactionInterceptor.invoke(TransactionInterceptor.java:94)
14-Jun-2018 16:16:43         at org.springframework.aop.framework.ReflectiveMethodInvocation.proceed(ReflectiveMethodInvocation.java:172)
14-Jun-2018 16:16:43         at org.springframework.aop.framework.JdkDynamicAopProxy.invoke(JdkDynamicAopProxy.java:204)
14-Jun-2018 16:16:43         at com.sun.proxy.$Proxy68.purgeFieldType(Unknown Source)
14-Jun-2018 16:16:43         at sun.reflect.NativeMethodAccessorImpl.invoke0(Native Method)
14-Jun-2018 16:16:43         at sun.reflect.NativeMethodAccessorImpl.invoke(NativeMethodAccessorImpl.java:57)
14-Jun-2018 16:16:43         at sun.reflect.DelegatingMethodAccessorImpl.invoke(DelegatingMethodAccessorImpl.java:43)
14-Jun-2018 16:16:43         at java.lang.reflect.Method.invoke(Method.java:606)
14-Jun-2018 16:16:43         at org.springframework.aop.support.AopUtils.invokeJoinpointUsingReflection(AopUtils.java:317)
14-Jun-2018 16:16:43         at org.springframework.aop.framework.ReflectiveMethodInvocation.invokeJoinpoint(ReflectiveMethodInvocation.java:183)
14-Jun-2018 16:16:43         at org.springframework.aop.framework.ReflectiveMethodInvocation.proceed(ReflectiveMethodInvocation.java:150)
14-Jun-2018 16:16:43         at org.openmrs.aop.LoggingAdvice.invoke(LoggingAdvice.java:121)
14-Jun-2018 16:16:43         at org.springframework.aop.framework.ReflectiveMethodInvocation.proceed(ReflectiveMethodInvocation.java:172)
14-Jun-2018 16:16:43         at org.springframework.aop.framework.adapter.MethodBeforeAdviceInterceptor.invoke(MethodBeforeAdviceInterceptor.java:51)
14-Jun-2018 16:16:43         at org.springframework.aop.framework.ReflectiveMethodInvocation.proceed(ReflectiveMethodInvocation.java:172)
14-Jun-2018 16:16:43         at org.springframework.aop.framework.adapter.MethodBeforeAdviceInterceptor.invoke(MethodBeforeAdviceInterceptor.java:51)
14-Jun-2018 16:16:43         at org.springframework.aop.framework.ReflectiveMethodInvocation.proceed(ReflectiveMethodInvocation.java:172)
14-Jun-2018 16:16:43         at org.springframework.aop.framework.JdkDynamicAopProxy.invoke(JdkDynamicAopProxy.java:204)
14-Jun-2018 16:16:43         at com.sun.proxy.$Proxy69.purgeFieldType(Unknown Source)
14-Jun-2018 16:16:43         at org.openmrs.web.controller.form.FieldTypeListController.onSubmit(FieldTypeListController.java:71)
14-Jun-2018 16:16:43         at org.springframework.web.servlet.mvc.SimpleFormController.processFormSubmission(SimpleFormController.java:272)
14-Jun-2018 16:16:43         at org.springframework.web.servlet.mvc.AbstractFormController.handleRequestInternal(AbstractFormController.java:268)
14-Jun-2018 16:16:43         at org.springframework.web.servlet.mvc.AbstractController.handleRequest(AbstractController.java:153)
14-Jun-2018 16:16:43         at org.springframework.web.servlet.mvc.SimpleControllerHandlerAdapter.handle(SimpleControllerHandlerAdapter.java:48)
14-Jun-2018 16:16:43         at org.openmrs.web.test.WebTestHelper.handle(WebTestHelper.java:127)
14-Jun-2018 16:16:43         at org.openmrs.web.controller.form.FieldTypeListControllerTest.onSubmit_shouldDisplayAUserFriendlyErrorMessage(FieldTypeListControllerTest.java:44)
14-Jun-2018 16:16:43         at sun.reflect.NativeMethodAccessorImpl.invoke0(Native Method)
14-Jun-2018 16:16:43         at sun.reflect.NativeMethodAccessorImpl.invoke(NativeMethodAccessorImpl.java:57)
14-Jun-2018 16:16:43         at sun.reflect.DelegatingMethodAccessorImpl.invoke(DelegatingMethodAccessorImpl.java:43)
14-Jun-2018 16:16:43         at java.lang.reflect.Method.invoke(Method.java:606)
14-Jun-2018 16:16:43         at org.junit.runners.model.FrameworkMethod$1.runReflectiveCall(FrameworkMethod.java:47)
14-Jun-2018 16:16:43         at org.junit.internal.runners.model.ReflectiveCallable.run(ReflectiveCallable.java:12)
14-Jun-2018 16:16:43         at org.junit.runners.model.FrameworkMethod.invokeExplosively(FrameworkMethod.java:44)
14-Jun-2018 16:16:43         at org.junit.internal.runners.statements.InvokeMethod.evaluate(InvokeMethod.java:17)
14-Jun-2018 16:16:43         at org.junit.internal.runners.statements.RunBefores.evaluate(RunBefores.java:26)
14-Jun-2018 16:16:43         at org.springframework.test.context.junit4.statements.RunBeforeTestMethodCallbacks.evaluate(RunBeforeTestMethodCallbacks.java:74)
14-Jun-2018 16:16:43         at org.junit.internal.runners.statements.RunAfters.evaluate(RunAfters.java:27)
14-Jun-2018 16:16:43         at org.springframework.test.context.junit4.statements.RunAfterTestMethodCallbacks.evaluate(RunAfterTestMethodCallbacks.java:83)
14-Jun-2018 16:16:43         at org.springframework.test.context.junit4.statements.SpringRepeat.evaluate(SpringRepeat.java:72)
14-Jun-2018 16:16:43         at org.springframework.test.context.junit4.SpringJUnit4ClassRunner.runChild(SpringJUnit4ClassRunner.java:231)
14-Jun-2018 16:16:43         at org.springframework.test.context.junit4.SpringJUnit4ClassRunner.runChild(SpringJUnit4ClassRunner.java:88)
14-Jun-2018 16:16:43         at org.junit.runners.ParentRunner$3.run(ParentRunner.java:238)
14-Jun-2018 16:16:43         at org.junit.runners.ParentRunner$1.schedule(ParentRunner.java:63)
14-Jun-2018 16:16:43         at org.junit.runners.ParentRunner.runChildren(ParentRunner.java:236)
14-Jun-2018 16:16:43         at org.junit.runners.ParentRunner.access$000(ParentRunner.java:53)
14-Jun-2018 16:16:43         at org.junit.runners.ParentRunner$2.evaluate(ParentRunner.java:229)
14-Jun-2018 16:16:43         at org.springframework.test.context.junit4.statements.RunBeforeTestClassCallbacks.evaluate(RunBeforeTestClassCallbacks.java:61)
14-Jun-2018 16:16:43         at org.junit.internal.runners.statements.RunAfters.evaluate(RunAfters.java:27)
14-Jun-2018 16:16:43         at org.springframework.test.context.junit4.statements.RunAfterTestClassCallbacks.evaluate(RunAfterTestClassCallbacks.java:71)
14-Jun-2018 16:16:43         at org.junit.runners.ParentRunner.run(ParentRunner.java:309)
14-Jun-2018 16:16:43         at org.springframework.test.context.junit4.SpringJUnit4ClassRunner.run(SpringJUnit4ClassRunner.java:174)
14-Jun-2018 16:16:43         at org.apache.maven.surefire.junit4.JUnit4TestSet.execute(JUnit4TestSet.java:59)
14-Jun-2018 16:16:43         at org.apache.maven.surefire.suite.AbstractDirectoryTestSuite.executeTestSet(AbstractDirectoryTestSuite.java:115)
14-Jun-2018 16:16:43         at org.apache.maven.surefire.suite.AbstractDirectoryTestSuite.execute(AbstractDirectoryTestSuite.java:102)
14-Jun-2018 16:16:43         at org.apache.maven.surefire.Surefire.run(Surefire.java:180)
14-Jun-2018 16:16:43         at sun.reflect.NativeMethodAccessorImpl.invoke0(Native Method)
14-Jun-2018 16:16:43         at sun.reflect.NativeMethodAccessorImpl.invoke(NativeMethodAccessorImpl.java:57)
14-Jun-2018 16:16:43         at sun.reflect.DelegatingMethodAccessorImpl.invoke(DelegatingMethodAccessorImpl.java:43)
14-Jun-2018 16:16:43         at java.lang.reflect.Method.invoke(Method.java:606)
14-Jun-2018 16:16:43         at org.apache.maven.surefire.booter.SurefireBooter.runSuitesInProcess(SurefireBooter.java:350)
14-Jun-2018 16:16:43         at org.apache.maven.surefire.booter.SurefireBooter.main(SurefireBooter.java:1021)
14-Jun-2018 16:16:43 Caused by: org.hibernate.exception.ConstraintViolationException: Could not execute JDBC batch update
14-Jun-2018 16:16:43         at org.hibernate.exception.SQLStateConverter.convert(SQLStateConverter.java:96)
14-Jun-2018 16:16:43         at org.hibernate.exception.JDBCExceptionHelper.convert(JDBCExceptionHelper.java:66)
14-Jun-2018 16:16:43         at org.hibernate.jdbc.AbstractBatcher.executeBatch(AbstractBatcher.java:275)
14-Jun-2018 16:16:43         at org.hibernate.engine.ActionQueue.executeActions(ActionQueue.java:268)
14-Jun-2018 16:16:43         at org.hibernate.engine.ActionQueue.executeActions(ActionQueue.java:189)
14-Jun-2018 16:16:43         at org.hibernate.event.def.AbstractFlushingEventListener.performExecutions(AbstractFlushingEventListener.java:321)
14-Jun-2018 16:16:43         at org.hibernate.event.def.DefaultFlushEventListener.onFlush(DefaultFlushEventListener.java:51)
14-Jun-2018 16:16:43         at org.hibernate.impl.SessionImpl.flush(SessionImpl.java:1216)
14-Jun-2018 16:16:43         at org.hibernate.impl.SessionImpl.managedFlush(SessionImpl.java:383)
14-Jun-2018 16:16:43         at org.hibernate.transaction.JDBCTransaction.commit(JDBCTransaction.java:133)
14-Jun-2018 16:16:43         at org.springframework.orm.hibernate3.HibernateTransactionManager.doCommit(HibernateTransactionManager.java:657)
14-Jun-2018 16:16:43         ... 65 more
14-Jun-2018 16:16:43 Caused by: org.h2.jdbc.JdbcBatchUpdateException: Referential integrity constraint violation: "FK5CEA0FA808FB57F: PUBLIC.FIELD FOREIGN KEY(FIELD_TYPE) REFERENCES PUBLIC.FIELD_TYPE(FIELD_TYPE_ID) (1)"; SQL statement:
14-Jun-2018 16:16:43 delete from field_type where field_type_id=? [23503-187]
14-Jun-2018 16:16:43         at org.h2.jdbc.JdbcPreparedStatement.executeBatch(JdbcPreparedStatement.java:1198)
14-Jun-2018 16:16:43         at com.mchange.v2.c3p0.impl.NewProxyPreparedStatement.executeBatch(NewProxyPreparedStatement.java:1723)
14-Jun-2018 16:16:43         at org.hibernate.jdbc.BatchingBatcher.doExecuteBatch(BatchingBatcher.java:70)
14-Jun-2018 16:16:43         at org.hibernate.jdbc.AbstractBatcher.executeBatch(AbstractBatcher.java:268)
14-Jun-2018 16:16:43         ... 73 more
14-Jun-2018 16:16:43 Tests run: 1, Failures: 0, Errors: 0, Skipped: 0, Time elapsed: 0.034 sec
14-Jun-2018 16:16:43 Running org.openmrs.web.controller.maintenance.GlobalPropertyControllerTest
14-Jun-2018 16:16:43 Tests run: 2, Failures: 0, Errors: 0, Skipped: 0, Time elapsed: 0.048 sec
14-Jun-2018 16:16:43 Running org.openmrs.web.controller.PortletControllerTest
14-Jun-2018 16:16:43 Tests run: 2, Failures: 0, Errors: 0, Skipped: 0, Time elapsed: 0.136 sec
14-Jun-2018 16:16:43 Running org.openmrs.web.controller.program.ProgramFormControllerTest
14-Jun-2018 16:16:43 Tests run: 1, Failures: 0, Errors: 0, Skipped: 0, Time elapsed: 0.03 sec
14-Jun-2018 16:16:43 Running org.openmrs.web.taglib.FormatTagTest
14-Jun-2018 16:16:44 Tests run: 3, Failures: 0, Errors: 0, Skipped: 0, Time elapsed: 0.21 sec
14-Jun-2018 16:16:44 Running org.openmrs.scheduler.web.controller.TaskHelperTest
14-Jun-2018 16:16:45 ERROR - JDBCExceptionReporter.logExceptions(234) |2018-06-14 16:16:45,060| Unique index or primary key violation: "CONSTRAINT_INDEX_24 ON PUBLIC.SCHEDULER_TASK_CONFIG(UUID) VALUES ('FA010D31-4040-4574-A083-315A781106FA', 2)"; SQL statement:
14-Jun-2018 16:16:45 insert into scheduler_task_config (task_config_id, uuid, name, description, schedulable_class, repeat_interval, start_time, start_time_pattern, last_execution_time, start_on_startup, started, created_by, changed_by, date_created, date_changed) values (null, ?, ?, ?, ?, ?, ?, ?, ?, ?, ?, ?, ?, ?, ?) [23505-187]
14-Jun-2018 16:16:45 Tests run: 6, Failures: 0, Errors: 0, Skipped: 0, Time elapsed: 1.557 sec
14-Jun-2018 16:16:45 Running org.openmrs.web.controller.maintenance.SystemInformationControllerTest
14-Jun-2018 16:16:45 Tests run: 5, Failures: 0, Errors: 0, Skipped: 0, Time elapsed: 0.07 sec
14-Jun-2018 16:16:45 Running org.openmrs.web.controller.encounter.EncounterTypeListControllerTest
14-Jun-2018 16:16:45 Tests run: 1, Failures: 0, Errors: 0, Skipped: 0, Time elapsed: 0.014 sec
14-Jun-2018 16:16:45 Running org.openmrs.web.controller.GlobalPropertyPortletControllerTest
14-Jun-2018 16:16:45 Tests run: 4, Failures: 0, Errors: 0, Skipped: 0, Time elapsed: 0.05 sec
14-Jun-2018 16:16:45 Running org.openmrs.module.web.controller.ModuleListControllerTest
14-Jun-2018 16:16:45 Tests run: 1, Failures: 0, Errors: 0, Skipped: 0, Time elapsed: 0.001 sec
14-Jun-2018 16:16:45 Running org.openmrs.web.controller.ConceptFormControllerTest
14-Jun-2018 16:16:46 WARN - HibernateConceptDAO.getConceptByName(1742) |2018-06-14 16:16:46,037| No concept found for 'new concept'
14-Jun-2018 16:16:46 WARN - HibernateConceptDAO.getConceptByName(1742) |2018-06-14 16:16:46,274| No concept found for 'no such concept'
14-Jun-2018 16:16:46 WARN - HibernateConceptDAO.getConceptByName(1742) |2018-06-14 16:16:46,387| No concept found for 'no such concept'
14-Jun-2018 16:16:46 WARN - HibernateConceptDAO.getConceptByName(1742) |2018-06-14 16:16:46,647| No concept found for 'no such concept'
14-Jun-2018 16:16:47 WARN - HibernateConceptDAO.getConceptByName(1742) |2018-06-14 16:16:47,360| No concept found for 'no such concept'
14-Jun-2018 16:16:47 WARN - HibernateConceptDAO.getConceptByName(1742) |2018-06-14 16:16:47,673| No concept found for 'no such concept'
14-Jun-2018 16:16:47 WARN - HibernateConceptDAO.getConceptByName(1742) |2018-06-14 16:16:47,741| No concept found for 'no such concept'
14-Jun-2018 16:16:48 WARN - HibernateConceptDAO.getConceptByName(1742) |2018-06-14 16:16:48,213| No concept found for 'no such concept'
14-Jun-2018 16:16:48 Tests run: 31, Failures: 0, Errors: 0, Skipped: 0, Time elapsed: 2.625 sec
14-Jun-2018 16:16:48 Running org.openmrs.web.dwr.DeprecationCheckTest
14-Jun-2018 16:16:48 Tests run: 1, Failures: 0, Errors: 0, Skipped: 0, Time elapsed: 0.029 sec
14-Jun-2018 16:16:48 Running org.openmrs.web.dwr.ConceptListItemTest
14-Jun-2018 16:16:48 Tests run: 4, Failures: 0, Errors: 0, Skipped: 0, Time elapsed: 0.003 sec
14-Jun-2018 16:16:48 Running org.openmrs.module.web.extension.ExtensionUtilTest
14-Jun-2018 16:16:48 SLF4J: Class path contains multiple SLF4J bindings.
14-Jun-2018 16:16:48 SLF4J: Found binding in [jar:file:/home/bamboo-agent/.m2/repository/org/slf4j/slf4j-log4j12/1.6.0/slf4j-log4j12-1.6.0.jar!/org/slf4j/impl/StaticLoggerBinder.class]
14-Jun-2018 16:16:48 SLF4J: Found binding in [jar:file:/home/bamboo-agent/.m2/repository/org/slf4j/slf4j-log4j12/1.6.0/slf4j-log4j12-1.6.0.jar!/org/slf4j/impl/StaticLoggerBinder.class]
14-Jun-2018 16:16:48 SLF4J: See http://www.slf4j.org/codes.html#multiple_bindings for an explanation.
14-Jun-2018 16:16:49 Tests run: 2, Failures: 0, Errors: 0, Skipped: 0, Time elapsed: 0.826 sec
14-Jun-2018 16:16:49 Running org.openmrs.web.dwr.DWRProgramWorkflowServiceTest
14-Jun-2018 16:16:49 Tests run: 4, Failures: 0, Errors: 0, Skipped: 0, Time elapsed: 0.224 sec
14-Jun-2018 16:16:49 Running org.openmrs.web.dwr.DWRProviderServiceTest
14-Jun-2018 16:16:49 Tests run: 4, Failures: 0, Errors: 0, Skipped: 1, Time elapsed: 0.075 sec
14-Jun-2018 16:16:49 Running org.openmrs.web.dwr.DWRPersonServiceTest
14-Jun-2018 16:16:49 Tests run: 2, Failures: 0, Errors: 0, Skipped: 0, Time elapsed: 0.029 sec
14-Jun-2018 16:16:49 Running org.openmrs.web.filter.update.GZIPFilterTest
14-Jun-2018 16:16:49 Tests run: 1, Failures: 0, Errors: 0, Skipped: 0, Time elapsed: 0.03 sec
14-Jun-2018 16:16:49 Running org.openmrs.web.controller.encounter.EncounterRoleFormControllerTest
14-Jun-2018 16:16:49 Tests run: 8, Failures: 0, Errors: 0, Skipped: 0, Time elapsed: 0.335 sec
14-Jun-2018 16:16:49 Running org.openmrs.web.taglib.OpenmrsMessageTagTest
14-Jun-2018 16:16:49 Tests run: 8, Failures: 0, Errors: 0, Skipped: 0, Time elapsed: 0.071 sec
14-Jun-2018 16:16:49 Running org.openmrs.web.controller.concept.ConceptProposalFormControllerTest
14-Jun-2018 16:16:50 Tests run: 1, Failures: 0, Errors: 0, Skipped: 0, Time elapsed: 0.046 sec
14-Jun-2018 16:16:50 Running org.openmrs.web.controller.provider.ProviderFormControllerTest
14-Jun-2018 16:16:50 Tests run: 2, Failures: 0, Errors: 0, Skipped: 0, Time elapsed: 0.113 sec
14-Jun-2018 16:16:50 Running org.openmrs.web.controller.user.UserListControllerTest
14-Jun-2018 16:16:50 Tests run: 4, Failures: 0, Errors: 0, Skipped: 0, Time elapsed: 0.067 sec
14-Jun-2018 16:16:50
14-Jun-2018 16:16:50 Results :
14-Jun-2018 16:16:50
14-Jun-2018 16:16:50 Tests run: 318, Failures: 0, Errors: 0, Skipped: 6
14-Jun-2018 16:16:50
14-Jun-2018 16:16:50 [INFO]
14-Jun-2018 16:16:50 [INFO] --- maven-jar-plugin:2.3.2:jar (default-jar) @ openmrs-web ---
14-Jun-2018 16:16:50 [INFO] Building jar: /home/bamboo-agent/bamboo-agent/xml-data/build-dir/TRUNK-OC1-JOB1/web/target/openmrs-web-1.11.10-SNAPSHOT.jar
14-Jun-2018 16:16:50 [INFO]
14-Jun-2018 16:16:50 [INFO] --- maven-jar-plugin:2.3.2:test-jar (default) @ openmrs-web ---
14-Jun-2018 16:16:50 [INFO] Building jar: /home/bamboo-agent/bamboo-agent/xml-data/build-dir/TRUNK-OC1-JOB1/web/target/openmrs-web-1.11.10-SNAPSHOT-tests.jar
14-Jun-2018 16:16:50 [INFO]
14-Jun-2018 16:16:50 [INFO] --- license-maven-plugin:2.6:check (default) @ openmrs-web ---
14-Jun-2018 16:16:50 [INFO] Checking licenses...
14-Jun-2018 16:16:50 [INFO]
14-Jun-2018 16:16:50 [INFO] --- animal-sniffer-maven-plugin:1.14:check (check-java-version) @ openmrs-web ---
14-Jun-2018 16:16:50 [INFO] Checking unresolved references to org.codehaus.mojo.signature:java16:1.1
14-Jun-2018 16:16:52 [INFO]
14-Jun-2018 16:16:52 [INFO] --- maven-install-plugin:2.4:install (default-install) @ openmrs-web ---
14-Jun-2018 16:16:52 [INFO] Installing /home/bamboo-agent/bamboo-agent/xml-data/build-dir/TRUNK-OC1-JOB1/web/target/openmrs-web-1.11.10-SNAPSHOT.jar to /home/bamboo-agent/.m2/repository/org/openmrs/web/openmrs-web/1.11.10-SNAPSHOT/openmrs-web-1.11.10-SNAPSHOT.jar
14-Jun-2018 16:16:52 [INFO] Installing /home/bamboo-agent/bamboo-agent/xml-data/build-dir/TRUNK-OC1-JOB1/web/pom.xml to /home/bamboo-agent/.m2/repository/org/openmrs/web/openmrs-web/1.11.10-SNAPSHOT/openmrs-web-1.11.10-SNAPSHOT.pom
14-Jun-2018 16:16:52 [INFO] Installing /home/bamboo-agent/bamboo-agent/xml-data/build-dir/TRUNK-OC1-JOB1/web/target/openmrs-web-1.11.10-SNAPSHOT-tests.jar to /home/bamboo-agent/.m2/repository/org/openmrs/web/openmrs-web/1.11.10-SNAPSHOT/openmrs-web-1.11.10-SNAPSHOT-tests.jar
14-Jun-2018 16:16:52 [INFO]
14-Jun-2018 16:16:52 [INFO] --- maven-deploy-plugin:2.7:deploy (default-deploy) @ openmrs-web ---
14-Jun-2018 16:16:52 [INFO] Downloading: http://mavenrepo.openmrs.org/nexus/content/repositories/snapshots/org/openmrs/web/openmrs-web/1.11.10-SNAPSHOT/maven-metadata.xml
14-Jun-2018 16:16:52 [INFO] Downloaded: http://mavenrepo.openmrs.org/nexus/content/repositories/snapshots/org/openmrs/web/openmrs-web/1.11.10-SNAPSHOT/maven-metadata.xml (996 B at 3.8 KB/sec)
14-Jun-2018 16:16:52 [INFO] Uploading: http://mavenrepo.openmrs.org/nexus/content/repositories/snapshots/org/openmrs/web/openmrs-web/1.11.10-SNAPSHOT/openmrs-web-1.11.10-20180614.161652-2.jar
14-Jun-2018 16:16:54 [INFO] Uploaded: http://mavenrepo.openmrs.org/nexus/content/repositories/snapshots/org/openmrs/web/openmrs-web/1.11.10-SNAPSHOT/openmrs-web-1.11.10-20180614.161652-2.jar (850 KB at 653.7 KB/sec)
14-Jun-2018 16:16:54 [INFO] Uploading: http://mavenrepo.openmrs.org/nexus/content/repositories/snapshots/org/openmrs/web/openmrs-web/1.11.10-SNAPSHOT/openmrs-web-1.11.10-20180614.161652-2.pom
14-Jun-2018 16:16:54 [INFO] Uploaded: http://mavenrepo.openmrs.org/nexus/content/repositories/snapshots/org/openmrs/web/openmrs-web/1.11.10-SNAPSHOT/openmrs-web-1.11.10-20180614.161652-2.pom (6 KB at 13.9 KB/sec)
14-Jun-2018 16:16:54 [INFO] Downloading: http://mavenrepo.openmrs.org/nexus/content/repositories/snapshots/org/openmrs/web/openmrs-web/maven-metadata.xml
14-Jun-2018 16:16:54 [INFO] Downloaded: http://mavenrepo.openmrs.org/nexus/content/repositories/snapshots/org/openmrs/web/openmrs-web/maven-metadata.xml (2 KB at 5.9 KB/sec)
14-Jun-2018 16:16:54 [INFO] Uploading: http://mavenrepo.openmrs.org/nexus/content/repositories/snapshots/org/openmrs/web/openmrs-web/1.11.10-SNAPSHOT/maven-metadata.xml
14-Jun-2018 16:16:55 [INFO] Uploaded: http://mavenrepo.openmrs.org/nexus/content/repositories/snapshots/org/openmrs/web/openmrs-web/1.11.10-SNAPSHOT/maven-metadata.xml (996 B at 3.0 KB/sec)
14-Jun-2018 16:16:55 [INFO] Uploading: http://mavenrepo.openmrs.org/nexus/content/repositories/snapshots/org/openmrs/web/openmrs-web/maven-metadata.xml
14-Jun-2018 16:16:55 [INFO] Uploaded: http://mavenrepo.openmrs.org/nexus/content/repositories/snapshots/org/openmrs/web/openmrs-web/maven-metadata.xml (2 KB at 3.3 KB/sec)
14-Jun-2018 16:16:55 [INFO] Uploading: http://mavenrepo.openmrs.org/nexus/content/repositories/snapshots/org/openmrs/web/openmrs-web/1.11.10-SNAPSHOT/openmrs-web-1.11.10-20180614.161652-2-tests.jar
14-Jun-2018 16:16:55 [INFO] Uploaded: http://mavenrepo.openmrs.org/nexus/content/repositories/snapshots/org/openmrs/web/openmrs-web/1.11.10-SNAPSHOT/openmrs-web-1.11.10-20180614.161652-2-tests.jar (193 KB at 436.6 KB/sec)
14-Jun-2018 16:16:55 [INFO] Uploading: http://mavenrepo.openmrs.org/nexus/content/repositories/snapshots/org/openmrs/web/openmrs-web/1.11.10-SNAPSHOT/maven-metadata.xml
14-Jun-2018 16:16:56 [INFO] Uploaded: http://mavenrepo.openmrs.org/nexus/content/repositories/snapshots/org/openmrs/web/openmrs-web/1.11.10-SNAPSHOT/maven-metadata.xml (996 B at 3.0 KB/sec)
14-Jun-2018 16:16:56 [INFO]                                                                         
14-Jun-2018 16:16:56 [INFO] ------------------------------------------------------------------------
14-Jun-2018 16:16:56 [INFO] Building openmrs-webapp 1.11.10-SNAPSHOT
14-Jun-2018 16:16:56 [INFO] ------------------------------------------------------------------------
14-Jun-2018 16:16:56 [INFO]
14-Jun-2018 16:16:56 [INFO] --- maven-clean-plugin:2.5:clean (default-clean) @ openmrs-webapp ---
14-Jun-2018 16:16:56 [INFO]
14-Jun-2018 16:16:56 [INFO] --- buildnumber-maven-plugin:1.1:create (default) @ openmrs-webapp ---
14-Jun-2018 16:16:56 [INFO]
14-Jun-2018 16:16:56 [INFO] --- build-helper-maven-plugin:1.5:parse-version (parse-version) @ openmrs-webapp ---
14-Jun-2018 16:16:56 [INFO]
14-Jun-2018 16:16:56 [INFO] --- maven-resources-plugin:2.4:resources (default-resources) @ openmrs-webapp ---
14-Jun-2018 16:16:56 [INFO] Using 'UTF-8' encoding to copy filtered resources.
14-Jun-2018 16:16:56 [INFO] Copying 7 resources
14-Jun-2018 16:16:56 [INFO] Copying 1 resource to ../jetty
14-Jun-2018 16:16:56 [INFO]
14-Jun-2018 16:16:56 [INFO] --- maven-antrun-plugin:1.4:run (default) @ openmrs-webapp ---
14-Jun-2018 16:16:56 project.artifactId
14-Jun-2018 16:16:56 [INFO] Executing tasks
14-Jun-2018 16:16:56     [unzip] Expanding: /home/bamboo-agent/bamboo-agent/xml-data/build-dir/TRUNK-OC1-JOB1/webapp/src/main/resources/liquibase-demo-data.zip into /home/bamboo-agent/bamboo-agent/xml-data/build-dir/TRUNK-OC1-JOB1/webapp/target/classes
14-Jun-2018 16:16:56 [INFO] Executed tasks
14-Jun-2018 16:16:56 [INFO]
14-Jun-2018 16:16:56 [INFO] --- maven-compiler-plugin:2.1:compile (default-compile) @ openmrs-webapp ---
14-Jun-2018 16:16:56 [INFO] No sources to compile
14-Jun-2018 16:16:56 [INFO]
14-Jun-2018 16:16:56 [INFO] --- maven-resources-plugin:2.4:testResources (default-testResources) @ openmrs-webapp ---
14-Jun-2018 16:16:56 [INFO] Using 'UTF-8' encoding to copy filtered resources.
14-Jun-2018 16:16:56 [INFO] Copying 1 resource
14-Jun-2018 16:16:56 [INFO]
14-Jun-2018 16:16:56 [INFO] --- maven-compiler-plugin:2.1:testCompile (default-testCompile) @ openmrs-webapp ---
14-Jun-2018 16:16:56 [INFO] Compiling 3 source files to /home/bamboo-agent/bamboo-agent/xml-data/build-dir/TRUNK-OC1-JOB1/webapp/target/test-classes
14-Jun-2018 16:16:57 [INFO]
14-Jun-2018 16:16:57 [INFO] --- maven-surefire-plugin:2.5:test (default-test) @ openmrs-webapp ---
14-Jun-2018 16:16:57 [INFO] Surefire report directory: /home/bamboo-agent/bamboo-agent/xml-data/build-dir/TRUNK-OC1-JOB1/webapp/target/surefire-reports
14-Jun-2018 16:16:57
14-Jun-2018 16:16:57 -------------------------------------------------------
14-Jun-2018 16:16:57 T E S T S
14-Jun-2018 16:16:57 -------------------------------------------------------
14-Jun-2018 16:16:57 Running org.openmrs.MessagePropertiesFilesTest
14-Jun-2018 16:16:58 Tests run: 13, Failures: 0, Errors: 0, Skipped: 0, Time elapsed: 0.619 sec
14-Jun-2018 16:16:58
14-Jun-2018 16:16:58 Results :
14-Jun-2018 16:16:58
14-Jun-2018 16:16:58 Tests run: 13, Failures: 0, Errors: 0, Skipped: 0
14-Jun-2018 16:16:58
14-Jun-2018 16:16:58 [INFO]
14-Jun-2018 16:16:58 [INFO] --- maven-war-plugin:2.4:war (default-war) @ openmrs-webapp ---
14-Jun-2018 16:16:58 [INFO] Packaging webapp
14-Jun-2018 16:16:58 [INFO] Assembling webapp [openmrs-webapp] in [/home/bamboo-agent/bamboo-agent/xml-data/build-dir/TRUNK-OC1-JOB1/webapp/target/openmrs]
14-Jun-2018 16:16:58 [INFO] Processing war project
14-Jun-2018 16:16:58 [INFO] Copying webapp webResources [/home/bamboo-agent/bamboo-agent/xml-data/build-dir/TRUNK-OC1-JOB1/webapp/src/main/webapp] to [/home/bamboo-agent/bamboo-agent/xml-data/build-dir/TRUNK-OC1-JOB1/webapp/target/openmrs]
14-Jun-2018 16:16:58 [INFO] Copying webapp resources [/home/bamboo-agent/bamboo-agent/xml-data/build-dir/TRUNK-OC1-JOB1/webapp/src/main/webapp]
14-Jun-2018 16:16:58 [INFO] Webapp assembled in [517 msecs]
14-Jun-2018 16:16:59 [INFO] Building war: /home/bamboo-agent/bamboo-agent/xml-data/build-dir/TRUNK-OC1-JOB1/webapp/target/openmrs.war
14-Jun-2018 16:17:01 [INFO]
14-Jun-2018 16:17:01 [INFO] --- maven-jar-plugin:2.3.2:test-jar (default) @ openmrs-webapp ---
14-Jun-2018 16:17:01 [INFO] Building jar: /home/bamboo-agent/bamboo-agent/xml-data/build-dir/TRUNK-OC1-JOB1/webapp/target/openmrs-tests.jar
14-Jun-2018 16:17:01 [INFO]
14-Jun-2018 16:17:01 [INFO] --- license-maven-plugin:2.6:check (default) @ openmrs-webapp ---
14-Jun-2018 16:17:01 [INFO] Checking licenses...
14-Jun-2018 16:17:01 [INFO]
14-Jun-2018 16:17:01 [INFO] --- animal-sniffer-maven-plugin:1.14:check (check-java-version) @ openmrs-webapp ---
14-Jun-2018 16:17:01 [INFO] Checking unresolved references to org.codehaus.mojo.signature:java16:1.1
14-Jun-2018 16:17:03 [INFO]
14-Jun-2018 16:17:03 [INFO] --- maven-install-plugin:2.4:install (default-install) @ openmrs-webapp ---
14-Jun-2018 16:17:03 [INFO] Installing /home/bamboo-agent/bamboo-agent/xml-data/build-dir/TRUNK-OC1-JOB1/webapp/target/openmrs.war to /home/bamboo-agent/.m2/repository/org/openmrs/web/openmrs-webapp/1.11.10-SNAPSHOT/openmrs-webapp-1.11.10-SNAPSHOT.war
14-Jun-2018 16:17:03 [INFO] Installing /home/bamboo-agent/bamboo-agent/xml-data/build-dir/TRUNK-OC1-JOB1/webapp/pom.xml to /home/bamboo-agent/.m2/repository/org/openmrs/web/openmrs-webapp/1.11.10-SNAPSHOT/openmrs-webapp-1.11.10-SNAPSHOT.pom
14-Jun-2018 16:17:03 [INFO] Installing /home/bamboo-agent/bamboo-agent/xml-data/build-dir/TRUNK-OC1-JOB1/webapp/target/openmrs-tests.jar to /home/bamboo-agent/.m2/repository/org/openmrs/web/openmrs-webapp/1.11.10-SNAPSHOT/openmrs-webapp-1.11.10-SNAPSHOT-tests.jar
14-Jun-2018 16:17:03 [INFO]
14-Jun-2018 16:17:03 [INFO] --- maven-deploy-plugin:2.7:deploy (default-deploy) @ openmrs-webapp ---
14-Jun-2018 16:17:03 [INFO] Downloading: http://mavenrepo.openmrs.org/nexus/content/repositories/snapshots/org/openmrs/web/openmrs-webapp/1.11.10-SNAPSHOT/maven-metadata.xml
14-Jun-2018 16:17:04 [INFO] Downloaded: http://mavenrepo.openmrs.org/nexus/content/repositories/snapshots/org/openmrs/web/openmrs-webapp/1.11.10-SNAPSHOT/maven-metadata.xml (999 B at 4.1 KB/sec)
14-Jun-2018 16:17:04 [INFO] Uploading: http://mavenrepo.openmrs.org/nexus/content/repositories/snapshots/org/openmrs/web/openmrs-webapp/1.11.10-SNAPSHOT/openmrs-webapp-1.11.10-20180614.161704-2.war
14-Jun-2018 16:17:09 [INFO] Uploaded: http://mavenrepo.openmrs.org/nexus/content/repositories/snapshots/org/openmrs/web/openmrs-webapp/1.11.10-SNAPSHOT/openmrs-webapp-1.11.10-20180614.161704-2.war (50877 KB at 9687.1 KB/sec)
14-Jun-2018 16:17:09 [INFO] Uploading: http://mavenrepo.openmrs.org/nexus/content/repositories/snapshots/org/openmrs/web/openmrs-webapp/1.11.10-SNAPSHOT/openmrs-webapp-1.11.10-20180614.161704-2.pom
14-Jun-2018 16:17:09 [INFO] Uploaded: http://mavenrepo.openmrs.org/nexus/content/repositories/snapshots/org/openmrs/web/openmrs-webapp/1.11.10-SNAPSHOT/openmrs-webapp-1.11.10-20180614.161704-2.pom (11 KB at 26.1 KB/sec)
14-Jun-2018 16:17:09 [INFO] Downloading: http://mavenrepo.openmrs.org/nexus/content/repositories/snapshots/org/openmrs/web/openmrs-webapp/maven-metadata.xml
14-Jun-2018 16:17:10 [INFO] Downloaded: http://mavenrepo.openmrs.org/nexus/content/repositories/snapshots/org/openmrs/web/openmrs-webapp/maven-metadata.xml (2 KB at 5.7 KB/sec)
14-Jun-2018 16:17:10 [INFO] Uploading: http://mavenrepo.openmrs.org/nexus/content/repositories/snapshots/org/openmrs/web/openmrs-webapp/1.11.10-SNAPSHOT/maven-metadata.xml
14-Jun-2018 16:17:10 [INFO] Uploaded: http://mavenrepo.openmrs.org/nexus/content/repositories/snapshots/org/openmrs/web/openmrs-webapp/1.11.10-SNAPSHOT/maven-metadata.xml (999 B at 3.0 KB/sec)
14-Jun-2018 16:17:10 [INFO] Uploading: http://mavenrepo.openmrs.org/nexus/content/repositories/snapshots/org/openmrs/web/openmrs-webapp/maven-metadata.xml
14-Jun-2018 16:17:10 [INFO] Uploaded: http://mavenrepo.openmrs.org/nexus/content/repositories/snapshots/org/openmrs/web/openmrs-webapp/maven-metadata.xml (2 KB at 3.0 KB/sec)
14-Jun-2018 16:17:10 [INFO] Uploading: http://mavenrepo.openmrs.org/nexus/content/repositories/snapshots/org/openmrs/web/openmrs-webapp/1.11.10-SNAPSHOT/openmrs-webapp-1.11.10-20180614.161704-2-tests.jar
14-Jun-2018 16:17:11 [INFO] Uploaded: http://mavenrepo.openmrs.org/nexus/content/repositories/snapshots/org/openmrs/web/openmrs-webapp/1.11.10-SNAPSHOT/openmrs-webapp-1.11.10-20180614.161704-2-tests.jar (9 KB at 20.5 KB/sec)
14-Jun-2018 16:17:11 [INFO] Uploading: http://mavenrepo.openmrs.org/nexus/content/repositories/snapshots/org/openmrs/web/openmrs-webapp/1.11.10-SNAPSHOT/maven-metadata.xml
14-Jun-2018 16:17:11 [INFO] Uploaded: http://mavenrepo.openmrs.org/nexus/content/repositories/snapshots/org/openmrs/web/openmrs-webapp/1.11.10-SNAPSHOT/maven-metadata.xml (999 B at 3.0 KB/sec)
14-Jun-2018 16:17:11 [INFO] ------------------------------------------------------------------------
14-Jun-2018 16:17:11 [INFO] Reactor Summary:
14-Jun-2018 16:17:11 [INFO]
14-Jun-2018 16:17:11 [INFO] OpenMRS ............................................ SUCCESS [  6.814 s]
14-Jun-2018 16:17:11 [INFO] openmrs-tools ...................................... SUCCESS [  4.555 s]
14-Jun-2018 16:17:11 [INFO] openmrs-test ....................................... SUCCESS [  3.813 s]
14-Jun-2018 16:17:11 [INFO] openmrs-api ........................................ SUCCESS [02:11 min]
14-Jun-2018 16:17:11 [INFO] openmrs-web ........................................ SUCCESS [ 52.698 s]
14-Jun-2018 16:17:11 [INFO] openmrs-webapp ..................................... SUCCESS [ 15.346 s]
14-Jun-2018 16:17:11 [INFO] ------------------------------------------------------------------------
14-Jun-2018 16:17:11 [INFO] BUILD SUCCESS
14-Jun-2018 16:17:11 [INFO] ------------------------------------------------------------------------
14-Jun-2018 16:17:11 [INFO] Total time: 03:34 min
14-Jun-2018 16:17:11 [INFO] Finished at: 2018-06-14T16:17:11+00:00
14-Jun-2018 16:17:11 [INFO] Final Memory: 85M/441M
14-Jun-2018 16:17:11 [INFO] ------------------------------------------------------------------------
14-Jun-2018 16:17:11 Parsing test results under /home/bamboo-agent/bamboo-agent/xml-data/build-dir/TRUNK-OC1-JOB1...
14-Jun-2018 16:17:12 Finished task 'Maven 3.x' with result: Success
14-Jun-2018 16:17:12 Running post build plugin 'Docker Container Cleanup'
14-Jun-2018 16:17:12 Running post build plugin 'NCover Results Collector'
14-Jun-2018 16:17:12 Running post build plugin 'Clover Results Collector'
14-Jun-2018 16:17:12 Running post build plugin 'Sauce OnDemand Post Runner'
14-Jun-2018 16:17:12 Running post build plugin 'npm Cache Cleanup'
14-Jun-2018 16:17:12 Running post build plugin 'Artifact Copier'
14-Jun-2018 16:17:12 Publishing an artifact: openmrs 1.11 war
14-Jun-2018 16:17:14 Finished publishing of artifact Shared artifact: [openmrs 1.11 war], pattern: [**/openmrs.war] anchored at: [webapp/target] in 2.172 s
14-Jun-2018 16:17:14 Publishing an artifact: openmrs 1.11 api jar
14-Jun-2018 16:17:15 Finished publishing of artifact Shared artifact: [openmrs 1.11 api jar], pattern: [**/openmrs-api*.jar] anchored at: [webapp/target/openmrs/WEB-INF/lib] in 1.195 s
14-Jun-2018 16:17:15 Finalising the build...
14-Jun-2018 16:17:15 Stopping timer.
14-Jun-2018 16:17:15 Build TRUNK-OC1-JOB1-378 completed.
14-Jun-2018 16:17:16 Running on server: post build plugin 'NCover Results Collector'
14-Jun-2018 16:17:16 Running on server: post build plugin 'Build Hanging Detection Configuration'
14-Jun-2018 16:17:16 Running on server: post build plugin 'Clover Delta Calculator'
14-Jun-2018 16:17:16 Running on server: post build plugin 'Maven Dependencies Postprocessor'
14-Jun-2018 16:17:16 All post build plugins have finished
14-Jun-2018 16:17:16 Generating build results summary...
14-Jun-2018 16:17:18 Saving build results to disk...
14-Jun-2018 16:17:18 Logging substituted variables...
14-Jun-2018 16:17:18 Indexing build results...
14-Jun-2018 16:17:18 Finished building TRUNK-OC1-JOB1-378.