Plan for OpenMRS Core 1.12.x

Build: #81 failed Changes by Rafal Korytkowski

Stages & jobs

  1. Build and Test

  2. Deploy

  3. Release

    Requires a user to start manually

Build result summary

Details

Completed
Duration
7 minutes
Labels
None
Revisions
Git
1554b9f2e2484828b57c8f8ac46c7ac15ea1fb3a 1554b9f2e2484828b57c8f8ac46c7ac15ea1fb3a
Release scripts
bb61e06483cd415a55b72cceac8d10ad00ee4e8a bb61e06483cd415a55b72cceac8d10ad00ee4e8a
Total tests
3103
Fixed in
#82 (Changes by Rafal Korytkowski)

Tests

Responsible

Code commits

Git
Author Commit Message Commit date
Rafal Korytkowski Rafal Korytkowski 1554b9f2e2484828b57c8f8ac46c7ac15ea1fb3a 1554b9f2e2484828b57c8f8ac46c7ac15ea1fb3a TRUNK-5071 Fix performance of get concepts by mapping

Tests

New test failures 5
Status Test View job Duration
Collapse Failed ConceptServiceTest saveConcept_shouldCreateANewConceptNameWhenTheOldNameIsChanged History
Build and Test < 1 sec
java.lang.NullPointerException
	at org.openmrs.api.ConceptServiceTest.saveConcept_shouldCreateANewConceptNameWhenTheOldNameIsChanged(ConceptServiceTest.java:1392)
	at sun.reflect.NativeMethodAccessorImpl.invoke0(Native Method)
	at sun.reflect.NativeMethodAccessorImpl.invoke(NativeMethodAccessorImpl.java:57)
	at sun.reflect.DelegatingMethodAccessorImpl.invoke(DelegatingMethodAccessorImpl.java:43)
	at java.lang.reflect.Method.invoke(Method.java:606)
	at org.junit.runners.model.FrameworkMethod$1.runReflectiveCall(FrameworkMethod.java:47)
	at org.junit.internal.runners.model.ReflectiveCallable.run(ReflectiveCallable.java:12)
(31 more lines...)
Collapse Failed ConceptServiceTest saveConcept_shouldVoidTheConceptNameIfTheTextOfTheNameHasChanged History
Build and Test < 1 sec
java.lang.NullPointerException
	at org.openmrs.api.ConceptServiceTest.saveConcept_shouldVoidTheConceptNameIfTheTextOfTheNameHasChanged(ConceptServiceTest.java:1424)
	at sun.reflect.NativeMethodAccessorImpl.invoke0(Native Method)
	at sun.reflect.NativeMethodAccessorImpl.invoke(NativeMethodAccessorImpl.java:57)
	at sun.reflect.DelegatingMethodAccessorImpl.invoke(DelegatingMethodAccessorImpl.java:43)
	at java.lang.reflect.Method.invoke(Method.java:606)
	at org.junit.runners.model.FrameworkMethod$1.runReflectiveCall(FrameworkMethod.java:47)
	at org.junit.internal.runners.model.ReflectiveCallable.run(ReflectiveCallable.java:12)
(31 more lines...)
Collapse Failed ConceptServiceTest getConcepts_shouldReturnPreferredNamesHigher History
Build and Test < 1 sec
java.lang.NullPointerException
	at org.openmrs.api.ConceptServiceTest.getConcepts_shouldReturnPreferredNamesHigher(ConceptServiceTest.java:3268)
	at sun.reflect.NativeMethodAccessorImpl.invoke0(Native Method)
	at sun.reflect.NativeMethodAccessorImpl.invoke(NativeMethodAccessorImpl.java:57)
	at sun.reflect.DelegatingMethodAccessorImpl.invoke(DelegatingMethodAccessorImpl.java:43)
	at java.lang.reflect.Method.invoke(Method.java:606)
	at org.junit.runners.model.FrameworkMethod$1.runReflectiveCall(FrameworkMethod.java:47)
	at org.junit.internal.runners.model.ReflectiveCallable.run(ReflectiveCallable.java:12)
(31 more lines...)
Collapse Failed ConceptServiceTest purgeConcept_shouldFailIfAnyOfTheConceptNamesOfTheConceptIsBeingUsedByAnObs History
Build and Test < 1 sec
java.lang.Exception: Unexpected exception, expected<org.openmrs.api.ConceptNameInUseException> but was<java.lang.AssertionError>
	at org.junit.internal.runners.statements.ExpectException.evaluate(ExpectException.java:28)
	at org.junit.internal.runners.statements.RunBefores.evaluate(RunBefores.java:26)
	at org.springframework.test.context.junit4.statements.RunBeforeTestMethodCallbacks.evaluate(RunBeforeTestMethodCallbacks.java:74)
	at org.junit.internal.runners.statements.RunAfters.evaluate(RunAfters.java:27)
	at org.springframework.test.context.junit4.statements.RunAfterTestMethodCallbacks.evaluate(RunAfterTestMethodCallbacks.java:83)
	at org.junit.rules.ExpectedException$ExpectedExceptionStatement.evaluate(ExpectedException.java:168)
	at org.junit.rules.RunRules.evaluate(RunRules.java:20)
(39 more lines...)
Collapse Failed HibernateConceptDAOTest getDrugs_shouldReturnDrugIf_EitherDrugNameIsUpperOrLowerCase History
Build and Test < 1 sec
java.lang.AssertionError: expected:<1> but was:<0>
	at org.junit.Assert.fail(Assert.java:88)
	at org.junit.Assert.failNotEquals(Assert.java:743)
	at org.junit.Assert.assertEquals(Assert.java:118)
	at org.junit.Assert.assertEquals(Assert.java:555)
	at org.junit.Assert.assertEquals(Assert.java:542)
	at org.openmrs.api.db.hibernate.HibernateConceptDAOTest.getDrugs_shouldReturnDrugIf_EitherDrugNameIsUpperOrLowerCase(HibernateConceptDAOTest.java:86)
	at sun.reflect.NativeMethodAccessorImpl.invoke0(Native Method)
(34 more lines...)

Jira issues

IssueDescriptionStatus
Unknown Issue TypeTRUNK-5071Could not obtain issue details from Jira